brooklyn-dev mailing list archives

Site index · List index
Message view « Date » · « Thread »
Top « Date » · « Thread »
From Apache Jenkins Server <jenk...@builds.apache.org>
Subject Build failed in Jenkins: incubator-brooklyn-master-build #716
Date Thu, 07 Jan 2016 10:16:15 GMT
See <https://builds.apache.org/job/incubator-brooklyn-master-build/716/changes>

Changes:

[svetoslav.neykov] Fix docs typo

------------------------------------------
[...truncated 17264 lines...]
2016-01-07 10:15:51,100 INFO  TESTNG PASSED: "Surefire test" - org.apache.brooklyn.util.core.internal.TypeCoercionsTest.testKeyEqualsOrColonValueWithBracesStringToMapCoercion()
finished in 1 ms
2016-01-07 10:15:51,100 INFO  TESTNG INVOKING: "Surefire test" - org.apache.brooklyn.util.core.internal.TypeCoercionsTest.testKeyEqualsOrColonValueWithoutBracesStringToMapCoercion()
2016-01-07 10:15:51,101 INFO  TESTNG PASSED: "Surefire test" - org.apache.brooklyn.util.core.internal.TypeCoercionsTest.testKeyEqualsOrColonValueWithoutBracesStringToMapCoercion()
finished in 1 ms
2016-01-07 10:15:51,101 INFO  TESTNG INVOKING: "Surefire test" - org.apache.brooklyn.util.core.internal.TypeCoercionsTest.testKeyEqualsValueStringToMapCoercion()
2016-01-07 10:15:51,102 INFO  TESTNG PASSED: "Surefire test" - org.apache.brooklyn.util.core.internal.TypeCoercionsTest.testKeyEqualsValueStringToMapCoercion()
finished in 1 ms
2016-01-07 10:15:51,102 INFO  TESTNG INVOKING: "Surefire test" - org.apache.brooklyn.util.core.internal.TypeCoercionsTest.testListEntryCoercion()
2016-01-07 10:15:51,103 INFO  TESTNG PASSED: "Surefire test" - org.apache.brooklyn.util.core.internal.TypeCoercionsTest.testListEntryCoercion()
finished in 1 ms
2016-01-07 10:15:51,103 INFO  TESTNG INVOKING: "Surefire test" - org.apache.brooklyn.util.core.internal.TypeCoercionsTest.testListEntryToCollectionCoercion()
2016-01-07 10:15:51,104 INFO  TESTNG PASSED: "Surefire test" - org.apache.brooklyn.util.core.internal.TypeCoercionsTest.testListEntryToCollectionCoercion()
finished in 1 ms
2016-01-07 10:15:51,105 INFO  TESTNG INVOKING: "Surefire test" - org.apache.brooklyn.util.core.internal.TypeCoercionsTest.testListEntryToSetCoercion()
2016-01-07 10:15:51,105 INFO  TESTNG PASSED: "Surefire test" - org.apache.brooklyn.util.core.internal.TypeCoercionsTest.testListEntryToSetCoercion()
finished in 1 ms
2016-01-07 10:15:51,106 INFO  TESTNG INVOKING: "Surefire test" - org.apache.brooklyn.util.core.internal.TypeCoercionsTest.testListToSetCoercion()
2016-01-07 10:15:51,106 INFO  TESTNG PASSED: "Surefire test" - org.apache.brooklyn.util.core.internal.TypeCoercionsTest.testListToSetCoercion()
finished in 1 ms
2016-01-07 10:15:51,106 INFO  TESTNG INVOKING: "Surefire test" - org.apache.brooklyn.util.core.internal.TypeCoercionsTest.testMapKeyCoercion()
2016-01-07 10:15:51,107 INFO  TESTNG PASSED: "Surefire test" - org.apache.brooklyn.util.core.internal.TypeCoercionsTest.testMapKeyCoercion()
finished in 1 ms
2016-01-07 10:15:51,108 INFO  TESTNG INVOKING: "Surefire test" - org.apache.brooklyn.util.core.internal.TypeCoercionsTest.testMapValueCoercion()
2016-01-07 10:15:51,108 INFO  TESTNG PASSED: "Surefire test" - org.apache.brooklyn.util.core.internal.TypeCoercionsTest.testMapValueCoercion()
finished in 0 ms
2016-01-07 10:15:51,109 INFO  TESTNG INVOKING: "Surefire test" - org.apache.brooklyn.util.core.internal.TypeCoercionsTest.testSetToListCoercion()
2016-01-07 10:15:51,109 INFO  TESTNG PASSED: "Surefire test" - org.apache.brooklyn.util.core.internal.TypeCoercionsTest.testSetToListCoercion()
finished in 1 ms
2016-01-07 10:15:51,110 INFO  TESTNG INVOKING: "Surefire test" - org.apache.brooklyn.util.core.internal.TypeCoercionsTest.testStringToListCoercion()
2016-01-07 10:15:51,110 INFO  TESTNG PASSED: "Surefire test" - org.apache.brooklyn.util.core.internal.TypeCoercionsTest.testStringToListCoercion()
finished in 1 ms
2016-01-07 10:15:51,110 INFO  TESTNG INVOKING: "Surefire test" - org.apache.brooklyn.util.core.internal.TypeCoercionsTest.testURItoStringCoercion()
2016-01-07 10:15:51,111 INFO  TESTNG PASSED: "Surefire test" - org.apache.brooklyn.util.core.internal.TypeCoercionsTest.testURItoStringCoercion()
finished in 1 ms
2016-01-07 10:15:51,112 INFO  TESTNG INVOKING: "Surefire test" - org.apache.brooklyn.util.core.internal.TypeCoercionsTest.testURLtoStringCoercion()
2016-01-07 10:15:51,113 INFO  TESTNG PASSED: "Surefire test" - org.apache.brooklyn.util.core.internal.TypeCoercionsTest.testURLtoStringCoercion()
finished in 1 ms
2016-01-07 10:15:51,485 INFO  TESTNG 
===============================================
    Surefire test
    Tests run: 1638, Failures: 2, Skips: 0
===============================================
2016-01-07 10:15:51,486 INFO  BrooklynLeakListener.onFinish attempting to terminate all extant
ManagementContexts: name=Surefire test; includedGroups=[]; excludedGroups=[Integration, Acceptance,
Live, Broken, WIP]; suiteName=Surefire suite; outDir=<https://builds.apache.org/job/incubator-brooklyn-master-build/ws/brooklyn-server/core/target/surefire-reports/Surefire>
suite: no org.apache.brooklyn.core.management.internal.LocalManagementContext available, so
skipped
SUREFIRE-859: [GC 525531K->322217K(759296K), 0.1332320 secs]
SUREFIRE-859: [GC 529065K->323653K(758272K), 0.1233920 secs]
Tests run: 1638, Failures: 2, Errors: 0, Skipped: 0, Time elapsed: 333.767 sec <<<
FAILURE! - in TestSuite
testAddAndRebindAndDeleteLocation(org.apache.brooklyn.core.mgmt.rebind.RebindCatalogItemTest)
 Time elapsed: 0.534 sec  <<< FAILURE!
java.lang.AssertionError: Sets differ: expected [com.example.ExampleApp:9.1.3] but got [com.example.ExampleApp:9.1.3,
sample_location:0.0.1]
	at org.testng.Assert.fail(Assert.java:94)
	at org.testng.Assert.assertEquals(Assert.java:806)
	at org.testng.Assert.assertEquals(Assert.java:784)
	at org.apache.brooklyn.core.mgmt.rebind.RebindTestFixture.assertCatalogsEqual(RebindTestFixture.java:290)
	at org.apache.brooklyn.core.mgmt.rebind.RebindCatalogItemTest.rebindAndAssertCatalogsAreEqual(RebindCatalogItemTest.java:283)
	at org.apache.brooklyn.core.mgmt.rebind.RebindCatalogItemTest.testAddAndRebindAndDeleteLocation(RebindCatalogItemTest.java:185)

testTransitionsThroughLifecycles(org.apache.brooklyn.entity.stock.BasicStartableTest)  Time
elapsed: 0.102 sec  <<< FAILURE!
java.lang.AssertionError: Expected=[starting, running, stopping, stopped], actual=[starting,
running, stopping]: Expected iterator returned more elements than the actual iterator.
	at org.testng.Assert.fail(Assert.java:94)
	at org.testng.Assert.assertEquals(Assert.java:606)
	at org.testng.Assert.assertEquals(Assert.java:643)
	at org.apache.brooklyn.entity.stock.BasicStartableTest.testTransitionsThroughLifecycles(BasicStartableTest.java:164)

2016-01-07 10:15:55,545 INFO  Brooklyn shutdown: stopping entities [TestEntityImpl{id=ZGQFpksh},
TestEntityImpl{id=WDsHHYRh}, BlockingEntityImpl{id=rhRFgBNd}]

Results :

Failed tests: 
  RebindCatalogItemTest.testAddAndRebindAndDeleteLocation:185->rebindAndAssertCatalogsAreEqual:283->RebindTestFixture.assertCatalogsEqual:290
Sets differ: expected [com.example.ExampleApp:9.1.3] but got [com.example.ExampleApp:9.1.3,
sample_location:0.0.1]
  BasicStartableTest.testTransitionsThroughLifecycles:164 Expected=[starting, running, stopping,
stopped], actual=[starting, running, stopping]: Expected iterator returned more elements than
the actual iterator.

Tests run: 1638, Failures: 2, Errors: 0, Skipped: 0

[JENKINS] Recording test results
[INFO] ------------------------------------------------------------------------
[INFO] Reactor Summary:
[INFO] 
[INFO] Brooklyn REST JavaScript Web GUI .................. SUCCESS [1:02.348s]
[INFO] Brooklyn Server Root .............................. SUCCESS [0.744s]
[INFO] Brooklyn Parent Project ........................... SUCCESS [5.024s]
[INFO] Brooklyn Test Support Utilities ................... SUCCESS [11.886s]
[INFO] Brooklyn Logback Includable Configuration ......... SUCCESS [2.798s]
[INFO] Brooklyn Common Utilities ......................... SUCCESS [31.971s]
[INFO] Brooklyn API ...................................... SUCCESS [4.749s]
[INFO] CAMP Server Parent Project ........................ SUCCESS [0.936s]
[INFO] CAMP Base ......................................... SUCCESS [6.768s]
[INFO] Brooklyn Test Support ............................. SUCCESS [4.086s]
[INFO] Brooklyn REST Swagger Apidoc Utilities ............ SUCCESS [27.400s]
[INFO] Brooklyn Logback Configuration .................... SUCCESS [2.104s]
[INFO] CAMP Server ....................................... SUCCESS [12.798s]
[INFO] Brooklyn OSGi Utils ............................... SUCCESS [5.113s]
[INFO] Brooklyn Felix Runtime ............................ SUCCESS [7.651s]
[INFO] Brooklyn Groovy Utilities ......................... SUCCESS [3.083s]
[INFO] Brooklyn Core ..................................... FAILURE [6:43.380s]
[INFO] Brooklyn Policies ................................. SKIPPED
[INFO] Brooklyn WinRM Software Entities .................. SKIPPED
[INFO] Brooklyn Secure JMXMP Agent ....................... SKIPPED
[INFO] Brooklyn JMX RMI Agent ............................ SKIPPED
[INFO] Brooklyn Jclouds Location Targets ................. SKIPPED
[INFO] Brooklyn Software Base ............................ SKIPPED
[INFO] Brooklyn CAMP REST API ............................ SKIPPED
[INFO] Brooklyn Hazelcast Storage ........................ SKIPPED
[INFO] Brooklyn REST API ................................. SKIPPED
[INFO] Brooklyn REST Server .............................. SKIPPED
[INFO] Brooklyn Launcher ................................. SKIPPED
[INFO] Brooklyn Command Line Interface ................... SKIPPED
[INFO] Brooklyn REST Client .............................. SKIPPED
[INFO] Brooklyn Test Framework ........................... SKIPPED
[INFO] Brooklyn Karaf .................................... SKIPPED
[INFO] Brooklyn Karaf Features ........................... SKIPPED
[INFO] Brooklyn Karaf Distro ............................. SKIPPED
[INFO] Brooklyn Karaf Shell Commands ..................... SKIPPED
[INFO] Brooklyn Karaf pax-exam itest ..................... SKIPPED
[INFO] Brooklyn Library Root ............................. SKIPPED
[INFO] Brooklyn Network Software Entities ................ SKIPPED
[INFO] Brooklyn OSGi Software Entities ................... SKIPPED
[INFO] Brooklyn Database Software Entities ............... SKIPPED
[INFO] Brooklyn Web App Software Entities ................ SKIPPED
[INFO] Brooklyn Messaging Software Entities .............. SKIPPED
[INFO] Brooklyn NoSQL Data Store Software Entities ....... SKIPPED
[INFO] Brooklyn Monitoring Software Entities ............. SKIPPED
[INFO] Brooklyn QA ....................................... SKIPPED
[INFO] Brooklyn Examples Aggregator Project .............. SKIPPED
[INFO] Brooklyn Examples Aggregator Project - Webapps .... SKIPPED
[INFO] hello-world-webapp Maven Webapp ................... SKIPPED
[INFO] hello-world-sql-webapp Maven Webapp ............... SKIPPED
[INFO] Brooklyn Simple Web Cluster Example ............... SKIPPED
[INFO] Brooklyn Global Web Fabric Example ................ SKIPPED
[INFO] Brooklyn Simple Messaging Publish-Subscribe Example  SKIPPED
[INFO] Brooklyn NoSQL Cluster Examples ................... SKIPPED
[INFO] Brooklyn Downstream Project Parent ................ SKIPPED
[INFO] Brooklyn Dist Root ................................ SKIPPED
[INFO] Brooklyn All Things ............................... SKIPPED
[INFO] Brooklyn Distribution ............................. SKIPPED
[INFO] Brooklyn Quick-Start Project Archetype ............ SKIPPED
[INFO] Brooklyn Root ..................................... SKIPPED
[INFO] ------------------------------------------------------------------------
[INFO] BUILD FAILURE
[INFO] ------------------------------------------------------------------------
[INFO] Total time: 10:09.771s
[INFO] Finished at: Thu Jan 07 10:15:57 UTC 2016
[INFO] Final Memory: 89M/496M
[INFO] ------------------------------------------------------------------------
Waiting for Jenkins to finish collecting data[ERROR] Failed to execute goal org.apache.maven.plugins:maven-surefire-plugin:2.18.1:test
(default-test) on project brooklyn-core: There are test failures.
[ERROR] 
[ERROR] Please refer to <https://builds.apache.org/job/incubator-brooklyn-master-build/ws/brooklyn-server/core/target/surefire-reports>
for the individual test results.
[ERROR] -> [Help 1]
[ERROR] 
[ERROR] To see the full stack trace of the errors, re-run Maven with the -e switch.
[ERROR] Re-run Maven using the -X switch to enable full debug logging.
[ERROR] 
[ERROR] For more information about the errors and possible solutions, please read the following
articles:
[ERROR] [Help 1] http://cwiki.apache.org/confluence/display/MAVEN/MojoFailureException
[ERROR] 
[ERROR] After correcting the problems, you can resume the build with the command
[ERROR]   mvn <goals> -rf :brooklyn-core

[JENKINS] Archiving <https://builds.apache.org/job/incubator-brooklyn-master-build/ws/brooklyn-server/policy/pom.xml>
to org.apache.brooklyn/brooklyn-policy/0.9.0-SNAPSHOT/brooklyn-policy-0.9.0-SNAPSHOT.pom
[JENKINS] Archiving <https://builds.apache.org/job/incubator-brooklyn-master-build/ws/brooklyn-library/software/osgi/pom.xml>
to org.apache.brooklyn/brooklyn-software-osgi/0.9.0-SNAPSHOT/brooklyn-software-osgi-0.9.0-SNAPSHOT.pom
[JENKINS] Archiving <https://builds.apache.org/job/incubator-brooklyn-master-build/ws/brooklyn-library/examples/simple-messaging-pubsub/pom.xml>
to org.apache.brooklyn.example/brooklyn-example-simple-messaging-pubsub/0.9.0-SNAPSHOT/brooklyn-example-simple-messaging-pubsub-0.9.0-SNAPSHOT.pom
[JENKINS] Archiving <https://builds.apache.org/job/incubator-brooklyn-master-build/ws/brooklyn-server/pom.xml>
to org.apache.brooklyn/brooklyn-server/0.9.0-SNAPSHOT/brooklyn-server-0.9.0-SNAPSHOT.pom
[JENKINS] Archiving <https://builds.apache.org/job/incubator-brooklyn-master-build/ws/brooklyn-library/examples/webapps/hello-world-webapp/pom.xml>
to org.apache.brooklyn.example/brooklyn-example-hello-world-webapp/0.9.0-SNAPSHOT/brooklyn-example-hello-world-webapp-0.9.0-SNAPSHOT.pom
[JENKINS] Archiving <https://builds.apache.org/job/incubator-brooklyn-master-build/ws/brooklyn-server/core/pom.xml>
to org.apache.brooklyn/brooklyn-core/0.9.0-SNAPSHOT/brooklyn-core-0.9.0-SNAPSHOT.pom
[JENKINS] Archiving <https://builds.apache.org/job/incubator-brooklyn-master-build/ws/brooklyn-ui/pom.xml>
to org.apache.brooklyn/brooklyn-jsgui/0.9.0-SNAPSHOT/brooklyn-jsgui-0.9.0-SNAPSHOT.pom
[JENKINS] Archiving <https://builds.apache.org/job/incubator-brooklyn-master-build/ws/brooklyn-ui/target/brooklyn-jsgui-0.9.0-SNAPSHOT.war>
to org.apache.brooklyn/brooklyn-jsgui/0.9.0-SNAPSHOT/brooklyn-jsgui-0.9.0-SNAPSHOT.war
Compressed 1.89 MB of artifacts by 29.7% relative to #715
[JENKINS] Archiving <https://builds.apache.org/job/incubator-brooklyn-master-build/ws/brooklyn-server/utils/common/pom.xml>
to org.apache.brooklyn/brooklyn-utils-common/0.9.0-SNAPSHOT/brooklyn-utils-common-0.9.0-SNAPSHOT.pom
[JENKINS] Archiving <https://builds.apache.org/job/incubator-brooklyn-master-build/ws/brooklyn-server/utils/common/target/brooklyn-utils-common-0.9.0-SNAPSHOT.jar>
to org.apache.brooklyn/brooklyn-utils-common/0.9.0-SNAPSHOT/brooklyn-utils-common-0.9.0-SNAPSHOT.jar
[JENKINS] Archiving <https://builds.apache.org/job/incubator-brooklyn-master-build/ws/brooklyn-server/utils/common/target/brooklyn-utils-common-0.9.0-SNAPSHOT-tests.jar>
to org.apache.brooklyn/brooklyn-utils-common/0.9.0-SNAPSHOT/brooklyn-utils-common-0.9.0-SNAPSHOT-tests.jar
[JENKINS] Archiving <https://builds.apache.org/job/incubator-brooklyn-master-build/ws/brooklyn-server/utils/common/target/brooklyn-utils-common-0.9.0-SNAPSHOT-sources.jar>
to org.apache.brooklyn/brooklyn-utils-common/0.9.0-SNAPSHOT/brooklyn-utils-common-0.9.0-SNAPSHOT-sources.jar
[JENKINS] Archiving <https://builds.apache.org/job/incubator-brooklyn-master-build/ws/brooklyn-server/utils/common/target/brooklyn-utils-common-0.9.0-SNAPSHOT-test-sources.jar>
to org.apache.brooklyn/brooklyn-utils-common/0.9.0-SNAPSHOT/brooklyn-utils-common-0.9.0-SNAPSHOT-test-sources.jar
[JENKINS] Archiving <https://builds.apache.org/job/incubator-brooklyn-master-build/ws/brooklyn-server/utils/groovy/pom.xml>
to org.apache.brooklyn/brooklyn-utils-groovy/0.9.0-SNAPSHOT/brooklyn-utils-groovy-0.9.0-SNAPSHOT.pom
[JENKINS] Archiving <https://builds.apache.org/job/incubator-brooklyn-master-build/ws/brooklyn-server/utils/groovy/target/brooklyn-utils-groovy-0.9.0-SNAPSHOT.jar>
to org.apache.brooklyn/brooklyn-utils-groovy/0.9.0-SNAPSHOT/brooklyn-utils-groovy-0.9.0-SNAPSHOT.jar
[JENKINS] Archiving <https://builds.apache.org/job/incubator-brooklyn-master-build/ws/brooklyn-server/utils/groovy/target/brooklyn-utils-groovy-0.9.0-SNAPSHOT-tests.jar>
to org.apache.brooklyn/brooklyn-utils-groovy/0.9.0-SNAPSHOT/brooklyn-utils-groovy-0.9.0-SNAPSHOT-tests.jar
[JENKINS] Archiving <https://builds.apache.org/job/incubator-brooklyn-master-build/ws/brooklyn-server/utils/groovy/target/brooklyn-utils-groovy-0.9.0-SNAPSHOT-sources.jar>
to org.apache.brooklyn/brooklyn-utils-groovy/0.9.0-SNAPSHOT/brooklyn-utils-groovy-0.9.0-SNAPSHOT-sources.jar
[JENKINS] Archiving <https://builds.apache.org/job/incubator-brooklyn-master-build/ws/brooklyn-server/utils/groovy/target/brooklyn-utils-groovy-0.9.0-SNAPSHOT-test-sources.jar>
to org.apache.brooklyn/brooklyn-utils-groovy/0.9.0-SNAPSHOT/brooklyn-utils-groovy-0.9.0-SNAPSHOT-test-sources.jar
[JENKINS] Archiving <https://builds.apache.org/job/incubator-brooklyn-master-build/ws/brooklyn-library/examples/simple-web-cluster/pom.xml>
to org.apache.brooklyn.example/brooklyn-example-simple-web-cluster/0.9.0-SNAPSHOT/brooklyn-example-simple-web-cluster-0.9.0-SNAPSHOT.pom
[JENKINS] Archiving <https://builds.apache.org/job/incubator-brooklyn-master-build/ws/brooklyn-server/locations/jclouds/pom.xml>
to org.apache.brooklyn/brooklyn-locations-jclouds/0.9.0-SNAPSHOT/brooklyn-locations-jclouds-0.9.0-SNAPSHOT.pom
[JENKINS] Archiving <https://builds.apache.org/job/incubator-brooklyn-master-build/ws/brooklyn-dist/downstream-parent/pom.xml>
to org.apache.brooklyn/brooklyn-downstream-parent/0.9.0-SNAPSHOT/brooklyn-downstream-parent-0.9.0-SNAPSHOT.pom
[JENKINS] Archiving <https://builds.apache.org/job/incubator-brooklyn-master-build/ws/brooklyn-library/software/database/pom.xml>
to org.apache.brooklyn/brooklyn-software-database/0.9.0-SNAPSHOT/brooklyn-software-database-0.9.0-SNAPSHOT.pom
[JENKINS] Archiving <https://builds.apache.org/job/incubator-brooklyn-master-build/ws/brooklyn-server/rest/rest-server/pom.xml>
to org.apache.brooklyn/brooklyn-rest-server/0.9.0-SNAPSHOT/brooklyn-rest-server-0.9.0-SNAPSHOT.pom
[JENKINS] Archiving <https://builds.apache.org/job/incubator-brooklyn-master-build/ws/brooklyn-library/qa/pom.xml>
to org.apache.brooklyn/brooklyn-qa/0.9.0-SNAPSHOT/brooklyn-qa-0.9.0-SNAPSHOT.pom
[JENKINS] Archiving <https://builds.apache.org/job/incubator-brooklyn-master-build/ws/brooklyn-server/rest/rest-client/pom.xml>
to org.apache.brooklyn/brooklyn-rest-client/0.9.0-SNAPSHOT/brooklyn-rest-client-0.9.0-SNAPSHOT.pom
[JENKINS] Archiving <https://builds.apache.org/job/incubator-brooklyn-master-build/ws/brooklyn-library/pom.xml>
to org.apache.brooklyn/brooklyn-library/0.9.0-SNAPSHOT/brooklyn-library-0.9.0-SNAPSHOT.pom
[JENKINS] Archiving <https://builds.apache.org/job/incubator-brooklyn-master-build/ws/brooklyn-server/utils/jmx/jmxmp-ssl-agent/pom.xml>
to org.apache.brooklyn/brooklyn-jmxmp-agent/0.9.0-SNAPSHOT/brooklyn-jmxmp-agent-0.9.0-SNAPSHOT.pom
[JENKINS] Archiving <https://builds.apache.org/job/incubator-brooklyn-master-build/ws/brooklyn-server/karaf/apache-brooklyn/pom.xml>
to org.apache.brooklyn/apache-brooklyn/0.9.0-SNAPSHOT/apache-brooklyn-0.9.0-SNAPSHOT.pom
[JENKINS] Archiving <https://builds.apache.org/job/incubator-brooklyn-master-build/ws/brooklyn-server/camp/camp-brooklyn/pom.xml>
to org.apache.brooklyn/brooklyn-camp/0.9.0-SNAPSHOT/brooklyn-camp-0.9.0-SNAPSHOT.pom
[JENKINS] Archiving <https://builds.apache.org/job/incubator-brooklyn-master-build/ws/brooklyn-server/utils/jmx/jmxrmi-agent/pom.xml>
to org.apache.brooklyn/brooklyn-jmxrmi-agent/0.9.0-SNAPSHOT/brooklyn-jmxrmi-agent-0.9.0-SNAPSHOT.pom
[JENKINS] Archiving <https://builds.apache.org/job/incubator-brooklyn-master-build/ws/brooklyn-library/examples/global-web-fabric/pom.xml>
to org.apache.brooklyn.example/brooklyn-example-global-web-fabric/0.9.0-SNAPSHOT/brooklyn-example-global-web-fabric-0.9.0-SNAPSHOT.pom
[JENKINS] Archiving <https://builds.apache.org/job/incubator-brooklyn-master-build/ws/brooklyn-dist/archetypes/quickstart/pom.xml>
to org.apache.brooklyn/brooklyn-archetype-quickstart/0.9.0-SNAPSHOT/brooklyn-archetype-quickstart-0.9.0-SNAPSHOT.pom
[JENKINS] Archiving <https://builds.apache.org/job/incubator-brooklyn-master-build/ws/brooklyn-library/software/nosql/pom.xml>
to org.apache.brooklyn/brooklyn-software-nosql/0.9.0-SNAPSHOT/brooklyn-software-nosql-0.9.0-SNAPSHOT.pom
[JENKINS] Archiving <https://builds.apache.org/job/incubator-brooklyn-master-build/ws/brooklyn-server/software/base/pom.xml>
to org.apache.brooklyn/brooklyn-software-base/0.9.0-SNAPSHOT/brooklyn-software-base-0.9.0-SNAPSHOT.pom
[JENKINS] Archiving <https://builds.apache.org/job/incubator-brooklyn-master-build/ws/brooklyn-library/examples/webapps/hello-world-sql/pom.xml>
to org.apache.brooklyn.example/brooklyn-example-hello-world-sql-webapp/0.9.0-SNAPSHOT/brooklyn-example-hello-world-sql-webapp-0.9.0-SNAPSHOT.pom
[JENKINS] Archiving <https://builds.apache.org/job/incubator-brooklyn-master-build/ws/brooklyn-server/logging/logback-includes/pom.xml>
to org.apache.brooklyn/brooklyn-logback-includes/0.9.0-SNAPSHOT/brooklyn-logback-includes-0.9.0-SNAPSHOT.pom
[JENKINS] Archiving <https://builds.apache.org/job/incubator-brooklyn-master-build/ws/brooklyn-server/logging/logback-includes/target/brooklyn-logback-includes-0.9.0-SNAPSHOT.jar>
to org.apache.brooklyn/brooklyn-logback-includes/0.9.0-SNAPSHOT/brooklyn-logback-includes-0.9.0-SNAPSHOT.jar
[JENKINS] Archiving <https://builds.apache.org/job/incubator-brooklyn-master-build/ws/brooklyn-server/logging/logback-includes/target/brooklyn-logback-includes-0.9.0-SNAPSHOT-sources.jar>
to org.apache.brooklyn/brooklyn-logback-includes/0.9.0-SNAPSHOT/brooklyn-logback-includes-0.9.0-SNAPSHOT-sources.jar
[JENKINS] Archiving <https://builds.apache.org/job/incubator-brooklyn-master-build/ws/brooklyn-server/logging/logback-includes/target/brooklyn-logback-includes-0.9.0-SNAPSHOT-test-sources.jar>
to org.apache.brooklyn/brooklyn-logback-includes/0.9.0-SNAPSHOT/brooklyn-logback-includes-0.9.0-SNAPSHOT-test-sources.jar
[JENKINS] Archiving <https://builds.apache.org/job/incubator-brooklyn-master-build/ws/pom.xml>
to org.apache.brooklyn/brooklyn/0.9.0-SNAPSHOT/brooklyn-0.9.0-SNAPSHOT.pom
[JENKINS] Archiving <https://builds.apache.org/job/incubator-brooklyn-master-build/ws/brooklyn-server/utils/test-support/pom.xml>
to org.apache.brooklyn/brooklyn-utils-test-support/0.9.0-SNAPSHOT/brooklyn-utils-test-support-0.9.0-SNAPSHOT.pom
[JENKINS] Archiving <https://builds.apache.org/job/incubator-brooklyn-master-build/ws/brooklyn-server/utils/test-support/target/brooklyn-utils-test-support-0.9.0-SNAPSHOT.jar>
to org.apache.brooklyn/brooklyn-utils-test-support/0.9.0-SNAPSHOT/brooklyn-utils-test-support-0.9.0-SNAPSHOT.jar
[JENKINS] Archiving <https://builds.apache.org/job/incubator-brooklyn-master-build/ws/brooklyn-server/utils/test-support/target/brooklyn-utils-test-support-0.9.0-SNAPSHOT-sources.jar>
to org.apache.brooklyn/brooklyn-utils-test-support/0.9.0-SNAPSHOT/brooklyn-utils-test-support-0.9.0-SNAPSHOT-sources.jar
[JENKINS] Archiving <https://builds.apache.org/job/incubator-brooklyn-master-build/ws/brooklyn-server/utils/test-support/target/brooklyn-utils-test-support-0.9.0-SNAPSHOT-test-sources.jar>
to org.apache.brooklyn/brooklyn-utils-test-support/0.9.0-SNAPSHOT/brooklyn-utils-test-support-0.9.0-SNAPSHOT-test-sources.jar
[JENKINS] Archiving <https://builds.apache.org/job/incubator-brooklyn-master-build/ws/brooklyn-library/software/monitoring/pom.xml>
to org.apache.brooklyn/brooklyn-software-monitoring/0.9.0-SNAPSHOT/brooklyn-software-monitoring-0.9.0-SNAPSHOT.pom
[JENKINS] Archiving <https://builds.apache.org/job/incubator-brooklyn-master-build/ws/brooklyn-server/test-framework/pom.xml>
to org.apache.brooklyn/brooklyn-test-framework/0.9.0-SNAPSHOT/brooklyn-test-framework-0.9.0-SNAPSHOT.pom
[JENKINS] Archiving <https://builds.apache.org/job/incubator-brooklyn-master-build/ws/brooklyn-server/storage/hazelcast/pom.xml>
to org.apache.brooklyn/brooklyn-storage-hazelcast/0.9.0-SNAPSHOT/brooklyn-storage-hazelcast-0.9.0-SNAPSHOT.pom
[JENKINS] Archiving <https://builds.apache.org/job/incubator-brooklyn-master-build/ws/brooklyn-server/rest/rest-api/pom.xml>
to org.apache.brooklyn/brooklyn-rest-api/0.9.0-SNAPSHOT/brooklyn-rest-api-0.9.0-SNAPSHOT.pom
[JENKINS] Archiving <https://builds.apache.org/job/incubator-brooklyn-master-build/ws/brooklyn-server/karaf/commands/pom.xml>
to org.apache.brooklyn/brooklyn-commands/0.9.0-SNAPSHOT/brooklyn-commands-0.9.0-SNAPSHOT.pom
[JENKINS] Archiving <https://builds.apache.org/job/incubator-brooklyn-master-build/ws/brooklyn-library/software/messaging/pom.xml>
to org.apache.brooklyn/brooklyn-software-messaging/0.9.0-SNAPSHOT/brooklyn-software-messaging-0.9.0-SNAPSHOT.pom
[JENKINS] Archiving <https://builds.apache.org/job/incubator-brooklyn-master-build/ws/brooklyn-server/utils/rt-osgi/pom.xml>
to org.apache.brooklyn/brooklyn-rt-osgi/0.9.0-SNAPSHOT/brooklyn-rt-osgi-0.9.0-SNAPSHOT.pom
[JENKINS] Archiving <https://builds.apache.org/job/incubator-brooklyn-master-build/ws/brooklyn-server/utils/rt-osgi/target/brooklyn-rt-osgi-0.9.0-SNAPSHOT.jar>
to org.apache.brooklyn/brooklyn-rt-osgi/0.9.0-SNAPSHOT/brooklyn-rt-osgi-0.9.0-SNAPSHOT.jar
[JENKINS] Archiving <https://builds.apache.org/job/incubator-brooklyn-master-build/ws/brooklyn-server/utils/rt-osgi/target/brooklyn-rt-osgi-0.9.0-SNAPSHOT-tests.jar>
to org.apache.brooklyn/brooklyn-rt-osgi/0.9.0-SNAPSHOT/brooklyn-rt-osgi-0.9.0-SNAPSHOT-tests.jar
[JENKINS] Archiving <https://builds.apache.org/job/incubator-brooklyn-master-build/ws/brooklyn-server/utils/rt-osgi/target/brooklyn-rt-osgi-0.9.0-SNAPSHOT-sources.jar>
to org.apache.brooklyn/brooklyn-rt-osgi/0.9.0-SNAPSHOT/brooklyn-rt-osgi-0.9.0-SNAPSHOT-sources.jar
[JENKINS] Archiving <https://builds.apache.org/job/incubator-brooklyn-master-build/ws/brooklyn-server/utils/rt-osgi/target/brooklyn-rt-osgi-0.9.0-SNAPSHOT-test-sources.jar>
to org.apache.brooklyn/brooklyn-rt-osgi/0.9.0-SNAPSHOT/brooklyn-rt-osgi-0.9.0-SNAPSHOT-test-sources.jar
[JENKINS] Archiving <https://builds.apache.org/job/incubator-brooklyn-master-build/ws/brooklyn-library/examples/simple-nosql-cluster/pom.xml>
to org.apache.brooklyn.example/brooklyn-example-simple-nosql-cluster/0.9.0-SNAPSHOT/brooklyn-example-simple-nosql-cluster-0.9.0-SNAPSHOT.pom
[JENKINS] Archiving <https://builds.apache.org/job/incubator-brooklyn-master-build/ws/brooklyn-server/logging/logback-xml/pom.xml>
to org.apache.brooklyn/brooklyn-logback-xml/0.9.0-SNAPSHOT/brooklyn-logback-xml-0.9.0-SNAPSHOT.pom
[JENKINS] Archiving <https://builds.apache.org/job/incubator-brooklyn-master-build/ws/brooklyn-server/logging/logback-xml/target/brooklyn-logback-xml-0.9.0-SNAPSHOT.jar>
to org.apache.brooklyn/brooklyn-logback-xml/0.9.0-SNAPSHOT/brooklyn-logback-xml-0.9.0-SNAPSHOT.jar
[JENKINS] Archiving <https://builds.apache.org/job/incubator-brooklyn-master-build/ws/brooklyn-server/logging/logback-xml/target/brooklyn-logback-xml-0.9.0-SNAPSHOT-sources.jar>
to org.apache.brooklyn/brooklyn-logback-xml/0.9.0-SNAPSHOT/brooklyn-logback-xml-0.9.0-SNAPSHOT-sources.jar
[JENKINS] Archiving <https://builds.apache.org/job/incubator-brooklyn-master-build/ws/brooklyn-server/logging/logback-xml/target/brooklyn-logback-xml-0.9.0-SNAPSHOT-test-sources.jar>
to org.apache.brooklyn/brooklyn-logback-xml/0.9.0-SNAPSHOT/brooklyn-logback-xml-0.9.0-SNAPSHOT-test-sources.jar
[JENKINS] Archiving <https://builds.apache.org/job/incubator-brooklyn-master-build/ws/brooklyn-library/examples/webapps/pom.xml>
to org.apache.brooklyn.example/brooklyn-examples-webapps-parent/0.9.0-SNAPSHOT/brooklyn-examples-webapps-parent-0.9.0-SNAPSHOT.pom
[JENKINS] Archiving <https://builds.apache.org/job/incubator-brooklyn-master-build/ws/brooklyn-server/karaf/features/pom.xml>
to org.apache.brooklyn/brooklyn-features/0.9.0-SNAPSHOT/brooklyn-features-0.9.0-SNAPSHOT.pom
[JENKINS] Archiving <https://builds.apache.org/job/incubator-brooklyn-master-build/ws/brooklyn-server/camp/camp-server/pom.xml>
to org.apache.brooklyn.camp/camp-server/0.9.0-SNAPSHOT/camp-server-0.9.0-SNAPSHOT.pom
[JENKINS] Archiving <https://builds.apache.org/job/incubator-brooklyn-master-build/ws/brooklyn-server/camp/camp-server/target/camp-server-0.9.0-SNAPSHOT.jar>
to org.apache.brooklyn.camp/camp-server/0.9.0-SNAPSHOT/camp-server-0.9.0-SNAPSHOT.jar
[JENKINS] Archiving <https://builds.apache.org/job/incubator-brooklyn-master-build/ws/brooklyn-server/camp/camp-server/target/camp-server-0.9.0-SNAPSHOT-tests.jar>
to org.apache.brooklyn.camp/camp-server/0.9.0-SNAPSHOT/camp-server-0.9.0-SNAPSHOT-tests.jar
[JENKINS] Archiving <https://builds.apache.org/job/incubator-brooklyn-master-build/ws/brooklyn-server/camp/camp-server/target/camp-server-0.9.0-SNAPSHOT-sources.jar>
to org.apache.brooklyn.camp/camp-server/0.9.0-SNAPSHOT/camp-server-0.9.0-SNAPSHOT-sources.jar
[JENKINS] Archiving <https://builds.apache.org/job/incubator-brooklyn-master-build/ws/brooklyn-server/camp/camp-server/target/camp-server-0.9.0-SNAPSHOT-test-sources.jar>
to org.apache.brooklyn.camp/camp-server/0.9.0-SNAPSHOT/camp-server-0.9.0-SNAPSHOT-test-sources.jar
[JENKINS] Archiving <https://builds.apache.org/job/incubator-brooklyn-master-build/ws/brooklyn-library/examples/pom.xml>
to org.apache.brooklyn.example/brooklyn-examples-parent/0.9.0-SNAPSHOT/brooklyn-examples-parent-0.9.0-SNAPSHOT.pom
[JENKINS] Archiving <https://builds.apache.org/job/incubator-brooklyn-master-build/ws/brooklyn-library/software/webapp/pom.xml>
to org.apache.brooklyn/brooklyn-software-webapp/0.9.0-SNAPSHOT/brooklyn-software-webapp-0.9.0-SNAPSHOT.pom
[JENKINS] Archiving <https://builds.apache.org/job/incubator-brooklyn-master-build/ws/brooklyn-server/test-support/pom.xml>
to org.apache.brooklyn/brooklyn-test-support/0.9.0-SNAPSHOT/brooklyn-test-support-0.9.0-SNAPSHOT.pom
[JENKINS] Archiving <https://builds.apache.org/job/incubator-brooklyn-master-build/ws/brooklyn-server/test-support/target/brooklyn-test-support-0.9.0-SNAPSHOT.jar>
to org.apache.brooklyn/brooklyn-test-support/0.9.0-SNAPSHOT/brooklyn-test-support-0.9.0-SNAPSHOT.jar
[JENKINS] Archiving <https://builds.apache.org/job/incubator-brooklyn-master-build/ws/brooklyn-server/test-support/target/brooklyn-test-support-0.9.0-SNAPSHOT-sources.jar>
to org.apache.brooklyn/brooklyn-test-support/0.9.0-SNAPSHOT/brooklyn-test-support-0.9.0-SNAPSHOT-sources.jar
[JENKINS] Archiving <https://builds.apache.org/job/incubator-brooklyn-master-build/ws/brooklyn-server/test-support/target/brooklyn-test-support-0.9.0-SNAPSHOT-test-sources.jar>
to org.apache.brooklyn/brooklyn-test-support/0.9.0-SNAPSHOT/brooklyn-test-support-0.9.0-SNAPSHOT-test-sources.jar
[JENKINS] Archiving <https://builds.apache.org/job/incubator-brooklyn-master-build/ws/brooklyn-server/karaf/pom.xml>
to org.apache.brooklyn/brooklyn-karaf/0.9.0-SNAPSHOT/brooklyn-karaf-0.9.0-SNAPSHOT.pom
[JENKINS] Archiving <https://builds.apache.org/job/incubator-brooklyn-master-build/ws/brooklyn-server/utils/rt-felix/pom.xml>
to org.apache.brooklyn/brooklyn-rt-felix/0.9.0-SNAPSHOT/brooklyn-rt-felix-0.9.0-SNAPSHOT.pom
[JENKINS] Archiving <https://builds.apache.org/job/incubator-brooklyn-master-build/ws/brooklyn-server/utils/rt-felix/target/brooklyn-rt-felix-0.9.0-SNAPSHOT.jar>
to org.apache.brooklyn/brooklyn-rt-felix/0.9.0-SNAPSHOT/brooklyn-rt-felix-0.9.0-SNAPSHOT.jar
[JENKINS] Archiving <https://builds.apache.org/job/incubator-brooklyn-master-build/ws/brooklyn-server/utils/rt-felix/target/brooklyn-rt-felix-0.9.0-SNAPSHOT-tests.jar>
to org.apache.brooklyn/brooklyn-rt-felix/0.9.0-SNAPSHOT/brooklyn-rt-felix-0.9.0-SNAPSHOT-tests.jar
[JENKINS] Archiving <https://builds.apache.org/job/incubator-brooklyn-master-build/ws/brooklyn-server/utils/rt-felix/target/brooklyn-rt-felix-0.9.0-SNAPSHOT-sources.jar>
to org.apache.brooklyn/brooklyn-rt-felix/0.9.0-SNAPSHOT/brooklyn-rt-felix-0.9.0-SNAPSHOT-sources.jar
[JENKINS] Archiving <https://builds.apache.org/job/incubator-brooklyn-master-build/ws/brooklyn-server/utils/rt-felix/target/brooklyn-rt-felix-0.9.0-SNAPSHOT-test-sources.jar>
to org.apache.brooklyn/brooklyn-rt-felix/0.9.0-SNAPSHOT/brooklyn-rt-felix-0.9.0-SNAPSHOT-test-sources.jar
[JENKINS] Archiving <https://builds.apache.org/job/incubator-brooklyn-master-build/ws/brooklyn-server/karaf/itest/pom.xml>
to org.apache.brooklyn/brooklyn-itest/0.9.0-SNAPSHOT/brooklyn-itest-0.9.0-SNAPSHOT.pom
[JENKINS] Archiving <https://builds.apache.org/job/incubator-brooklyn-master-build/ws/brooklyn-server/software/winrm/pom.xml>
to org.apache.brooklyn/brooklyn-software-winrm/0.9.0-SNAPSHOT/brooklyn-software-winrm-0.9.0-SNAPSHOT.pom
[JENKINS] Archiving <https://builds.apache.org/job/incubator-brooklyn-master-build/ws/brooklyn-server/camp/camp-base/pom.xml>
to org.apache.brooklyn.camp/camp-base/0.9.0-SNAPSHOT/camp-base-0.9.0-SNAPSHOT.pom
[JENKINS] Archiving <https://builds.apache.org/job/incubator-brooklyn-master-build/ws/brooklyn-server/camp/camp-base/target/camp-base-0.9.0-SNAPSHOT.jar>
to org.apache.brooklyn.camp/camp-base/0.9.0-SNAPSHOT/camp-base-0.9.0-SNAPSHOT.jar
[JENKINS] Archiving <https://builds.apache.org/job/incubator-brooklyn-master-build/ws/brooklyn-server/camp/camp-base/target/camp-base-0.9.0-SNAPSHOT-tests.jar>
to org.apache.brooklyn.camp/camp-base/0.9.0-SNAPSHOT/camp-base-0.9.0-SNAPSHOT-tests.jar
[JENKINS] Archiving <https://builds.apache.org/job/incubator-brooklyn-master-build/ws/brooklyn-server/camp/camp-base/target/camp-base-0.9.0-SNAPSHOT-sources.jar>
to org.apache.brooklyn.camp/camp-base/0.9.0-SNAPSHOT/camp-base-0.9.0-SNAPSHOT-sources.jar
[JENKINS] Archiving <https://builds.apache.org/job/incubator-brooklyn-master-build/ws/brooklyn-server/camp/camp-base/target/camp-base-0.9.0-SNAPSHOT-test-sources.jar>
to org.apache.brooklyn.camp/camp-base/0.9.0-SNAPSHOT/camp-base-0.9.0-SNAPSHOT-test-sources.jar
[JENKINS] Archiving <https://builds.apache.org/job/incubator-brooklyn-master-build/ws/brooklyn-library/software/network/pom.xml>
to org.apache.brooklyn/brooklyn-software-network/0.9.0-SNAPSHOT/brooklyn-software-network-0.9.0-SNAPSHOT.pom
[JENKINS] Archiving <https://builds.apache.org/job/incubator-brooklyn-master-build/ws/brooklyn-dist/dist/pom.xml>
to org.apache.brooklyn/brooklyn-dist/0.9.0-SNAPSHOT/brooklyn-dist-0.9.0-SNAPSHOT.pom
[JENKINS] Archiving <https://builds.apache.org/job/incubator-brooklyn-master-build/ws/brooklyn-server/parent/pom.xml>
to org.apache.brooklyn/brooklyn-parent/0.9.0-SNAPSHOT/brooklyn-parent-0.9.0-SNAPSHOT.pom
Compressed 83.65 KB of artifacts by 76.5% relative to #715
[JENKINS] Archiving <https://builds.apache.org/job/incubator-brooklyn-master-build/ws/brooklyn-server/server-cli/pom.xml>
to org.apache.brooklyn/brooklyn-cli/0.9.0-SNAPSHOT/brooklyn-cli-0.9.0-SNAPSHOT.pom
[JENKINS] Archiving <https://builds.apache.org/job/incubator-brooklyn-master-build/ws/brooklyn-server/launcher/pom.xml>
to org.apache.brooklyn/brooklyn-launcher/0.9.0-SNAPSHOT/brooklyn-launcher-0.9.0-SNAPSHOT.pom
[JENKINS] Archiving <https://builds.apache.org/job/incubator-brooklyn-master-build/ws/brooklyn-server/utils/rest-swagger/pom.xml>
to org.apache.brooklyn/brooklyn-utils-rest-swagger/0.9.0-SNAPSHOT/brooklyn-utils-rest-swagger-0.9.0-SNAPSHOT.pom
[JENKINS] Archiving <https://builds.apache.org/job/incubator-brooklyn-master-build/ws/brooklyn-server/utils/rest-swagger/target/brooklyn-utils-rest-swagger-0.9.0-SNAPSHOT.jar>
to org.apache.brooklyn/brooklyn-utils-rest-swagger/0.9.0-SNAPSHOT/brooklyn-utils-rest-swagger-0.9.0-SNAPSHOT.jar
[JENKINS] Archiving <https://builds.apache.org/job/incubator-brooklyn-master-build/ws/brooklyn-server/utils/rest-swagger/target/brooklyn-utils-rest-swagger-0.9.0-SNAPSHOT-sources.jar>
to org.apache.brooklyn/brooklyn-utils-rest-swagger/0.9.0-SNAPSHOT/brooklyn-utils-rest-swagger-0.9.0-SNAPSHOT-sources.jar
[JENKINS] Archiving <https://builds.apache.org/job/incubator-brooklyn-master-build/ws/brooklyn-server/utils/rest-swagger/target/brooklyn-utils-rest-swagger-0.9.0-SNAPSHOT-test-sources.jar>
to org.apache.brooklyn/brooklyn-utils-rest-swagger/0.9.0-SNAPSHOT/brooklyn-utils-rest-swagger-0.9.0-SNAPSHOT-test-sources.jar
[JENKINS] Archiving <https://builds.apache.org/job/incubator-brooklyn-master-build/ws/brooklyn-dist/pom.xml>
to org.apache.brooklyn/brooklyn-dist-root/0.9.0-SNAPSHOT/brooklyn-dist-root-0.9.0-SNAPSHOT.pom
[JENKINS] Archiving <https://builds.apache.org/job/incubator-brooklyn-master-build/ws/brooklyn-server/camp/pom.xml>
to org.apache.brooklyn.camp/camp-parent/0.9.0-SNAPSHOT/camp-parent-0.9.0-SNAPSHOT.pom
[JENKINS] Archiving <https://builds.apache.org/job/incubator-brooklyn-master-build/ws/brooklyn-dist/all/pom.xml>
to org.apache.brooklyn/brooklyn-all/0.9.0-SNAPSHOT/brooklyn-all-0.9.0-SNAPSHOT.pom
[JENKINS] Archiving <https://builds.apache.org/job/incubator-brooklyn-master-build/ws/brooklyn-server/api/pom.xml>
to org.apache.brooklyn/brooklyn-api/0.9.0-SNAPSHOT/brooklyn-api-0.9.0-SNAPSHOT.pom
[JENKINS] Archiving <https://builds.apache.org/job/incubator-brooklyn-master-build/ws/brooklyn-server/api/target/brooklyn-api-0.9.0-SNAPSHOT.jar>
to org.apache.brooklyn/brooklyn-api/0.9.0-SNAPSHOT/brooklyn-api-0.9.0-SNAPSHOT.jar
[JENKINS] Archiving <https://builds.apache.org/job/incubator-brooklyn-master-build/ws/brooklyn-server/api/target/brooklyn-api-0.9.0-SNAPSHOT-sources.jar>
to org.apache.brooklyn/brooklyn-api/0.9.0-SNAPSHOT/brooklyn-api-0.9.0-SNAPSHOT-sources.jar
[JENKINS] Archiving <https://builds.apache.org/job/incubator-brooklyn-master-build/ws/brooklyn-server/api/target/brooklyn-api-0.9.0-SNAPSHOT-test-sources.jar>
to org.apache.brooklyn/brooklyn-api/0.9.0-SNAPSHOT/brooklyn-api-0.9.0-SNAPSHOT-test-sources.jar
channel stopped


Mime
View raw message