brooklyn-dev mailing list archives

Site index · List index
Message view « Date » · « Thread »
Top « Date » · « Thread »
From Apache Jenkins Server <jenk...@builds.apache.org>
Subject Build failed in Jenkins: incubator-brooklyn-master-windows #407
Date Wed, 20 Jan 2016 11:09:09 GMT
See <https://builds.apache.org/job/incubator-brooklyn-master-windows/407/changes>

Changes:

[yavor] RabbitMQ upgrade

[valentin.aitken] In skipInstall include also : copy-pre-install-resources, pre-install,

[graeme.miller] Updated JClouds to 1.9.2

[yavor] Additional security for MySQL

[valentin.aitken] Set error logging for MySqlNode

[aled.sage] Fix DynamicFabric locations

[alex.heneveld] clean up how start(Location) works, for Dynamic{Cluster,Fabric}

[alex.heneveld] tidy several other places start(Collection<Location>) is assuming

[aled.sage] winrm: switch to winrm4j v0.2.0, from 0.1.0

------------------------------------------
[...truncated 42282 lines...]
[INFO] 2016-01-20 11:09:09,752 INFO  TESTNG INVOKING CONFIGURATION: "Surefire test" - @AfterMethod
com.acme.sample.brooklyn.sample.app.SampleUnitTest.shutdown()
[INFO] 2016-01-20 11:09:09,768 INFO  Stopping application SingleWebServerSample{id=xGuiapQO}
[INFO] 2016-01-20 11:09:09,772 INFO  Stopping JBoss7ServerImpl{id=eFTLxHaO} in []
[INFO] 2016-01-20 11:09:09,786 INFO  Stopped application SingleWebServerSample{id=xGuiapQO}
[INFO] 2016-01-20 11:09:10,310 INFO  TESTNG PASSED CONFIGURATION: "Surefire test" - @AfterMethod
com.acme.sample.brooklyn.sample.app.SampleUnitTest.shutdown() finished in 558 ms
[INFO] 2016-01-20 11:09:10,327 INFO  TESTNG 
[INFO] ===============================================
[INFO]     Surefire test
[INFO]     Tests run: 2, Failures: 0, Skips: 0
[INFO] ===============================================
[INFO] Tests run: 2, Failures: 0, Errors: 0, Skipped: 0, Time elapsed: 10.52 sec - in TestSuite
[INFO] 
[INFO] Results :
[INFO] 
[INFO] Tests run: 2, Failures: 0, Errors: 0, Skipped: 0
[INFO] 
[INFO] [INFO] 
[INFO] [INFO] --- maven-jar-plugin:2.6:jar (default-jar) @ brooklyn-sample ---
[INFO] [INFO] Building jar: F:\hudson\hudson-slave\workspace\incubator-brooklyn-master-windows\brooklyn-dist\archetypes\quickstart\target\test-classes\projects\integration-test-1\project\brooklyn-sample\target\brooklyn-sample-0.1.0-SNAPSHOT.jar
[INFO] [INFO] 
[INFO] [INFO] --- maven-site-plugin:3.4:attach-descriptor (attach-descriptor) @ brooklyn-sample
---
[INFO] [INFO] 
[INFO] [INFO] --- maven-jar-plugin:2.6:test-jar (test-jar-creation) @ brooklyn-sample ---
[INFO] [INFO] Building jar: F:\hudson\hudson-slave\workspace\incubator-brooklyn-master-windows\brooklyn-dist\archetypes\quickstart\target\test-classes\projects\integration-test-1\project\brooklyn-sample\target\brooklyn-sample-0.1.0-SNAPSHOT-tests.jar
[INFO] [INFO] 
[INFO] [INFO] --- maven-install-plugin:2.5.2:install (default-install) @ brooklyn-sample ---
[INFO] [INFO] Installing F:\hudson\hudson-slave\workspace\incubator-brooklyn-master-windows\brooklyn-dist\archetypes\quickstart\target\test-classes\projects\integration-test-1\project\brooklyn-sample\target\brooklyn-sample-0.1.0-SNAPSHOT.jar
to F:\hudson\hudson-slave\maven-repositories\0\com\acme\sample\brooklyn-sample\0.1.0-SNAPSHOT\brooklyn-sample-0.1.0-SNAPSHOT.jar
[INFO] [INFO] Installing F:\hudson\hudson-slave\workspace\incubator-brooklyn-master-windows\brooklyn-dist\archetypes\quickstart\target\test-classes\projects\integration-test-1\project\brooklyn-sample\pom.xml
to F:\hudson\hudson-slave\maven-repositories\0\com\acme\sample\brooklyn-sample\0.1.0-SNAPSHOT\brooklyn-sample-0.1.0-SNAPSHOT.pom
[INFO] [INFO] Installing F:\hudson\hudson-slave\workspace\incubator-brooklyn-master-windows\brooklyn-dist\archetypes\quickstart\target\test-classes\projects\integration-test-1\project\brooklyn-sample\target\brooklyn-sample-0.1.0-SNAPSHOT-tests.jar
to F:\hudson\hudson-slave\maven-repositories\0\com\acme\sample\brooklyn-sample\0.1.0-SNAPSHOT\brooklyn-sample-0.1.0-SNAPSHOT-tests.jar
[INFO] [INFO] ------------------------------------------------------------------------
[INFO] [INFO] BUILD SUCCESS
[INFO] [INFO] ------------------------------------------------------------------------
[INFO] [INFO] Total time: 47.996s
[INFO] [INFO] Finished at: Wed Jan 20 11:09:11 GMT 2016
[INFO] [INFO] Final Memory: 42M/239M
[INFO] [INFO] ------------------------------------------------------------------------
[INFO] Post-archetype-generation invoker exit code: 0
[JENKINS] Recording test results
[INFO] 
[INFO] --- apache-rat-plugin:0.11:check (default) @ brooklyn-archetype-quickstart ---
[INFO] 51 implicit excludes (use -debug for more details).
[INFO] Exclude: sandbox/**
[INFO] Exclude: release/**
[INFO] Exclude: README.md
[INFO] Exclude: **/nbactions.xml
[INFO] Exclude: **/nb-configuration.xml
[INFO] Exclude: **/src/main/resources/archetype-resources/**/*
[INFO] Exclude: **/src/test/resources/projects/integration-test-1/goal.txt
[INFO] Exclude: **/src/test/resources/projects/integration-test-1/reference/**/*
[INFO] Exclude: **/src/main/java/sample/**/*Sample*.java
[INFO] Exclude: **/src/main/resources/logback-custom.xml
[INFO] Exclude: **/src/brooklyn-sample/README.md
[INFO] Exclude: **/src/brooklyn-sample/pom.xml
[INFO] Exclude: **/src/brooklyn-sample/src/main/assembly/files/conf/*
[INFO] Exclude: **/src/brooklyn-sample/src/main/java/**/*.java
[INFO] Exclude: **/src/brooklyn-sample/src/main/resources/logback-custom.xml
[INFO] Exclude: **/src/brooklyn-sample/src/test/java/**/*.java
[INFO] Exclude: **/.git/**
[INFO] Exclude: **/.gitignore
[INFO] Exclude: **/.repository/**
[INFO] Exclude: **/.idea/**
[INFO] Exclude: **/*.iml
[INFO] Exclude: **/.classpath/**
[INFO] Exclude: **/.project
[INFO] Exclude: **/.settings/**
[INFO] Exclude: **/*.log
[INFO] Exclude: **/brooklyn*.log.*
[INFO] Exclude: **/target/**
[INFO] Exclude: ignored/**
[INFO] Exclude: LICENSE.md
[INFO] Exclude: **/src/main/license/**
[INFO] Exclude: **/src/test/license/**
[INFO] Exclude: **/MANIFEST.MF
[INFO] Exclude: **/test-output/**
[INFO] Exclude: **/*.pem.pub
[INFO] Exclude: **/*.pem
[INFO] Exclude: **/*_rsa.pub
[INFO] Exclude: **/*_rsa
[INFO] Exclude: **/*.svg
[INFO] Exclude: **/*.crt
[INFO] Exclude: **/*.csr
[INFO] Exclude: **/*.key
[INFO] Exclude: **/*.key.org
[INFO] Exclude: **/*.psd
[INFO] Exclude: **/*.json
[INFO] Exclude: **/*.plxarc
[INFO] Exclude: **/src/test/resources/org/apache/brooklyn/entity/software/base/template_with_extra_substitutions.txt
[INFO] Exclude: **/src/main/resources/banner.txt
[INFO] Exclude: **/src/test/resources/ssl/certs/localhost/info.txt
[INFO] Exclude: **/src/main/history/dependencies.xml
[INFO] Exclude: **/sandbox/examples/src/main/scripts/amis.txt
[INFO] Exclude: docs/**
[INFO] 9 resources included (use -debug for more details)
[INFO] Rat check: Summary of files. Unapproved: 0 unknown: 0 generated: 0 approved: 7 licence.
[INFO] 
[INFO] --- maven-source-plugin:2.4:jar-no-fork (attach-sources) @ brooklyn-archetype-quickstart
---
[INFO] Building jar: F:\hudson\hudson-slave\workspace\incubator-brooklyn-master-windows\brooklyn-dist\archetypes\quickstart\target\brooklyn-archetype-quickstart-0.9.0-SNAPSHOT-sources.jar
[INFO] 
[INFO] --- maven-source-plugin:2.4:test-jar-no-fork (attach-sources) @ brooklyn-archetype-quickstart
---
[INFO] Building jar: F:\hudson\hudson-slave\workspace\incubator-brooklyn-master-windows\brooklyn-dist\archetypes\quickstart\target\brooklyn-archetype-quickstart-0.9.0-SNAPSHOT-test-sources.jar
[INFO] 
[INFO] --- maven-install-plugin:2.5.2:install (default-install) @ brooklyn-archetype-quickstart
---
[INFO] Installing F:\hudson\hudson-slave\workspace\incubator-brooklyn-master-windows\brooklyn-dist\archetypes\quickstart\target\brooklyn-archetype-quickstart-0.9.0-SNAPSHOT.jar
to f:\hudson\hudson-slave\maven-repositories\0\org\apache\brooklyn\brooklyn-archetype-quickstart\0.9.0-SNAPSHOT\brooklyn-archetype-quickstart-0.9.0-SNAPSHOT.jar
[INFO] Installing F:\hudson\hudson-slave\workspace\incubator-brooklyn-master-windows\brooklyn-dist\archetypes\quickstart\pom.xml
to f:\hudson\hudson-slave\maven-repositories\0\org\apache\brooklyn\brooklyn-archetype-quickstart\0.9.0-SNAPSHOT\brooklyn-archetype-quickstart-0.9.0-SNAPSHOT.pom
[INFO] Installing F:\hudson\hudson-slave\workspace\incubator-brooklyn-master-windows\brooklyn-dist\archetypes\quickstart\target\brooklyn-archetype-quickstart-0.9.0-SNAPSHOT-tests.jar
to f:\hudson\hudson-slave\maven-repositories\0\org\apache\brooklyn\brooklyn-archetype-quickstart\0.9.0-SNAPSHOT\brooklyn-archetype-quickstart-0.9.0-SNAPSHOT-tests.jar
[INFO] Installing F:\hudson\hudson-slave\workspace\incubator-brooklyn-master-windows\brooklyn-dist\archetypes\quickstart\target\brooklyn-archetype-quickstart-0.9.0-SNAPSHOT-sources.jar
to f:\hudson\hudson-slave\maven-repositories\0\org\apache\brooklyn\brooklyn-archetype-quickstart\0.9.0-SNAPSHOT\brooklyn-archetype-quickstart-0.9.0-SNAPSHOT-sources.jar
[INFO] Installing F:\hudson\hudson-slave\workspace\incubator-brooklyn-master-windows\brooklyn-dist\archetypes\quickstart\target\brooklyn-archetype-quickstart-0.9.0-SNAPSHOT-test-sources.jar
to f:\hudson\hudson-slave\maven-repositories\0\org\apache\brooklyn\brooklyn-archetype-quickstart\0.9.0-SNAPSHOT\brooklyn-archetype-quickstart-0.9.0-SNAPSHOT-test-sources.jar
[INFO] 
[INFO] --- maven-archetype-plugin:2.3:update-local-catalog (default-update-local-catalog)
@ brooklyn-archetype-quickstart ---
[JENKINS] Archiving disabled
[INFO] ------------------------------------------------------------------------
[INFO] Reactor Summary:
[INFO] 
[INFO] Brooklyn Server Root .............................. SUCCESS [3.218s]
[INFO] Brooklyn Parent Project ........................... SUCCESS [7.812s]
[INFO] Brooklyn Test Support Utilities ................... SUCCESS [8.971s]
[INFO] Brooklyn Logback Includable Configuration ......... SUCCESS [1.530s]
[INFO] Brooklyn Common Utilities ......................... SUCCESS [31.702s]
[INFO] Brooklyn API ...................................... SUCCESS [4.078s]
[INFO] CAMP Server Parent Project ........................ SUCCESS [1.014s]
[INFO] CAMP Base ......................................... SUCCESS [4.218s]
[INFO] Brooklyn Test Support ............................. SUCCESS [1.900s]
[INFO] Brooklyn REST Swagger Apidoc Utilities ............ SUCCESS [12.747s]
[INFO] Brooklyn Logback Configuration .................... SUCCESS [1.170s]
[INFO] CAMP Server ....................................... SUCCESS [9.375s]
[INFO] Brooklyn OSGi Utils ............................... SUCCESS [3.734s]
[INFO] Brooklyn Felix Runtime ............................ SUCCESS [4.289s]
[INFO] Brooklyn Groovy Utilities ......................... SUCCESS [1.531s]
[INFO] Brooklyn Core ..................................... FAILURE [5:09.072s]
[INFO] Brooklyn Policies ................................. SKIPPED
[INFO] Brooklyn WinRM Software Entities .................. SKIPPED
[INFO] Brooklyn Secure JMXMP Agent ....................... SKIPPED
[INFO] Brooklyn JMX RMI Agent ............................ SUCCESS [2.126s]
[INFO] Brooklyn Jclouds Location Targets ................. SKIPPED
[INFO] Brooklyn Software Base ............................ SKIPPED
[INFO] Brooklyn CAMP REST API ............................ SKIPPED
[INFO] Brooklyn Hazelcast Storage ........................ SKIPPED
[INFO] Brooklyn REST API ................................. SUCCESS [15.915s]
[INFO] Brooklyn REST Server .............................. SKIPPED
[INFO] Brooklyn Launcher ................................. SKIPPED
[INFO] Brooklyn Command Line Interface ................... SKIPPED
[INFO] Brooklyn REST Client .............................. SKIPPED
[INFO] Brooklyn Test Framework ........................... SKIPPED
[INFO] Brooklyn Karaf .................................... SUCCESS [0.107s]
[INFO] Brooklyn Karaf Features ........................... SUCCESS [2.993s]
[INFO] Brooklyn Karaf Distro ............................. SUCCESS [25.089s]
[INFO] Brooklyn Karaf Shell Commands ..................... SUCCESS [5.743s]
[INFO] Brooklyn Karaf pax-exam itest ..................... SUCCESS [58.232s]
[INFO] Brooklyn Library Root ............................. SUCCESS [3.976s]
[INFO] Brooklyn Network Software Entities ................ SKIPPED
[INFO] Brooklyn OSGi Software Entities ................... SKIPPED
[INFO] Brooklyn Database Software Entities ............... SKIPPED
[INFO] Brooklyn Web App Software Entities ................ SKIPPED
[INFO] Brooklyn Messaging Software Entities .............. SKIPPED
[INFO] Brooklyn NoSQL Data Store Software Entities ....... SKIPPED
[INFO] Brooklyn Monitoring Software Entities ............. SKIPPED
[INFO] Brooklyn QA ....................................... SKIPPED
[INFO] Brooklyn Examples Aggregator Project .............. SUCCESS [0.900s]
[INFO] Brooklyn Examples Aggregator Project - Webapps .... SUCCESS [0.458s]
[INFO] hello-world-webapp Maven Webapp ................... SUCCESS [1.990s]
[INFO] hello-world-sql-webapp Maven Webapp ............... SUCCESS [2.978s]
[INFO] Brooklyn Simple Web Cluster Example ............... SKIPPED
[INFO] Brooklyn Global Web Fabric Example ................ SKIPPED
[INFO] Brooklyn Simple Messaging Publish-Subscribe Example  SKIPPED
[INFO] Brooklyn NoSQL Cluster Examples ................... SKIPPED
[INFO] Brooklyn Downstream Project Parent ................ SUCCESS [0.307s]
[INFO] Brooklyn Dist Root ................................ SUCCESS [1.581s]
[INFO] Brooklyn All Things ............................... SKIPPED
[INFO] Brooklyn Distribution ............................. SKIPPED
[INFO] Brooklyn Quick-Start Project Archetype ............ SUCCESS [53.565s]
[INFO] ------------------------------------------------------------------------
[INFO] BUILD FAILURE
[INFO] ------------------------------------------------------------------------
[INFO] Total time: 10:02.867s
[INFO] Finished at: Wed Jan 20 11:09:12 GMT 2016
[INFO] Final Memory: 93M/243M
[INFO] ------------------------------------------------------------------------
[JENKINS] Archiving disabled
[JENKINS] Archiving disabled
[JENKINS] Archiving disabled
[JENKINS] Archiving disabled
[JENKINS] Archiving disabled
[JENKINS] Archiving disabled
[JENKINS] Archiving disabled
[JENKINS] Archiving disabled
[JENKINS] Archiving disabled
[JENKINS] Archiving disabled
[JENKINS] Archiving disabled
[JENKINS] Archiving disabled
[JENKINS] Archiving disabled
[JENKINS] Archiving disabled
[JENKINS] Archiving disabled
[JENKINS] Archiving disabled
[JENKINS] Archiving disabled
[JENKINS] Archiving disabled
[JENKINS] Archiving disabled
[JENKINS] Archiving disabled
[JENKINS] Archiving disabled
[JENKINS] Archiving disabled
[JENKINS] Archiving disabled
[JENKINS] Archiving disabled
[JENKINS] Archiving disabled
[JENKINS] Archiving disabled
[JENKINS] Archiving disabled
[JENKINS] Archiving disabled
[JENKINS] Archiving disabled
[JENKINS] Archiving disabled
[JENKINS] Archiving disabled
[JENKINS] Archiving disabled
[JENKINS] Archiving disabled
[JENKINS] Archiving disabled
[JENKINS] Archiving disabled
[JENKINS] Archiving disabled
[JENKINS] Archiving disabled
[JENKINS] Archiving disabled
[JENKINS] Archiving disabled
[JENKINS] Archiving disabled
[JENKINS] Archiving disabled
[JENKINS] Archiving disabled
[JENKINS] Archiving disabled
[JENKINS] Archiving disabled
[JENKINS] Archiving disabled
[JENKINS] Archiving disabled
[JENKINS] Archiving disabled
[JENKINS] Archiving disabled
[JENKINS] Archiving disabled
[JENKINS] Archiving disabled
[JENKINS] Archiving disabled
[JENKINS] Archiving disabled
[JENKINS] Archiving disabled
[JENKINS] Archiving disabled
[JENKINS] Archiving disabled
[JENKINS] Archiving disabled
[JENKINS] Archiving disabled
Waiting for Jenkins to finish collecting data
[ERROR] Failed to execute goal org.apache.maven.plugins:maven-surefire-plugin:2.18.1:test
(default-test) on project brooklyn-core: There are test failures.
[ERROR] 
[ERROR] Please refer to F:\hudson\hudson-slave\workspace\incubator-brooklyn-master-windows\brooklyn-server\core\target\surefire-reports
for the individual test results.
[ERROR] -> [Help 1]
[ERROR] 
[ERROR] To see the full stack trace of the errors, re-run Maven with the -e switch.
[ERROR] Re-run Maven using the -X switch to enable full debug logging.
[ERROR] 
[ERROR] For more information about the errors and possible solutions, please read the following
articles:
[ERROR] [Help 1] http://cwiki.apache.org/confluence/display/MAVEN/MojoFailureException
[ERROR] 
[ERROR] After correcting the problems, you can resume the build with the command
[ERROR]   mvn <goals> -rf :brooklyn-core
channel stopped

Mime
View raw message