brooklyn-dev mailing list archives

Site index · List index
Message view « Date » · « Thread »
Top « Date » · « Thread »
From Apache Jenkins Server <jenk...@builds.apache.org>
Subject Build failed in Jenkins: incubator-brooklyn-master-windows #390
Date Wed, 23 Dec 2015 11:46:17 GMT
See <https://builds.apache.org/job/incubator-brooklyn-master-windows/390/changes>

Changes:

[john] [SPLITPREP] rearranged to have structure of new repositories

[alex.heneveld] [SPLITPREP] move more PR items to the right place

[alex.heneveld] [LIBRARY] fix GeoDns test

[alex.heneveld] [SPLITPREP] brookly version 0.9.SPLITWIP-SNAPSHOT  for test purposes

[alex.heneveld] [SERVER] simple pom.xml updates post-reorg

[alex.heneveld] [SERVER] omit jsgui feature from karaf

[alex.heneveld] [SERVER] omit jsgui feature from launcher build (no code update)

[alex.heneveld] [SERVER] delete dependencies on software-* jars from brooklyn-library

[alex.heneveld] [SERVER] [HACK] commented out dependencies on test jars to allow use of

[alex.heneveld] [LIBRARY] removed brooklyn-dist depdency

[alex.heneveld] [LIBRARY] added root brooklyn-library pom (dumb copy of

[alex.heneveld] [SERVER] [LIBRARY] moved webapp related CAMP tests to brooklyn-library

[alex.heneveld] [SERVER] replaced ProxySslConfig with a dummy POJO

[alex.heneveld] [SERVER] [UNDO HACK] readded test deps after fixing/moving tests -

[alex.heneveld] [SERVER] [LIBRARY] moved missing resources and fixed CAMP tests moved

[alex.heneveld] [SERVER] minor fixes to existing poms

[alex.heneveld] [LIBRARY] switch back to using brooklyn-parent

[alex.heneveld] [SERVER] [UI] moved BrooklynJavascriptGuiLauncher from ui to server

[alex.heneveld] [SERVER] [LIBRARY] [DIST] multiple pom updates to pull brooklyn-parent

[alex.heneveld] [SERVER] updated BrooklynJavascriptGuiLauncherTest to use a non

[alex.heneveld] [SERVER]  fix rat violations

[alex.heneveld] [UBER]  add pom in brooklyn uber project subdir to build everything

[alex.heneveld] [ALL]  update README file in each repo to be appropriate to that repo,

[alex.heneveld] [SERVER] [LIBRARY] fix/move rest-server and camp-brooklyn tests *note*

[alex.heneveld] [UI] fix jasmine tests copies rest-api fixtures from brooklyn-server

[alex.heneveld] [SERVER] use catalog entities from software-base in rest-server tests

[alex.heneveld] [LIBRARY] add database dependency for camp tests

[alex.heneveld] [LIBRARY] move camp webapp related tests from software-webapp to qa

[alex.heneveld] [DIST] revert parent updates and move archetype to last built module

[alex.heneveld] [DIST] reparent the downstream project so it doesn't get rat check,

[alex.heneveld] [SPLITPREP] revert version to 0.9.0-SNAPSHOT

[alex.heneveld] [SPLITPREP] apply version reversion in missed places, and add

[david] Add CLI documentation to the Operations Guide

[alex.heneveld] [ALL]  pom hints for eclipse to exclude certain maven build steps

[alex.heneveld] [SERVER] fix load of JS UI in BrooklynJavascriptGuiLauncher

[alex.heneveld] [ALL] comment about relativePath in pom

[alex.heneveld] [JCLOUDS] fix unit test so it uses empty context and runs much faster

[alex.heneveld] [DIST]  put a minimal README in the dist (instead of the "historical

[alex.heneveld] [ALL] keep version properties in one place

[alex.heneveld] [DIST] fix url in readme

[alex.heneveld] move cli docs from #1118 to reorg structure

------------------------------------------
[...truncated 41684 lines...]
[INFO] 2015-12-23 11:46:11,062 INFO  Stopping JBoss7ServerImpl{id=Eb4LOOL2} in []
[INFO] 2015-12-23 11:46:11,072 INFO  Stopped application SingleWebServerSample{id=YHlrpKlJ}
[INFO] 2015-12-23 11:46:11,476 INFO  TESTNG PASSED CONFIGURATION: "Surefire test" - @AfterMethod
com.acme.sample.brooklyn.sample.app.SampleUnitTest.shutdown() finished in 431 ms
[INFO] 2015-12-23 11:46:11,489 INFO  TESTNG 
[INFO] ===============================================
[INFO]     Surefire test
[INFO]     Tests run: 2, Failures: 0, Skips: 0
[INFO] ===============================================
[INFO] Tests run: 2, Failures: 0, Errors: 0, Skipped: 0, Time elapsed: 8.794 sec - in TestSuite
[INFO] 
[INFO] Results :
[INFO] 
[INFO] Tests run: 2, Failures: 0, Errors: 0, Skipped: 0
[INFO] 
[INFO] [INFO] 
[INFO] [INFO] --- maven-jar-plugin:2.6:jar (default-jar) @ brooklyn-sample ---
[INFO] [INFO] Building jar: F:\hudson\hudson-slave\workspace\incubator-brooklyn-master-windows\brooklyn-dist\archetypes\quickstart\target\test-classes\projects\integration-test-1\project\brooklyn-sample\target\brooklyn-sample-0.1.0-SNAPSHOT.jar
[INFO] [INFO] 
[INFO] [INFO] --- maven-site-plugin:3.4:attach-descriptor (attach-descriptor) @ brooklyn-sample
---
[INFO] [INFO] 
[INFO] [INFO] --- maven-jar-plugin:2.6:test-jar (test-jar-creation) @ brooklyn-sample ---
[INFO] [INFO] Building jar: F:\hudson\hudson-slave\workspace\incubator-brooklyn-master-windows\brooklyn-dist\archetypes\quickstart\target\test-classes\projects\integration-test-1\project\brooklyn-sample\target\brooklyn-sample-0.1.0-SNAPSHOT-tests.jar
[INFO] [INFO] 
[INFO] [INFO] --- maven-install-plugin:2.5.2:install (default-install) @ brooklyn-sample ---
[INFO] [INFO] Installing F:\hudson\hudson-slave\workspace\incubator-brooklyn-master-windows\brooklyn-dist\archetypes\quickstart\target\test-classes\projects\integration-test-1\project\brooklyn-sample\target\brooklyn-sample-0.1.0-SNAPSHOT.jar
to F:\hudson\hudson-slave\maven-repositories\0\com\acme\sample\brooklyn-sample\0.1.0-SNAPSHOT\brooklyn-sample-0.1.0-SNAPSHOT.jar
[INFO] [INFO] Installing F:\hudson\hudson-slave\workspace\incubator-brooklyn-master-windows\brooklyn-dist\archetypes\quickstart\target\test-classes\projects\integration-test-1\project\brooklyn-sample\pom.xml
to F:\hudson\hudson-slave\maven-repositories\0\com\acme\sample\brooklyn-sample\0.1.0-SNAPSHOT\brooklyn-sample-0.1.0-SNAPSHOT.pom
[INFO] [INFO] Installing F:\hudson\hudson-slave\workspace\incubator-brooklyn-master-windows\brooklyn-dist\archetypes\quickstart\target\test-classes\projects\integration-test-1\project\brooklyn-sample\target\brooklyn-sample-0.1.0-SNAPSHOT-tests.jar
to F:\hudson\hudson-slave\maven-repositories\0\com\acme\sample\brooklyn-sample\0.1.0-SNAPSHOT\brooklyn-sample-0.1.0-SNAPSHOT-tests.jar
[INFO] [INFO] ------------------------------------------------------------------------
[INFO] [INFO] BUILD SUCCESS
[INFO] [INFO] ------------------------------------------------------------------------
[INFO] [INFO] Total time: 35.181s
[INFO] [INFO] Finished at: Wed Dec 23 11:46:12 GMT 2015
[INFO] [INFO] Final Memory: 45M/236M
[INFO] [INFO] ------------------------------------------------------------------------
[INFO] Post-archetype-generation invoker exit code: 0
[JENKINS] Recording test results
[INFO] 
[INFO] --- apache-rat-plugin:0.11:check (default) @ brooklyn-archetype-quickstart ---
[INFO] 51 implicit excludes (use -debug for more details).
[INFO] Exclude: sandbox/**
[INFO] Exclude: release/**
[INFO] Exclude: README.md
[INFO] Exclude: **/nbactions.xml
[INFO] Exclude: **/nb-configuration.xml
[INFO] Exclude: **/src/main/resources/archetype-resources/**/*
[INFO] Exclude: **/src/test/resources/projects/integration-test-1/goal.txt
[INFO] Exclude: **/src/test/resources/projects/integration-test-1/reference/**/*
[INFO] Exclude: **/src/main/java/sample/**/*Sample*.java
[INFO] Exclude: **/src/main/resources/logback-custom.xml
[INFO] Exclude: **/src/brooklyn-sample/README.md
[INFO] Exclude: **/src/brooklyn-sample/pom.xml
[INFO] Exclude: **/src/brooklyn-sample/src/main/assembly/files/conf/*
[INFO] Exclude: **/src/brooklyn-sample/src/main/java/**/*.java
[INFO] Exclude: **/src/brooklyn-sample/src/main/resources/logback-custom.xml
[INFO] Exclude: **/src/brooklyn-sample/src/test/java/**/*.java
[INFO] Exclude: **/.git/**
[INFO] Exclude: **/.gitignore
[INFO] Exclude: **/.repository/**
[INFO] Exclude: **/.idea/**
[INFO] Exclude: **/*.iml
[INFO] Exclude: **/.classpath/**
[INFO] Exclude: **/.project
[INFO] Exclude: **/.settings/**
[INFO] Exclude: **/*.log
[INFO] Exclude: **/brooklyn*.log.*
[INFO] Exclude: **/target/**
[INFO] Exclude: ignored/**
[INFO] Exclude: LICENSE.md
[INFO] Exclude: **/src/main/license/**
[INFO] Exclude: **/src/test/license/**
[INFO] Exclude: **/MANIFEST.MF
[INFO] Exclude: **/test-output/**
[INFO] Exclude: **/*.pem.pub
[INFO] Exclude: **/*.pem
[INFO] Exclude: **/*_rsa.pub
[INFO] Exclude: **/*_rsa
[INFO] Exclude: **/*.svg
[INFO] Exclude: **/*.crt
[INFO] Exclude: **/*.csr
[INFO] Exclude: **/*.key
[INFO] Exclude: **/*.key.org
[INFO] Exclude: **/*.psd
[INFO] Exclude: **/*.json
[INFO] Exclude: **/*.plxarc
[INFO] Exclude: **/src/test/resources/org/apache/brooklyn/entity/software/base/template_with_extra_substitutions.txt
[INFO] Exclude: **/src/main/resources/banner.txt
[INFO] Exclude: **/src/test/resources/ssl/certs/localhost/info.txt
[INFO] Exclude: **/src/main/history/dependencies.xml
[INFO] Exclude: **/sandbox/examples/src/main/scripts/amis.txt
[INFO] Exclude: docs/**
[INFO] 9 resources included (use -debug for more details)
[INFO] Rat check: Summary of files. Unapproved: 0 unknown: 0 generated: 0 approved: 7 licence.
[INFO] 
[INFO] --- maven-source-plugin:2.4:jar-no-fork (attach-sources) @ brooklyn-archetype-quickstart
---
[INFO] Building jar: F:\hudson\hudson-slave\workspace\incubator-brooklyn-master-windows\brooklyn-dist\archetypes\quickstart\target\brooklyn-archetype-quickstart-0.9.0-SNAPSHOT-sources.jar
[INFO] 
[INFO] --- maven-source-plugin:2.4:test-jar-no-fork (attach-sources) @ brooklyn-archetype-quickstart
---
[INFO] Building jar: F:\hudson\hudson-slave\workspace\incubator-brooklyn-master-windows\brooklyn-dist\archetypes\quickstart\target\brooklyn-archetype-quickstart-0.9.0-SNAPSHOT-test-sources.jar
[INFO] 
[INFO] --- maven-install-plugin:2.5.2:install (default-install) @ brooklyn-archetype-quickstart
---
[INFO] Installing F:\hudson\hudson-slave\workspace\incubator-brooklyn-master-windows\brooklyn-dist\archetypes\quickstart\target\brooklyn-archetype-quickstart-0.9.0-SNAPSHOT.jar
to f:\hudson\hudson-slave\maven-repositories\0\org\apache\brooklyn\brooklyn-archetype-quickstart\0.9.0-SNAPSHOT\brooklyn-archetype-quickstart-0.9.0-SNAPSHOT.jar
[INFO] Installing F:\hudson\hudson-slave\workspace\incubator-brooklyn-master-windows\brooklyn-dist\archetypes\quickstart\pom.xml
to f:\hudson\hudson-slave\maven-repositories\0\org\apache\brooklyn\brooklyn-archetype-quickstart\0.9.0-SNAPSHOT\brooklyn-archetype-quickstart-0.9.0-SNAPSHOT.pom
[INFO] Installing F:\hudson\hudson-slave\workspace\incubator-brooklyn-master-windows\brooklyn-dist\archetypes\quickstart\target\brooklyn-archetype-quickstart-0.9.0-SNAPSHOT-tests.jar
to f:\hudson\hudson-slave\maven-repositories\0\org\apache\brooklyn\brooklyn-archetype-quickstart\0.9.0-SNAPSHOT\brooklyn-archetype-quickstart-0.9.0-SNAPSHOT-tests.jar
[INFO] Installing F:\hudson\hudson-slave\workspace\incubator-brooklyn-master-windows\brooklyn-dist\archetypes\quickstart\target\brooklyn-archetype-quickstart-0.9.0-SNAPSHOT-sources.jar
to f:\hudson\hudson-slave\maven-repositories\0\org\apache\brooklyn\brooklyn-archetype-quickstart\0.9.0-SNAPSHOT\brooklyn-archetype-quickstart-0.9.0-SNAPSHOT-sources.jar
[INFO] Installing F:\hudson\hudson-slave\workspace\incubator-brooklyn-master-windows\brooklyn-dist\archetypes\quickstart\target\brooklyn-archetype-quickstart-0.9.0-SNAPSHOT-test-sources.jar
to f:\hudson\hudson-slave\maven-repositories\0\org\apache\brooklyn\brooklyn-archetype-quickstart\0.9.0-SNAPSHOT\brooklyn-archetype-quickstart-0.9.0-SNAPSHOT-test-sources.jar
[INFO] 
[INFO] --- maven-archetype-plugin:2.3:update-local-catalog (default-update-local-catalog)
@ brooklyn-archetype-quickstart ---
[JENKINS] Archiving disabled
[INFO] ------------------------------------------------------------------------
[INFO] Reactor Summary:
[INFO] 
[INFO] Brooklyn REST JavaScript Web GUI .................. SUCCESS [42.633s]
[INFO] Brooklyn Server Root .............................. SUCCESS [2.613s]
[INFO] Brooklyn Parent Project ........................... SUCCESS [4.873s]
[INFO] Brooklyn Test Support Utilities ................... SUCCESS [6.500s]
[INFO] Brooklyn Logback Includable Configuration ......... SUCCESS [0.994s]
[INFO] Brooklyn Common Utilities ......................... SUCCESS [26.938s]
[INFO] Brooklyn API ...................................... SUCCESS [2.862s]
[INFO] CAMP Server Parent Project ........................ SUCCESS [0.574s]
[INFO] CAMP Base ......................................... SUCCESS [4.645s]
[INFO] Brooklyn Test Support ............................. SUCCESS [1.676s]
[INFO] Brooklyn REST Swagger Apidoc Utilities ............ SUCCESS [11.169s]
[INFO] Brooklyn Logback Configuration .................... SUCCESS [0.876s]
[INFO] CAMP Server ....................................... SUCCESS [7.854s]
[INFO] Brooklyn OSGi Utils ............................... SUCCESS [2.751s]
[INFO] Brooklyn Felix Runtime ............................ SUCCESS [5.668s]
[INFO] Brooklyn Groovy Utilities ......................... SUCCESS [1.689s]
[INFO] Brooklyn Core ..................................... FAILURE [4:02.563s]
[INFO] Brooklyn Policies ................................. SKIPPED
[INFO] Brooklyn WinRM Software Entities .................. SKIPPED
[INFO] Brooklyn Secure JMXMP Agent ....................... SKIPPED
[INFO] Brooklyn JMX RMI Agent ............................ SUCCESS [1.486s]
[INFO] Brooklyn Jclouds Location Targets ................. SKIPPED
[INFO] Brooklyn Software Base ............................ SKIPPED
[INFO] Brooklyn CAMP REST API ............................ SKIPPED
[INFO] Brooklyn Hazelcast Storage ........................ SKIPPED
[INFO] Brooklyn REST API ................................. SUCCESS [12.435s]
[INFO] Brooklyn REST Server .............................. SKIPPED
[INFO] Brooklyn Launcher ................................. SKIPPED
[INFO] Brooklyn Command Line Interface ................... SKIPPED
[INFO] Brooklyn REST Client .............................. SKIPPED
[INFO] Brooklyn Test Framework ........................... SKIPPED
[INFO] Brooklyn Karaf .................................... SUCCESS [0.095s]
[INFO] Brooklyn Karaf Features ........................... SUCCESS [1.718s]
[INFO] Brooklyn Karaf Distro ............................. SUCCESS [19.274s]
[INFO] Brooklyn Karaf Shell Commands ..................... SUCCESS [4.631s]
[INFO] Brooklyn Karaf pax-exam itest ..................... SUCCESS [40.782s]
[INFO] Brooklyn Library Root ............................. SUCCESS [0.372s]
[INFO] Brooklyn Network Software Entities ................ SKIPPED
[INFO] Brooklyn OSGi Software Entities ................... SKIPPED
[INFO] Brooklyn Database Software Entities ............... SKIPPED
[INFO] Brooklyn Web App Software Entities ................ SKIPPED
[INFO] Brooklyn Messaging Software Entities .............. SKIPPED
[INFO] Brooklyn NoSQL Data Store Software Entities ....... SKIPPED
[INFO] Brooklyn Monitoring Software Entities ............. SKIPPED
[INFO] Brooklyn QA ....................................... SKIPPED
[INFO] Brooklyn Examples Aggregator Project .............. SUCCESS [0.301s]
[INFO] Brooklyn Examples Aggregator Project - Webapps .... SUCCESS [0.235s]
[INFO] hello-world-webapp Maven Webapp ................... SUCCESS [1.124s]
[INFO] hello-world-sql-webapp Maven Webapp ............... SUCCESS [1.851s]
[INFO] Brooklyn Simple Web Cluster Example ............... SKIPPED
[INFO] Brooklyn Global Web Fabric Example ................ SKIPPED
[INFO] Brooklyn Simple Messaging Publish-Subscribe Example  SKIPPED
[INFO] Brooklyn NoSQL Cluster Examples ................... SKIPPED
[INFO] Brooklyn Downstream Project Parent ................ SUCCESS [0.155s]
[INFO] Brooklyn Dist Root ................................ SUCCESS [0.863s]
[INFO] Brooklyn All Things ............................... SKIPPED
[INFO] Brooklyn Distribution ............................. SKIPPED
[INFO] Brooklyn Quick-Start Project Archetype ............ SUCCESS [38.881s]
[INFO] ------------------------------------------------------------------------
[INFO] BUILD FAILURE
[INFO] ------------------------------------------------------------------------
[INFO] Total time: 8:28.070s
[INFO] Finished at: Wed Dec 23 11:46:13 GMT 2015
[INFO] Final Memory: 98M/246M
[INFO] ------------------------------------------------------------------------
[JENKINS] Archiving disabled
[JENKINS] Archiving disabled
[JENKINS] Archiving disabled
[JENKINS] Archiving disabled
[JENKINS] Archiving disabled
[JENKINS] Archiving disabled
[JENKINS] Archiving disabled
[JENKINS] Archiving disabled
[JENKINS] Archiving disabled
[JENKINS] Archiving disabled
[JENKINS] Archiving disabled
[JENKINS] Archiving disabled
[JENKINS] Archiving disabled
[JENKINS] Archiving disabled
[JENKINS] Archiving disabled
[JENKINS] Archiving disabled
[JENKINS] Archiving disabled
[JENKINS] Archiving disabled
[JENKINS] Archiving disabled
[JENKINS] Archiving disabled
[JENKINS] Archiving disabled
[JENKINS] Archiving disabled
[JENKINS] Archiving disabled
[JENKINS] Archiving disabled
[JENKINS] Archiving disabled
[JENKINS] Archiving disabled
[JENKINS] Archiving disabled
[JENKINS] Archiving disabled
[JENKINS] Archiving disabled
[JENKINS] Archiving disabled
[JENKINS] Archiving disabled
[JENKINS] Archiving disabled
[JENKINS] Archiving disabled
[JENKINS] Archiving disabled
[JENKINS] Archiving disabled
[JENKINS] Archiving disabled
[JENKINS] Archiving disabled
[JENKINS] Archiving disabled
[JENKINS] Archiving disabled
[JENKINS] Archiving disabled
[JENKINS] Archiving disabled
[JENKINS] Archiving disabled
[JENKINS] Archiving disabled
[JENKINS] Archiving disabled
[JENKINS] Archiving disabled
[JENKINS] Archiving disabled
[JENKINS] Archiving disabled
[JENKINS] Archiving disabled
[JENKINS] Archiving disabled
[JENKINS] Archiving disabled
[JENKINS] Archiving disabled
[JENKINS] Archiving disabled
[JENKINS] Archiving disabled
[JENKINS] Archiving disabled
[JENKINS] Archiving disabled
[JENKINS] Archiving disabled
[JENKINS] Archiving disabled
[JENKINS] Archiving disabled
Waiting for Jenkins to finish collecting data
[ERROR] Failed to execute goal org.apache.maven.plugins:maven-surefire-plugin:2.18.1:test
(default-test) on project brooklyn-core: There are test failures.
[ERROR] 
[ERROR] Please refer to F:\hudson\hudson-slave\workspace\incubator-brooklyn-master-windows\brooklyn-server\core\target\surefire-reports
for the individual test results.
[ERROR] -> [Help 1]
[ERROR] 
[ERROR] To see the full stack trace of the errors, re-run Maven with the -e switch.
[ERROR] Re-run Maven using the -X switch to enable full debug logging.
[ERROR] 
[ERROR] For more information about the errors and possible solutions, please read the following
articles:
[ERROR] [Help 1] http://cwiki.apache.org/confluence/display/MAVEN/MojoFailureException
[ERROR] 
[ERROR] After correcting the problems, you can resume the build with the command
[ERROR]   mvn <goals> -rf :brooklyn-core
channel stopped

Mime
View raw message