brooklyn-dev mailing list archives

Site index · List index
Message view « Date » · « Thread »
Top « Date » · « Thread »
From Apache Jenkins Server <jenk...@builds.apache.org>
Subject Build failed in Jenkins: incubator-brooklyn-master-windows #386
Date Wed, 16 Dec 2015 21:41:18 GMT
See <https://builds.apache.org/job/incubator-brooklyn-master-windows/386/changes>

Changes:

[m4rkmckenna] releasePortForwarding now uses Task F/W to invoke

[m4rkmckenna] Fix SshMachineLocation.getSshHostAndPort

[m4rkmckenna] releasePortForwarding: exec all concurrently

[m4rkmckenna] Test jcloudsLocation.releasePortForwarding

[m4rkmckenna] Added licence header

[richard] Fix Getting Started button again

[graeme.miller] Ported some Clocker changes back to brooklyn. It is now possible to

[svetoslav.neykov] Proper ordering of catalog config

------------------------------------------
[...truncated 40382 lines...]
	at sun.rmi.transport.StreamRemoteCall.exceptionReceivedFromServer(StreamRemoteCall.java:273)
	at sun.rmi.transport.StreamRemoteCall.executeCall(StreamRemoteCall.java:251)
	at sun.rmi.server.UnicastRef.invoke(UnicastRef.java:160)
	at java.rmi.server.RemoteObjectInvocationHandler.invokeRemoteMethod(RemoteObjectInvocationHandler.java:194)
	at java.rmi.server.RemoteObjectInvocationHandler.invoke(RemoteObjectInvocationHandler.java:148)
	at $Proxy10.remoteCall(Unknown Source)
	at org.ops4j.pax.exam.rbc.client.intern.RemoteBundleContextClientImpl$1.invoke(RemoteBundleContextClientImpl.java:101)
	at $Proxy11.call(Unknown Source)
	at org.ops4j.pax.exam.rbc.client.intern.RemoteBundleContextClientImpl.call(RemoteBundleContextClientImpl.java:268)
	at org.ops4j.pax.exam.container.remote.RBCRemoteTarget.call(RBCRemoteTarget.java:60)
	at org.ops4j.pax.exam.karaf.container.internal.KarafTestContainer.call(KarafTestContainer.java:583)
	at org.ops4j.pax.exam.spi.reactors.EagerSingleStagedReactor.invoke(EagerSingleStagedReactor.java:109)
	at org.ops4j.pax.exam.junit.impl.ProbeRunner$2.evaluate(ProbeRunner.java:267)
	at org.junit.runners.ParentRunner.runLeaf(ParentRunner.java:325)
	at org.junit.runners.BlockJUnit4ClassRunner.runChild(BlockJUnit4ClassRunner.java:78)
	at org.junit.runners.BlockJUnit4ClassRunner.runChild(BlockJUnit4ClassRunner.java:57)
	at org.junit.runners.ParentRunner$3.run(ParentRunner.java:290)
	at org.junit.runners.ParentRunner$1.schedule(ParentRunner.java:71)
	at org.junit.runners.ParentRunner.runChildren(ParentRunner.java:288)
	at org.junit.runners.ParentRunner.access$000(ParentRunner.java:58)
	at org.junit.runners.ParentRunner$2.evaluate(ParentRunner.java:268)
	at org.junit.runners.ParentRunner.run(ParentRunner.java:363)
	at org.ops4j.pax.exam.junit.impl.ProbeRunner.run(ProbeRunner.java:98)
	at org.ops4j.pax.exam.junit.PaxExam.run(PaxExam.java:93)
	at org.apache.maven.surefire.junit4.JUnit4Provider.execute(JUnit4Provider.java:283)
	at org.apache.maven.surefire.junit4.JUnit4Provider.executeWithRerun(JUnit4Provider.java:173)
	at org.apache.maven.surefire.junit4.JUnit4Provider.executeTestSet(JUnit4Provider.java:153)
	at org.apache.maven.surefire.junit4.JUnit4Provider.invoke(JUnit4Provider.java:128)
	at org.apache.maven.surefire.booter.ForkedBooter.invokeProviderInSameClassLoader(ForkedBooter.java:203)
	at org.apache.maven.surefire.booter.ForkedBooter.runSuitesInProcess(ForkedBooter.java:155)
	at org.apache.maven.surefire.booter.ForkedBooter.main(ForkedBooter.java:103)

checkEventFeature(org.apache.brooklyn.AssemblyTest)  Time elapsed: 180.005 sec  <<<
ERROR!
org.ops4j.pax.swissbox.tracker.ServiceLookupException: gave up waiting for service org.ops4j.pax.exam.ProbeInvoker
	at org.ops4j.pax.swissbox.tracker.ServiceLookup.getService(ServiceLookup.java:199)
	at org.ops4j.pax.swissbox.tracker.ServiceLookup.getService(ServiceLookup.java:136)
	at org.ops4j.pax.exam.rbc.internal.RemoteBundleContextImpl.remoteCall(RemoteBundleContextImpl.java:79)
	at sun.reflect.NativeMethodAccessorImpl.invoke0(Native Method)
	at sun.reflect.NativeMethodAccessorImpl.invoke(NativeMethodAccessorImpl.java:57)
	at sun.reflect.DelegatingMethodAccessorImpl.invoke(DelegatingMethodAccessorImpl.java:43)
	at java.lang.reflect.Method.invoke(Method.java:601)
	at sun.rmi.server.UnicastServerRef.dispatch(UnicastServerRef.java:322)
	at sun.rmi.transport.Transport$1.run(Transport.java:177)
	at sun.rmi.transport.Transport$1.run(Transport.java:174)
	at java.security.AccessController.doPrivileged(Native Method)
	at sun.rmi.transport.Transport.serviceCall(Transport.java:173)
	at sun.rmi.transport.tcp.TCPTransport.handleMessages(TCPTransport.java:553)
	at sun.rmi.transport.tcp.TCPTransport$ConnectionHandler.run0(TCPTransport.java:808)
	at sun.rmi.transport.tcp.TCPTransport$ConnectionHandler.run(TCPTransport.java:667)
	at java.util.concurrent.ThreadPoolExecutor.runWorker(ThreadPoolExecutor.java:1110)
	at java.util.concurrent.ThreadPoolExecutor$Worker.run(ThreadPoolExecutor.java:603)
	at java.lang.Thread.run(Thread.java:722)
	at sun.rmi.transport.StreamRemoteCall.exceptionReceivedFromServer(StreamRemoteCall.java:273)
	at sun.rmi.transport.StreamRemoteCall.executeCall(StreamRemoteCall.java:251)
	at sun.rmi.server.UnicastRef.invoke(UnicastRef.java:160)
	at java.rmi.server.RemoteObjectInvocationHandler.invokeRemoteMethod(RemoteObjectInvocationHandler.java:194)
	at java.rmi.server.RemoteObjectInvocationHandler.invoke(RemoteObjectInvocationHandler.java:148)
	at $Proxy10.remoteCall(Unknown Source)
	at org.ops4j.pax.exam.rbc.client.intern.RemoteBundleContextClientImpl$1.invoke(RemoteBundleContextClientImpl.java:101)
	at $Proxy11.call(Unknown Source)
	at org.ops4j.pax.exam.rbc.client.intern.RemoteBundleContextClientImpl.call(RemoteBundleContextClientImpl.java:268)
	at org.ops4j.pax.exam.container.remote.RBCRemoteTarget.call(RBCRemoteTarget.java:60)
	at org.ops4j.pax.exam.karaf.container.internal.KarafTestContainer.call(KarafTestContainer.java:583)
	at org.ops4j.pax.exam.spi.reactors.EagerSingleStagedReactor.invoke(EagerSingleStagedReactor.java:109)
	at org.ops4j.pax.exam.junit.impl.ProbeRunner$2.evaluate(ProbeRunner.java:267)
	at org.junit.runners.ParentRunner.runLeaf(ParentRunner.java:325)
	at org.junit.runners.BlockJUnit4ClassRunner.runChild(BlockJUnit4ClassRunner.java:78)
	at org.junit.runners.BlockJUnit4ClassRunner.runChild(BlockJUnit4ClassRunner.java:57)
	at org.junit.runners.ParentRunner$3.run(ParentRunner.java:290)
	at org.junit.runners.ParentRunner$1.schedule(ParentRunner.java:71)
	at org.junit.runners.ParentRunner.runChildren(ParentRunner.java:288)
	at org.junit.runners.ParentRunner.access$000(ParentRunner.java:58)
	at org.junit.runners.ParentRunner$2.evaluate(ParentRunner.java:268)
	at org.junit.runners.ParentRunner.run(ParentRunner.java:363)
	at org.ops4j.pax.exam.junit.impl.ProbeRunner.run(ProbeRunner.java:98)
	at org.ops4j.pax.exam.junit.PaxExam.run(PaxExam.java:93)
	at org.apache.maven.surefire.junit4.JUnit4Provider.execute(JUnit4Provider.java:283)
	at org.apache.maven.surefire.junit4.JUnit4Provider.executeWithRerun(JUnit4Provider.java:173)
	at org.apache.maven.surefire.junit4.JUnit4Provider.executeTestSet(JUnit4Provider.java:153)
	at org.apache.maven.surefire.junit4.JUnit4Provider.invoke(JUnit4Provider.java:128)
	at org.apache.maven.surefire.booter.ForkedBooter.invokeProviderInSameClassLoader(ForkedBooter.java:203)
	at org.apache.maven.surefire.booter.ForkedBooter.runSuitesInProcess(ForkedBooter.java:155)
	at org.apache.maven.surefire.booter.ForkedBooter.main(ForkedBooter.java:103)


Results :

Tests in error: 
  AssemblyTest.checkBrooklynCoreFeature » ServiceLookup gave up waiting for serv...
  AssemblyTest.checkEventFeature » ServiceLookup gave up waiting for service org...
  AssemblyTest.shouldHaveBundleContext » ServiceLookup gave up waiting for servi...

Tests run: 3, Failures: 0, Errors: 3, Skipped: 0

[ERROR] There are test failures.

Please refer to F:\hudson\hudson-slave\workspace\incubator-brooklyn-master-windows\karaf\itest\target\surefire-reports
for the individual test results.
[JENKINS] Recording test results
[INFO] 
[INFO] --- maven-jar-plugin:2.5:jar (default-jar) @ brooklyn-itest ---
[INFO] Building jar: F:\hudson\hudson-slave\workspace\incubator-brooklyn-master-windows\karaf\itest\target\brooklyn-itest-0.9.0-SNAPSHOT.jar
[INFO] 
[INFO] --- maven-site-plugin:3.4:attach-descriptor (attach-descriptor) @ brooklyn-itest ---
[INFO] 
[INFO] --- maven-install-plugin:2.5.2:install (default-install) @ brooklyn-itest ---
[INFO] Installing F:\hudson\hudson-slave\workspace\incubator-brooklyn-master-windows\karaf\itest\target\brooklyn-itest-0.9.0-SNAPSHOT.jar
to f:\hudson\hudson-slave\maven-repositories\0\org\apache\brooklyn\brooklyn-itest\0.9.0-SNAPSHOT\brooklyn-itest-0.9.0-SNAPSHOT.jar
[INFO] Installing F:\hudson\hudson-slave\workspace\incubator-brooklyn-master-windows\karaf\itest\pom.xml
to f:\hudson\hudson-slave\maven-repositories\0\org\apache\brooklyn\brooklyn-itest\0.9.0-SNAPSHOT\brooklyn-itest-0.9.0-SNAPSHOT.pom
[JENKINS] Archiving disabled
[INFO]                                                                         
[INFO] ------------------------------------------------------------------------
[INFO] Skipping Brooklyn Hazelcast Storage
[INFO] This project has been banned from the build due to previous failures.
[INFO] ------------------------------------------------------------------------
[INFO]                                                                         
[INFO] ------------------------------------------------------------------------
[INFO] Skipping Brooklyn Distribution
[INFO] This project has been banned from the build due to previous failures.
[INFO] ------------------------------------------------------------------------
[INFO]                                                                         
[INFO] ------------------------------------------------------------------------
[INFO] Skipping Brooklyn QA
[INFO] This project has been banned from the build due to previous failures.
[INFO] ------------------------------------------------------------------------
[INFO]                                                                         
[INFO] ------------------------------------------------------------------------
[INFO] Skipping Brooklyn REST Client
[INFO] This project has been banned from the build due to previous failures.
[INFO] ------------------------------------------------------------------------
[INFO] ------------------------------------------------------------------------
[INFO] Reactor Summary:
[INFO] 
[INFO] Brooklyn Root ..................................... SUCCESS [2.057s]
[INFO] Brooklyn Parent Project ........................... SUCCESS [6.125s]
[INFO] Brooklyn Test Support Utilities ................... SUCCESS [7.186s]
[INFO] Brooklyn Logback Includable Configuration ......... SUCCESS [1.152s]
[INFO] Brooklyn Common Utilities ......................... SUCCESS [25.602s]
[INFO] Brooklyn API ...................................... SUCCESS [3.855s]
[INFO] Brooklyn Test Support ............................. SUCCESS [1.698s]
[INFO] Brooklyn Downstream Project Parent ................ SUCCESS [0.226s]
[INFO] CAMP Base ......................................... SUCCESS [3.877s]
[INFO] Brooklyn REST Swagger Apidoc Utilities ............ SUCCESS [12.650s]
[INFO] CAMP Server ....................................... SUCCESS [10.763s]
[INFO] Brooklyn OSGi Utils ............................... SUCCESS [3.250s]
[INFO] Brooklyn Felix Runtime ............................ SUCCESS [5.222s]
[INFO] Brooklyn Groovy Utilities ......................... SUCCESS [1.251s]
[INFO] Brooklyn Core ..................................... FAILURE [6:28.144s]
[INFO] Brooklyn Policies ................................. SKIPPED
[INFO] Brooklyn WinRM Software Entities .................. SKIPPED
[INFO] Brooklyn Jclouds Location Targets ................. SKIPPED
[INFO] Brooklyn Secure JMXMP Agent ....................... SKIPPED
[INFO] Brooklyn JMX RMI Agent ............................ SUCCESS [1.784s]
[INFO] Brooklyn Software Base ............................ SKIPPED
[INFO] Brooklyn Web App Software Entities ................ SKIPPED
[INFO] Brooklyn Messaging Software Entities .............. SKIPPED
[INFO] Brooklyn Database Software Entities ............... SKIPPED
[INFO] Brooklyn Monitoring Software Entities ............. SKIPPED
[INFO] Brooklyn OSGi Software Entities ................... SKIPPED
[INFO] Brooklyn NoSQL Data Store Software Entities ....... SKIPPED
[INFO] Brooklyn Network Software Entities ................ SKIPPED
[INFO] Brooklyn REST API ................................. SUCCESS [14.101s]
[INFO] Brooklyn CAMP REST API ............................ SKIPPED
[INFO] Brooklyn REST Server .............................. SKIPPED
[INFO] Brooklyn REST JavaScript Web GUI .................. SKIPPED
[INFO] Brooklyn Launcher ................................. SKIPPED
[INFO] Brooklyn Command Line Interface ................... SKIPPED
[INFO] Brooklyn Test Framework ........................... SKIPPED
[INFO] Brooklyn All Things ............................... SKIPPED
[INFO] Brooklyn Simple Web Cluster Example ............... SKIPPED
[INFO] Brooklyn Global Web Fabric Example ................ SKIPPED
[INFO] Brooklyn Simple Messaging Publish-Subscribe Example  SKIPPED
[INFO] Brooklyn NoSQL Cluster Examples ................... SKIPPED
[INFO] Brooklyn Karaf .................................... SUCCESS [0.077s]
[INFO] Brooklyn Karaf Features ........................... SUCCESS [1.725s]
[INFO] Brooklyn Karaf Distro ............................. SUCCESS [20.553s]
[INFO] Brooklyn Karaf pax-exam itest ..................... SUCCESS [11:12.931s]
[INFO] Brooklyn Hazelcast Storage ........................ SKIPPED
[INFO] Brooklyn Distribution ............................. SKIPPED
[INFO] Brooklyn QA ....................................... SKIPPED
[INFO] Brooklyn REST Client .............................. SKIPPED
[INFO] ------------------------------------------------------------------------
[INFO] BUILD FAILURE
[INFO] ------------------------------------------------------------------------
[INFO] Total time: 20:00.647s
[INFO] Finished at: Wed Dec 16 21:41:05 GMT 2015
[INFO] Final Memory: 81M/246M
[INFO] ------------------------------------------------------------------------
[JENKINS] Archiving disabled
[JENKINS] Archiving disabled
[JENKINS] Archiving disabled
[JENKINS] Archiving disabled
[JENKINS] Archiving disabled
[JENKINS] Archiving disabled
[JENKINS] Archiving disabled
[JENKINS] Archiving disabled
[JENKINS] Archiving disabled
[JENKINS] Archiving disabled
[JENKINS] Archiving disabled
[JENKINS] Archiving disabled
[JENKINS] Archiving disabled
[JENKINS] Archiving disabled
[JENKINS] Archiving disabled
[JENKINS] Archiving disabled
[JENKINS] Archiving disabled
[JENKINS] Archiving disabled
[JENKINS] Archiving disabled
[JENKINS] Archiving disabled
[JENKINS] Archiving disabled
[JENKINS] Archiving disabled
[JENKINS] Archiving disabled
[JENKINS] Archiving disabled
[JENKINS] Archiving disabled
[JENKINS] Archiving disabled
[JENKINS] Archiving disabled
[JENKINS] Archiving disabled
[JENKINS] Archiving disabled
[JENKINS] Archiving disabled
[JENKINS] Archiving disabled
[JENKINS] Archiving disabled
[JENKINS] Archiving disabled
[JENKINS] Archiving disabled
[JENKINS] Archiving disabled
[JENKINS] Archiving disabled
[JENKINS] Archiving disabled
[JENKINS] Archiving disabled
[JENKINS] Archiving disabled
[JENKINS] Archiving disabled
[JENKINS] Archiving disabled
[JENKINS] Archiving disabled
[JENKINS] Archiving disabled
[JENKINS] Archiving disabled
[JENKINS] Archiving disabled
[JENKINS] Archiving disabled
[JENKINS] Archiving disabled
[JENKINS] Archiving disabled
Waiting for Jenkins to finish collecting data
[ERROR] Failed to execute goal org.apache.maven.plugins:maven-surefire-plugin:2.18.1:test
(default-test) on project brooklyn-core: There are test failures.
[ERROR] 
[ERROR] Please refer to F:\hudson\hudson-slave\workspace\incubator-brooklyn-master-windows\core\target\surefire-reports
for the individual test results.
[ERROR] -> [Help 1]
[ERROR] 
[ERROR] To see the full stack trace of the errors, re-run Maven with the -e switch.
[ERROR] Re-run Maven using the -X switch to enable full debug logging.
[ERROR] 
[ERROR] For more information about the errors and possible solutions, please read the following
articles:
[ERROR] [Help 1] http://cwiki.apache.org/confluence/display/MAVEN/MojoFailureException
[ERROR] 
[ERROR] After correcting the problems, you can resume the build with the command
[ERROR]   mvn <goals> -rf :brooklyn-core
channel stopped

Mime
View raw message