brooklyn-dev mailing list archives

Site index · List index
Message view « Date » · « Thread »
Top « Date » · « Thread »
From Apache Jenkins Server <jenk...@builds.apache.org>
Subject Build failed in Jenkins: incubator-brooklyn-master-windows #376
Date Tue, 01 Dec 2015 19:28:06 GMT
See <https://builds.apache.org/job/incubator-brooklyn-master-windows/376/changes>

Changes:

[github] Guards against blank string in mysql.datadir

------------------------------------------
[...truncated 27043 lines...]
18:56:55,582 | INFO  | pool-12-thread-1 | rnal.service.FeaturesServiceImpl 1116 | 7 - org.apache.karaf.features.core
- 4.0.3 |   mvn:org.eclipse.jetty.websocket/websocket-servlet/9.2.10.v20150310
18:56:55,585 | INFO  | pool-12-thread-1 | rnal.service.FeaturesServiceImpl 1116 | 7 - org.apache.karaf.features.core
- 4.0.3 |   mvn:org.eclipse.jetty/jetty-xml/9.2.10.v20150310
18:56:55,588 | INFO  | pool-12-thread-1 | rnal.service.FeaturesServiceImpl 1116 | 7 - org.apache.karaf.features.core
- 4.0.3 |   mvn:org.freemarker/freemarker/2.3.22
18:56:55,601 | INFO  | pool-12-thread-1 | rnal.service.FeaturesServiceImpl 1116 | 7 - org.apache.karaf.features.core
- 4.0.3 |   mvn:org.jledit/core/0.2.1
18:56:55,605 | INFO  | pool-12-thread-1 | rnal.service.FeaturesServiceImpl 1116 | 7 - org.apache.karaf.features.core
- 4.0.3 |   mvn:org.jvnet.mimepull/mimepull/1.9.3
18:56:55,608 | INFO  | pool-12-thread-1 | rnal.service.FeaturesServiceImpl 1116 | 7 - org.apache.karaf.features.core
- 4.0.3 |   mvn:org.ow2.asm/asm-all/5.0.4
18:56:55,613 | INFO  | pool-12-thread-1 | rnal.service.FeaturesServiceImpl 1116 | 7 - org.apache.karaf.features.core
- 4.0.3 |   mvn:org.ops4j.base/ops4j-base-io/1.5.0
18:56:55,645 | INFO  | pool-12-thread-1 | rnal.service.FeaturesServiceImpl 1116 | 7 - org.apache.karaf.features.core
- 4.0.3 |   mvn:org.ops4j.base/ops4j-base-lang/1.5.0
18:56:55,649 | INFO  | pool-12-thread-1 | rnal.service.FeaturesServiceImpl 1116 | 7 - org.apache.karaf.features.core
- 4.0.3 |   mvn:org.ops4j.base/ops4j-base-monitors/1.5.0
18:56:55,652 | INFO  | pool-12-thread-1 | rnal.service.FeaturesServiceImpl 1116 | 7 - org.apache.karaf.features.core
- 4.0.3 |   mvn:org.ops4j.base/ops4j-base-net/1.5.0
18:56:55,655 | INFO  | pool-12-thread-1 | rnal.service.FeaturesServiceImpl 1116 | 7 - org.apache.karaf.features.core
- 4.0.3 |   mvn:org.ops4j.base/ops4j-base-spi/1.5.0
18:56:55,658 | INFO  | pool-12-thread-1 | rnal.service.FeaturesServiceImpl 1116 | 7 - org.apache.karaf.features.core
- 4.0.3 |   mvn:org.ops4j.base/ops4j-base-store/1.5.0
18:56:55,661 | INFO  | pool-12-thread-1 | rnal.service.FeaturesServiceImpl 1116 | 7 - org.apache.karaf.features.core
- 4.0.3 |   mvn:org.ops4j.base/ops4j-base-util-property/1.5.0
18:56:55,664 | INFO  | pool-12-thread-1 | rnal.service.FeaturesServiceImpl 1116 | 7 - org.apache.karaf.features.core
- 4.0.3 |   mvn:org.ops4j.pax.exam/pax-exam/4.6.0
18:56:55,668 | INFO  | pool-12-thread-1 | rnal.service.FeaturesServiceImpl 1116 | 7 - org.apache.karaf.features.core
- 4.0.3 |   mvn:org.ops4j.pax.exam/pax-exam-extender-service/4.6.0
18:56:55,672 | INFO  | pool-12-thread-1 | rnal.service.FeaturesServiceImpl 1116 | 7 - org.apache.karaf.features.core
- 4.0.3 |   mvn:org.ops4j.pax.exam/pax-exam-inject/4.6.0
18:56:55,675 | INFO  | pool-12-thread-1 | rnal.service.FeaturesServiceImpl 1116 | 7 - org.apache.karaf.features.core
- 4.0.3 |   mvn:org.ops4j.pax.exam/pax-exam-invoker-junit/4.6.0
18:56:55,678 | INFO  | pool-12-thread-1 | rnal.service.FeaturesServiceImpl 1116 | 7 - org.apache.karaf.features.core
- 4.0.3 |   mvn:org.ops4j.pax.exam/pax-exam-container-rbc/4.6.0
18:56:55,681 | INFO  | pool-12-thread-1 | rnal.service.FeaturesServiceImpl 1116 | 7 - org.apache.karaf.features.core
- 4.0.3 |   mvn:org.ops4j.pax.swissbox/pax-swissbox-core/1.8.1
18:56:55,699 | INFO  | pool-12-thread-1 | rnal.service.FeaturesServiceImpl 1116 | 7 - org.apache.karaf.features.core
- 4.0.3 |   mvn:org.ops4j.pax.swissbox/pax-swissbox-extender/1.8.1
18:56:55,702 | INFO  | pool-12-thread-1 | rnal.service.FeaturesServiceImpl 1116 | 7 - org.apache.karaf.features.core
- 4.0.3 |   mvn:org.ops4j.pax.swissbox/pax-swissbox-framework/1.8.1
18:56:55,705 | INFO  | pool-12-thread-1 | rnal.service.FeaturesServiceImpl 1116 | 7 - org.apache.karaf.features.core
- 4.0.3 |   mvn:org.ops4j.pax.swissbox/pax-swissbox-lifecycle/1.8.1
18:56:55,708 | INFO  | pool-12-thread-1 | rnal.service.FeaturesServiceImpl 1116 | 7 - org.apache.karaf.features.core
- 4.0.3 |   mvn:org.ops4j.pax.swissbox/pax-swissbox-tracker/1.8.1
18:56:55,712 | INFO  | pool-12-thread-1 | rnal.service.FeaturesServiceImpl 1116 | 7 - org.apache.karaf.features.core
- 4.0.3 |   mvn:org.ops4j.pax.tipi/org.ops4j.pax.tipi.hamcrest.core/1.3.0.1
18:56:55,715 | INFO  | pool-12-thread-1 | rnal.service.FeaturesServiceImpl 1116 | 7 - org.apache.karaf.features.core
- 4.0.3 |   mvn:org.ops4j.pax.tipi/org.ops4j.pax.tipi.junit/4.12.0.1
18:56:55,734 | INFO  | pool-12-thread-1 | rnal.service.FeaturesServiceImpl 1116 | 7 - org.apache.karaf.features.core
- 4.0.3 |   mvn:org.ops4j.pax.url/pax-url-war/2.4.2/jar/uber
18:56:55,746 | INFO  | pool-12-thread-1 | rnal.service.FeaturesServiceImpl 1116 | 7 - org.apache.karaf.features.core
- 4.0.3 |   mvn:org.ops4j.pax.web/pax-web-api/4.2.3
18:56:55,750 | INFO  | pool-12-thread-1 | rnal.service.FeaturesServiceImpl 1116 | 7 - org.apache.karaf.features.core
- 4.0.3 |   mvn:org.ops4j.pax.web/pax-web-deployer/4.2.3
18:56:55,754 | INFO  | pool-12-thread-1 | rnal.service.FeaturesServiceImpl 1116 | 7 - org.apache.karaf.features.core
- 4.0.3 |   mvn:org.ops4j.pax.web/pax-web-extender-war/4.2.3
18:56:55,759 | INFO  | pool-12-thread-1 | rnal.service.FeaturesServiceImpl 1116 | 7 - org.apache.karaf.features.core
- 4.0.3 |   mvn:org.ops4j.pax.web/pax-web-extender-whiteboard/4.2.3
18:56:55,764 | INFO  | pool-12-thread-1 | rnal.service.FeaturesServiceImpl 1116 | 7 - org.apache.karaf.features.core
- 4.0.3 |   mvn:org.ops4j.pax.web/pax-web-jetty/4.2.3
18:56:55,775 | INFO  | pool-12-thread-1 | rnal.service.FeaturesServiceImpl 1116 | 7 - org.apache.karaf.features.core
- 4.0.3 |   mvn:org.ops4j.pax.web/pax-web-jsp/4.2.3
18:56:55,825 | INFO  | pool-12-thread-1 | rnal.service.FeaturesServiceImpl 1116 | 7 - org.apache.karaf.features.core
- 4.0.3 |   mvn:org.ops4j.pax.web/pax-web-runtime/4.2.3
18:56:55,830 | INFO  | pool-12-thread-1 | rnal.service.FeaturesServiceImpl 1116 | 7 - org.apache.karaf.features.core
- 4.0.3 |   mvn:org.ops4j.pax.web/pax-web-spi/4.2.3
18:56:55,835 | INFO  | pool-12-thread-1 | rnal.service.FeaturesServiceImpl 1116 | 7 - org.apache.karaf.features.core
- 4.0.3 |   wrap:mvn:org.tukaani/xz/1.4
18:56:55,839 | INFO  | pool-12-thread-1 | rnal.service.FeaturesServiceImpl 1116 | 7 - org.apache.karaf.features.core
- 4.0.3 |   mvn:org.yaml/snakeyaml/1.11
18:56:55,844 | INFO  | pool-12-thread-1 | rnal.service.FeaturesServiceImpl 1116 | 7 - org.apache.karaf.features.core
- 4.0.3 |   wrap:mvn:com.google.http-client/google-http-client/1.18.0-rc
18:56:55,849 | INFO  | pool-12-thread-1 | rnal.service.FeaturesServiceImpl 1116 | 7 - org.apache.karaf.features.core
- 4.0.3 |   wrap:mvn:com.maxmind.geoip2/geoip2/0.8.1
18:56:55,852 | INFO  | pool-12-thread-1 | rnal.service.FeaturesServiceImpl 1116 | 7 - org.apache.karaf.features.core
- 4.0.3 |   wrap:mvn:xpp3/xpp3_min/1.1.4c
18:56:55,854 | INFO  | pool-12-thread-1 | rnal.service.FeaturesServiceImpl 1116 | 7 - org.apache.karaf.features.core
- 4.0.3 |   mvn:com.thoughtworks.xstream/xstream/1.4.7
18:56:55,917 | INFO  | pool-12-thread-1 | l.service.FeatureConfigInstaller  205 | 7 - org.apache.karaf.features.core
- 4.0.3 | Creating configuration file /F:/hudson/hudson-slave/workspace/incubator-brooklyn-master-windows/karaf/itest/target/paxexam/unpack/84726d6e-c584-4a94-8067-ec795d65bb9d/\/etc/jetty.xml
18:56:55,925 | INFO  | pool-12-thread-1 | rnal.service.FeaturesServiceImpl 1116 | 7 - org.apache.karaf.features.core
- 4.0.3 | Stopping bundles:
18:56:55,931 | INFO  | pool-12-thread-1 | rnal.service.FeaturesServiceImpl 1116 | 7 - org.apache.karaf.features.core
- 4.0.3 |   org.apache.sshd.core/0.14.0
18:56:55,938 | INFO  | pool-12-thread-1 | rnal.service.FeaturesServiceImpl 1116 | 7 - org.apache.karaf.features.core
- 4.0.3 |   org.apache.karaf.features.core/4.0.3
18:56:55,964 | INFO  | pool-12-thread-1 | rnal.service.FeaturesServiceImpl 1116 | 7 - org.apache.karaf.features.core
- 4.0.3 |   org.apache.felix.fileinstall/3.5.0
18:56:55,968 | INFO  | pool-12-thread-1 | rnal.service.FeaturesServiceImpl 1116 | 7 - org.apache.karaf.features.core
- 4.0.3 |   org.apache.felix.configadmin/1.8.8
18:56:55,970 | INFO  | pool-12-thread-1 | rnal.service.FeaturesServiceImpl 1116 | 7 - org.apache.karaf.features.core
- 4.0.3 |   org.ops4j.pax.logging.pax-logging-api/1.8.4
18:56:55,970 | INFO  | pool-12-thread-1 | j.pax.logging.internal.Activator   59 | 1 - org.ops4j.pax.logging.pax-logging-api
- 1.8.4 | Disabling SLF4J API support.
18:56:55,970 | INFO  | pool-12-thread-1 | j.pax.logging.internal.Activator   62 | 1 - org.ops4j.pax.logging.pax-logging-api
- 1.8.4 | Disabling Jakarta Commons Logging API support.
18:56:55,970 | INFO  | pool-12-thread-1 | j.pax.logging.internal.Activator   65 | 1 - org.ops4j.pax.logging.pax-logging-api
- 1.8.4 | Disabling Log4J API support.
18:56:55,971 | INFO  | pool-12-thread-1 | j.pax.logging.internal.Activator   68 | 1 - org.ops4j.pax.logging.pax-logging-api
- 1.8.4 | Disabling Avalon Logger API support.
18:56:55,971 | INFO  | pool-12-thread-1 | j.pax.logging.internal.Activator   71 | 1 - org.ops4j.pax.logging.pax-logging-api
- 1.8.4 | Disabling JULI Logger API support.
org.apache.karaf.features.core[org.apache.karaf.features.internal.service.BootFeaturesInstaller]
: Error installing boot features
org.apache.karaf.features.internal.util.MultiException: Error restarting bundles
	at org.apache.karaf.features.internal.service.Deployer.deploy(Deployer.java:844)
	at org.apache.karaf.features.internal.service.FeaturesServiceImpl.doProvision(FeaturesServiceImpl.java:1079)
	at org.apache.karaf.features.internal.service.FeaturesServiceImpl$1.call(FeaturesServiceImpl.java:975)
	at java.util.concurrent.FutureTask$Sync.innerRun(FutureTask.java:334)
	at java.util.concurrent.FutureTask.run(FutureTask.java:166)
	at java.util.concurrent.ThreadPoolExecutor.runWorker(ThreadPoolExecutor.java:1110)
	at java.util.concurrent.ThreadPoolExecutor$Worker.run(ThreadPoolExecutor.java:603)
	at java.lang.Thread.run(Thread.java:722)
	Suppressed: org.osgi.framework.BundleException: Activator start error in bundle org.apache.felix.metatype
[72].
		at org.apache.felix.framework.Felix.activateBundle(Felix.java:2276)
		at org.apache.felix.framework.Felix.startBundle(Felix.java:2144)
		at org.apache.felix.framework.BundleImpl.start(BundleImpl.java:998)
		at org.apache.felix.framework.BundleImpl.start(BundleImpl.java:984)
		at org.apache.karaf.features.internal.service.FeaturesServiceImpl.startBundle(FeaturesServiceImpl.java:1189)
		at org.apache.karaf.features.internal.service.Deployer.deploy(Deployer.java:836)
		... 7 more
	Caused by: java.lang.IllegalStateException: Unknown protocol: mvn
		at org.apache.felix.framework.URLHandlersStreamHandlerProxy.toExternalForm(URLHandlersStreamHandlerProxy.java:482)
		at org.apache.felix.framework.URLHandlersStreamHandlerProxy.toExternalForm(URLHandlersStreamHandlerProxy.java:474)
		at java.net.URL.toExternalForm(URL.java:919)
		at java.net.URL.toString(URL.java:905)
		at java.lang.ClassLoader.defineClassSourceLocation(ClassLoader.java:667)
		at java.lang.ClassLoader.defineClass(ClassLoader.java:788)
		at org.apache.felix.framework.BundleWiringImpl$BundleClassLoader.defineClass(BundleWiringImpl.java:2370)
		at org.apache.felix.framework.BundleWiringImpl$BundleClassLoader.findClass(BundleWiringImpl.java:2154)
		at org.apache.felix.framework.BundleWiringImpl.findClassOrResourceByDelegation(BundleWiringImpl.java:1542)
		at org.apache.felix.framework.BundleWiringImpl.access$400(BundleWiringImpl.java:79)
		at org.apache.felix.framework.BundleWiringImpl$BundleClassLoader.loadClass(BundleWiringImpl.java:2018)
		at java.lang.ClassLoader.loadClass(ClassLoader.java:356)
		at org.apache.felix.framework.BundleWiringImpl.getClassByDelegation(BundleWiringImpl.java:1415)
		at org.apache.felix.framework.Felix.createBundleActivator(Felix.java:4468)
		at org.apache.felix.framework.Felix.activateBundle(Felix.java:2221)
		... 12 more
Exception in thread "Thread-29" java.lang.NullPointerException
	at org.apache.felix.framework.BundleWiringImpl.searchImports(BundleWiringImpl.java:1595)
	at org.apache.felix.framework.BundleWiringImpl.findClassOrResourceByDelegation(BundleWiringImpl.java:1525)
	at org.apache.felix.framework.BundleWiringImpl.access$400(BundleWiringImpl.java:79)
	at org.apache.felix.framework.BundleWiringImpl$BundleClassLoader.loadClass(BundleWiringImpl.java:2018)
	at java.lang.ClassLoader.loadClass(ClassLoader.java:356)
	at org.apache.brooklyn.util.text.Strings.lengthComparator(Strings.java:854)
	at org.apache.brooklyn.util.os.Os$1.run(Os.java:328)
18:57:17.144 [main] INFO  o.o.p.e.spi.reactors.ReactorManager - suite finished
Tests run: 3, Failures: 0, Errors: 0, Skipped: 0, Time elapsed: 51.22 sec - in org.apache.brooklyn.AssemblyTest

Results :

Tests run: 3, Failures: 0, Errors: 0, Skipped: 0

[JENKINS] Recording test results
[INFO] 
[INFO] --- maven-jar-plugin:2.5:jar (default-jar) @ brooklyn-itest ---
[INFO] Building jar: F:\hudson\hudson-slave\workspace\incubator-brooklyn-master-windows\karaf\itest\target\brooklyn-itest-0.9.0-SNAPSHOT.jar
[INFO] 
[INFO] --- maven-site-plugin:3.4:attach-descriptor (attach-descriptor) @ brooklyn-itest ---
[INFO] 
[INFO] --- maven-install-plugin:2.5.2:install (default-install) @ brooklyn-itest ---
[INFO] Installing F:\hudson\hudson-slave\workspace\incubator-brooklyn-master-windows\karaf\itest\target\brooklyn-itest-0.9.0-SNAPSHOT.jar
to f:\hudson\hudson-slave\maven-repositories\0\org\apache\brooklyn\brooklyn-itest\0.9.0-SNAPSHOT\brooklyn-itest-0.9.0-SNAPSHOT.jar
[INFO] Installing F:\hudson\hudson-slave\workspace\incubator-brooklyn-master-windows\karaf\itest\pom.xml
to f:\hudson\hudson-slave\maven-repositories\0\org\apache\brooklyn\brooklyn-itest\0.9.0-SNAPSHOT\brooklyn-itest-0.9.0-SNAPSHOT.pom
[JENKINS] Archiving disabled
[INFO]                                                                         
[INFO] ------------------------------------------------------------------------
[INFO] Skipping Brooklyn Distribution
[INFO] This project has been banned from the build due to previous failures.
[INFO] ------------------------------------------------------------------------
[INFO]                                                                         
[INFO] ------------------------------------------------------------------------
[INFO] Skipping Brooklyn QA
[INFO] This project has been banned from the build due to previous failures.
[INFO] ------------------------------------------------------------------------
[INFO]                                                                         
[INFO] ------------------------------------------------------------------------
[INFO] Skipping Brooklyn REST Client
[INFO] This project has been banned from the build due to previous failures.
[INFO] ------------------------------------------------------------------------
[INFO] ------------------------------------------------------------------------
[INFO] Reactor Summary:
[INFO] 
[INFO] Brooklyn Root ..................................... SUCCESS [3.338s]
[INFO] Brooklyn Parent Project ........................... SUCCESS [10.889s]
[INFO] Brooklyn Logback Configuration .................... SUCCESS [6.086s]
[INFO] Brooklyn Test Support Utilities ................... SUCCESS [10.934s]
[INFO] Brooklyn Logback Includable Configuration ......... SUCCESS [1.380s]
[INFO] Brooklyn Common Utilities ......................... SUCCESS [33.445s]
[INFO] Brooklyn API ...................................... SUCCESS [5.559s]
[INFO] Brooklyn Test Support ............................. SUCCESS [3.456s]
[INFO] CAMP Server Parent Project ........................ SUCCESS [0.415s]
[INFO] CAMP Base ......................................... SUCCESS [11.649s]
[INFO] Brooklyn REST Swagger Apidoc Utilities ............ SUCCESS [30.621s]
[INFO] CAMP Server ....................................... SUCCESS [13.832s]
[INFO] Brooklyn OSGi Utils ............................... SUCCESS [5.641s]
[INFO] Brooklyn Felix Runtime ............................ SUCCESS [7.801s]
[INFO] Brooklyn Groovy Utilities ......................... SUCCESS [1.757s]
[INFO] Brooklyn Core ..................................... SUCCESS [8:19.866s]
[INFO] Brooklyn Policies ................................. SUCCESS [2:53.162s]
[INFO] Brooklyn WinRM Software Entities .................. SUCCESS [16.968s]
[INFO] Brooklyn Jclouds Location Targets ................. SUCCESS [1:02.786s]
[INFO] Brooklyn Secure JMXMP Agent ....................... SUCCESS [14.298s]
[INFO] Brooklyn JMX RMI Agent ............................ SUCCESS [2.094s]
[INFO] Brooklyn Software Base ............................ SUCCESS [2:39.442s]
[INFO] Brooklyn Web App Software Entities ................ FAILURE [2:48.798s]
[INFO] Brooklyn Messaging Software Entities .............. SUCCESS [17.570s]
[INFO] Brooklyn Database Software Entities ............... SUCCESS [18.374s]
[INFO] Brooklyn Monitoring Software Entities ............. SUCCESS [11.300s]
[INFO] Brooklyn OSGi Software Entities ................... SUCCESS [12.822s]
[INFO] Brooklyn NoSQL Data Store Software Entities ....... SKIPPED
[INFO] Brooklyn Network Software Entities ................ SUCCESS [10.084s]
[INFO] Brooklyn REST API ................................. SUCCESS [9.615s]
[INFO] Brooklyn CAMP REST API ............................ SKIPPED
[INFO] Brooklyn REST Server .............................. SKIPPED
[INFO] Brooklyn REST JavaScript Web GUI .................. SKIPPED
[INFO] Brooklyn Launcher ................................. SKIPPED
[INFO] Brooklyn Command Line Interface ................... SKIPPED
[INFO] Brooklyn Test Framework ........................... SKIPPED
[INFO] Brooklyn All Things ............................... SKIPPED
[INFO] Brooklyn Simple Web Cluster Example ............... SKIPPED
[INFO] Brooklyn Global Web Fabric Example ................ SKIPPED
[INFO] Brooklyn Simple Messaging Publish-Subscribe Example  SKIPPED
[INFO] Brooklyn NoSQL Cluster Examples ................... SKIPPED
[INFO] Brooklyn Karaf .................................... SUCCESS [0.238s]
[INFO] Brooklyn Karaf Features ........................... SUCCESS [4.151s]
[INFO] Brooklyn Karaf Distro ............................. SUCCESS [50.580s]
[INFO] Brooklyn Karaf pax-exam itest ..................... SUCCESS [1:38.011s]
[INFO] Brooklyn Distribution ............................. SKIPPED
[INFO] Brooklyn QA ....................................... SKIPPED
[INFO] Brooklyn REST Client .............................. SKIPPED
[INFO] ------------------------------------------------------------------------
[INFO] BUILD FAILURE
[INFO] ------------------------------------------------------------------------
[INFO] Total time: 25:13.167s
[INFO] Finished at: Tue Dec 01 18:57:18 GMT 2015
[INFO] Final Memory: 104M/245M
[INFO] ------------------------------------------------------------------------
[JENKINS] Archiving disabled
[JENKINS] Archiving disabled
[JENKINS] Archiving disabled
[JENKINS] Archiving disabled
[JENKINS] Archiving disabled
[JENKINS] Archiving disabled
[JENKINS] Archiving disabled
[JENKINS] Archiving disabled
[JENKINS] Archiving disabled
[JENKINS] Archiving disabled
[JENKINS] Archiving disabled
[JENKINS] Archiving disabled
[JENKINS] Archiving disabled
[JENKINS] Archiving disabled
[JENKINS] Archiving disabled
[JENKINS] Archiving disabled
[JENKINS] Archiving disabled
[JENKINS] Archiving disabled
[JENKINS] Archiving disabled
[JENKINS] Archiving disabled
[JENKINS] Archiving disabled
[JENKINS] Archiving disabled
[JENKINS] Archiving disabled
[JENKINS] Archiving disabled
[JENKINS] Archiving disabled
[JENKINS] Archiving disabled
[JENKINS] Archiving disabled
[JENKINS] Archiving disabled
[JENKINS] Archiving disabled
[JENKINS] Archiving disabled
[JENKINS] Archiving disabled
[JENKINS] Archiving disabled
[JENKINS] Archiving disabled
[JENKINS] Archiving disabled
[JENKINS] Archiving disabled
[JENKINS] Archiving disabled
[JENKINS] Archiving disabled
[JENKINS] Archiving disabled
[JENKINS] Archiving disabled
[JENKINS] Archiving disabled
[JENKINS] Archiving disabled
[JENKINS] Archiving disabled
[JENKINS] Archiving disabled
[JENKINS] Archiving disabled
[JENKINS] Archiving disabled
[JENKINS] Archiving disabled
[JENKINS] Archiving disabled
[JENKINS] Archiving disabled
Waiting for Jenkins to finish collecting data
[ERROR] Failed to execute goal org.apache.maven.plugins:maven-surefire-plugin:2.18.1:test
(default-test) on project brooklyn-software-webapp: There are test failures.
[ERROR] 
[ERROR] Please refer to F:\hudson\hudson-slave\workspace\incubator-brooklyn-master-windows\software\webapp\target\surefire-reports
for the individual test results.
[ERROR] -> [Help 1]
[ERROR] 
[ERROR] To see the full stack trace of the errors, re-run Maven with the -e switch.
[ERROR] Re-run Maven using the -X switch to enable full debug logging.
[ERROR] 
[ERROR] For more information about the errors and possible solutions, please read the following
articles:
[ERROR] [Help 1] http://cwiki.apache.org/confluence/display/MAVEN/MojoFailureException
[ERROR] 
[ERROR] After correcting the problems, you can resume the build with the command
[ERROR]   mvn <goals> -rf :brooklyn-software-webapp
channel stopped

Mime
View raw message