brooklyn-dev mailing list archives

Site index · List index
Message view « Date » · « Thread »
Top « Date » · « Thread »
From Apache Jenkins Server <jenk...@builds.apache.org>
Subject Build failed in Jenkins: incubator-brooklyn-master-windows #381
Date Fri, 04 Dec 2015 19:24:46 GMT
See <https://builds.apache.org/job/incubator-brooklyn-master-windows/381/changes>

Changes:

[aled.sage] JcloudsLocation: fix waitForWinRm, for alternate WinRmTool

[aled.sage] Fix Winrm4jTool logging on error

[aled.sage] tryLoadClass: return optional.absent on NoClassDefFoundError

[aled.sage] jclouds.waitForReachable: exponential back off

[aled.sage] Adds WinRmException

[aled.sage] SshAbstractTool.propagate: rethrow fatal exceptions as-is

[aled.sage] JcloudsLocation: use CREATE_UNMANAGED for temporary machineLocations

------------------------------------------
[...truncated 1242 lines...]
18:40:58,949 | INFO  | pool-12-thread-1 | rnal.service.FeaturesServiceImpl 1116 | 7 - org.apache.karaf.features.core
- 4.0.3 |   mvn:org.apache.karaf.shell/org.apache.karaf.shell.console/4.0.3
18:40:58,957 | INFO  | pool-12-thread-1 | rnal.service.FeaturesServiceImpl 1116 | 7 - org.apache.karaf.features.core
- 4.0.3 |   mvn:org.apache.karaf.shell/org.apache.karaf.shell.core/4.0.3
18:40:58,965 | INFO  | pool-12-thread-1 | rnal.service.FeaturesServiceImpl 1116 | 7 - org.apache.karaf.features.core
- 4.0.3 |   mvn:org.apache.karaf.shell/org.apache.karaf.shell.ssh/4.0.3
18:40:58,971 | INFO  | pool-12-thread-1 | rnal.service.FeaturesServiceImpl 1116 | 7 - org.apache.karaf.features.core
- 4.0.3 |   mvn:org.apache.karaf.shell/org.apache.karaf.shell.table/4.0.3
18:40:58,975 | INFO  | pool-12-thread-1 | rnal.service.FeaturesServiceImpl 1116 | 7 - org.apache.karaf.features.core
- 4.0.3 |   mvn:org.apache.karaf.system/org.apache.karaf.system.core/4.0.3
18:40:59,063 | INFO  | pool-12-thread-1 | rnal.service.FeaturesServiceImpl 1116 | 7 - org.apache.karaf.features.core
- 4.0.3 |   mvn:org.apache.karaf.web/org.apache.karaf.web.core/4.0.3
18:40:59,070 | INFO  | pool-12-thread-1 | rnal.service.FeaturesServiceImpl 1116 | 7 - org.apache.karaf.features.core
- 4.0.3 |   mvn:org.apache.servicemix.bundles/org.apache.servicemix.bundles.jzlib/1.1.3_2
18:40:59,077 | INFO  | pool-12-thread-1 | rnal.service.FeaturesServiceImpl 1116 | 7 - org.apache.karaf.features.core
- 4.0.3 |   mvn:org.apache.servicemix.bundles/org.apache.servicemix.bundles.not-yet-commons-ssl/0.3.11_1
18:40:59,084 | INFO  | pool-12-thread-1 | rnal.service.FeaturesServiceImpl 1116 | 7 - org.apache.karaf.features.core
- 4.0.3 |   mvn:org.apache.servicemix.bundles/org.apache.servicemix.bundles.reflections/0.9.9_1
18:40:59,092 | INFO  | pool-12-thread-1 | rnal.service.FeaturesServiceImpl 1116 | 7 - org.apache.karaf.features.core
- 4.0.3 |   mvn:org.apache.xbean/xbean-bundleutils/4.1
18:40:59,098 | INFO  | pool-12-thread-1 | rnal.service.FeaturesServiceImpl 1116 | 7 - org.apache.karaf.features.core
- 4.0.3 |   mvn:org.apache.xbean/xbean-finder/4.1
18:40:59,104 | INFO  | pool-12-thread-1 | rnal.service.FeaturesServiceImpl 1116 | 7 - org.apache.karaf.features.core
- 4.0.3 |   mvn:org.eclipse.jdt.core.compiler/ecj/4.4
18:40:59,230 | INFO  | pool-12-thread-1 | rnal.service.FeaturesServiceImpl 1116 | 7 - org.apache.karaf.features.core
- 4.0.3 |   mvn:org.eclipse.jetty/jetty-client/9.2.10.v20150310
18:40:59,235 | INFO  | pool-12-thread-1 | rnal.service.FeaturesServiceImpl 1116 | 7 - org.apache.karaf.features.core
- 4.0.3 |   mvn:org.eclipse.jetty/jetty-continuation/9.2.10.v20150310
18:40:59,258 | INFO  | pool-12-thread-1 | rnal.service.FeaturesServiceImpl 1116 | 7 - org.apache.karaf.features.core
- 4.0.3 |   mvn:org.eclipse.jetty/jetty-http/9.2.10.v20150310
18:40:59,264 | INFO  | pool-12-thread-1 | rnal.service.FeaturesServiceImpl 1116 | 7 - org.apache.karaf.features.core
- 4.0.3 |   mvn:org.eclipse.jetty/jetty-io/9.2.10.v20150310
18:40:59,270 | INFO  | pool-12-thread-1 | rnal.service.FeaturesServiceImpl 1116 | 7 - org.apache.karaf.features.core
- 4.0.3 |   mvn:org.eclipse.jetty/jetty-jaas/9.2.10.v20150310
18:40:59,276 | INFO  | pool-12-thread-1 | rnal.service.FeaturesServiceImpl 1116 | 7 - org.apache.karaf.features.core
- 4.0.3 |   mvn:org.eclipse.jetty/jetty-jaspi/9.2.10.v20150310
18:40:59,282 | INFO  | pool-12-thread-1 | rnal.service.FeaturesServiceImpl 1116 | 7 - org.apache.karaf.features.core
- 4.0.3 |   mvn:org.eclipse.jetty/jetty-jmx/9.2.10.v20150310
18:40:59,287 | INFO  | pool-12-thread-1 | rnal.service.FeaturesServiceImpl 1116 | 7 - org.apache.karaf.features.core
- 4.0.3 |   mvn:org.eclipse.jetty/jetty-jndi/9.2.10.v20150310
18:40:59,292 | INFO  | pool-12-thread-1 | rnal.service.FeaturesServiceImpl 1116 | 7 - org.apache.karaf.features.core
- 4.0.3 |   mvn:org.eclipse.jetty/jetty-plus/9.2.10.v20150310
18:40:59,296 | INFO  | pool-12-thread-1 | rnal.service.FeaturesServiceImpl 1116 | 7 - org.apache.karaf.features.core
- 4.0.3 |   mvn:org.eclipse.jetty/jetty-rewrite/9.2.10.v20150310
18:40:59,303 | INFO  | pool-12-thread-1 | rnal.service.FeaturesServiceImpl 1116 | 7 - org.apache.karaf.features.core
- 4.0.3 |   mvn:org.eclipse.jetty/jetty-security/9.2.10.v20150310
18:40:59,308 | INFO  | pool-12-thread-1 | rnal.service.FeaturesServiceImpl 1116 | 7 - org.apache.karaf.features.core
- 4.0.3 |   mvn:org.eclipse.jetty/jetty-server/9.2.10.v20150310
18:40:59,314 | INFO  | pool-12-thread-1 | rnal.service.FeaturesServiceImpl 1116 | 7 - org.apache.karaf.features.core
- 4.0.3 |   mvn:org.eclipse.jetty/jetty-servlet/9.2.10.v20150310
18:40:59,318 | INFO  | pool-12-thread-1 | rnal.service.FeaturesServiceImpl 1116 | 7 - org.apache.karaf.features.core
- 4.0.3 |   mvn:org.eclipse.jetty/jetty-servlets/9.2.10.v20150310
18:40:59,323 | INFO  | pool-12-thread-1 | rnal.service.FeaturesServiceImpl 1116 | 7 - org.apache.karaf.features.core
- 4.0.3 |   mvn:org.eclipse.jetty/jetty-util/9.2.10.v20150310
18:40:59,330 | INFO  | pool-12-thread-1 | rnal.service.FeaturesServiceImpl 1116 | 7 - org.apache.karaf.features.core
- 4.0.3 |   mvn:org.eclipse.jetty/jetty-util-ajax/9.2.10.v20150310
18:40:59,334 | INFO  | pool-12-thread-1 | rnal.service.FeaturesServiceImpl 1116 | 7 - org.apache.karaf.features.core
- 4.0.3 |   mvn:org.eclipse.jetty/jetty-webapp/9.2.10.v20150310
18:40:59,339 | INFO  | pool-12-thread-1 | rnal.service.FeaturesServiceImpl 1116 | 7 - org.apache.karaf.features.core
- 4.0.3 |   mvn:org.eclipse.jetty.websocket/websocket-api/9.2.10.v20150310
18:40:59,344 | INFO  | pool-12-thread-1 | rnal.service.FeaturesServiceImpl 1116 | 7 - org.apache.karaf.features.core
- 4.0.3 |   mvn:org.eclipse.jetty.websocket/websocket-client/9.2.10.v20150310
18:40:59,361 | INFO  | pool-12-thread-1 | rnal.service.FeaturesServiceImpl 1116 | 7 - org.apache.karaf.features.core
- 4.0.3 |   mvn:org.eclipse.jetty.websocket/websocket-common/9.2.10.v20150310
18:40:59,368 | INFO  | pool-12-thread-1 | rnal.service.FeaturesServiceImpl 1116 | 7 - org.apache.karaf.features.core
- 4.0.3 |   mvn:org.eclipse.jetty.websocket/javax-websocket-client-impl/9.2.10.v20150310
18:40:59,390 | INFO  | pool-12-thread-1 | rnal.service.FeaturesServiceImpl 1116 | 7 - org.apache.karaf.features.core
- 4.0.3 |   mvn:org.eclipse.jetty.websocket/javax-websocket-server-impl/9.2.10.v20150310
18:40:59,396 | INFO  | pool-12-thread-1 | rnal.service.FeaturesServiceImpl 1116 | 7 - org.apache.karaf.features.core
- 4.0.3 |   mvn:org.eclipse.jetty.websocket/websocket-server/9.2.10.v20150310
18:40:59,403 | INFO  | pool-12-thread-1 | rnal.service.FeaturesServiceImpl 1116 | 7 - org.apache.karaf.features.core
- 4.0.3 |   mvn:org.eclipse.jetty.websocket/websocket-servlet/9.2.10.v20150310
18:40:59,408 | INFO  | pool-12-thread-1 | rnal.service.FeaturesServiceImpl 1116 | 7 - org.apache.karaf.features.core
- 4.0.3 |   mvn:org.eclipse.jetty/jetty-xml/9.2.10.v20150310
18:40:59,412 | INFO  | pool-12-thread-1 | rnal.service.FeaturesServiceImpl 1116 | 7 - org.apache.karaf.features.core
- 4.0.3 |   mvn:org.freemarker/freemarker/2.3.22
18:40:59,426 | INFO  | pool-12-thread-1 | rnal.service.FeaturesServiceImpl 1116 | 7 - org.apache.karaf.features.core
- 4.0.3 |   mvn:org.jledit/core/0.2.1
18:40:59,433 | INFO  | pool-12-thread-1 | rnal.service.FeaturesServiceImpl 1116 | 7 - org.apache.karaf.features.core
- 4.0.3 |   mvn:org.jvnet.mimepull/mimepull/1.9.3
18:40:59,450 | INFO  | pool-12-thread-1 | rnal.service.FeaturesServiceImpl 1116 | 7 - org.apache.karaf.features.core
- 4.0.3 |   mvn:org.ow2.asm/asm-all/5.0.4
18:40:59,455 | INFO  | pool-12-thread-1 | rnal.service.FeaturesServiceImpl 1116 | 7 - org.apache.karaf.features.core
- 4.0.3 |   mvn:org.ops4j.base/ops4j-base-io/1.5.0
18:40:59,458 | INFO  | pool-12-thread-1 | rnal.service.FeaturesServiceImpl 1116 | 7 - org.apache.karaf.features.core
- 4.0.3 |   mvn:org.ops4j.base/ops4j-base-lang/1.5.0
18:40:59,461 | INFO  | pool-12-thread-1 | rnal.service.FeaturesServiceImpl 1116 | 7 - org.apache.karaf.features.core
- 4.0.3 |   mvn:org.ops4j.base/ops4j-base-monitors/1.5.0
18:40:59,464 | INFO  | pool-12-thread-1 | rnal.service.FeaturesServiceImpl 1116 | 7 - org.apache.karaf.features.core
- 4.0.3 |   mvn:org.ops4j.base/ops4j-base-net/1.5.0
18:40:59,467 | INFO  | pool-12-thread-1 | rnal.service.FeaturesServiceImpl 1116 | 7 - org.apache.karaf.features.core
- 4.0.3 |   mvn:org.ops4j.base/ops4j-base-spi/1.5.0
18:40:59,470 | INFO  | pool-12-thread-1 | rnal.service.FeaturesServiceImpl 1116 | 7 - org.apache.karaf.features.core
- 4.0.3 |   mvn:org.ops4j.base/ops4j-base-store/1.5.0
18:40:59,472 | INFO  | pool-12-thread-1 | rnal.service.FeaturesServiceImpl 1116 | 7 - org.apache.karaf.features.core
- 4.0.3 |   mvn:org.ops4j.base/ops4j-base-util-property/1.5.0
18:40:59,475 | INFO  | pool-12-thread-1 | rnal.service.FeaturesServiceImpl 1116 | 7 - org.apache.karaf.features.core
- 4.0.3 |   mvn:org.ops4j.pax.exam/pax-exam/4.6.0
18:40:59,479 | INFO  | pool-12-thread-1 | rnal.service.FeaturesServiceImpl 1116 | 7 - org.apache.karaf.features.core
- 4.0.3 |   mvn:org.ops4j.pax.exam/pax-exam-extender-service/4.6.0
18:40:59,483 | INFO  | pool-12-thread-1 | rnal.service.FeaturesServiceImpl 1116 | 7 - org.apache.karaf.features.core
- 4.0.3 |   mvn:org.ops4j.pax.exam/pax-exam-inject/4.6.0
18:40:59,485 | INFO  | pool-12-thread-1 | rnal.service.FeaturesServiceImpl 1116 | 7 - org.apache.karaf.features.core
- 4.0.3 |   mvn:org.ops4j.pax.exam/pax-exam-invoker-junit/4.6.0
18:40:59,488 | INFO  | pool-12-thread-1 | rnal.service.FeaturesServiceImpl 1116 | 7 - org.apache.karaf.features.core
- 4.0.3 |   mvn:org.ops4j.pax.exam/pax-exam-container-rbc/4.6.0
18:40:59,492 | INFO  | pool-12-thread-1 | rnal.service.FeaturesServiceImpl 1116 | 7 - org.apache.karaf.features.core
- 4.0.3 |   mvn:org.ops4j.pax.swissbox/pax-swissbox-core/1.8.1
18:40:59,512 | INFO  | pool-12-thread-1 | rnal.service.FeaturesServiceImpl 1116 | 7 - org.apache.karaf.features.core
- 4.0.3 |   mvn:org.ops4j.pax.swissbox/pax-swissbox-extender/1.8.1
18:40:59,516 | INFO  | pool-12-thread-1 | rnal.service.FeaturesServiceImpl 1116 | 7 - org.apache.karaf.features.core
- 4.0.3 |   mvn:org.ops4j.pax.swissbox/pax-swissbox-framework/1.8.1
18:40:59,519 | INFO  | pool-12-thread-1 | rnal.service.FeaturesServiceImpl 1116 | 7 - org.apache.karaf.features.core
- 4.0.3 |   mvn:org.ops4j.pax.swissbox/pax-swissbox-lifecycle/1.8.1
18:40:59,523 | INFO  | pool-12-thread-1 | rnal.service.FeaturesServiceImpl 1116 | 7 - org.apache.karaf.features.core
- 4.0.3 |   mvn:org.ops4j.pax.swissbox/pax-swissbox-tracker/1.8.1
18:40:59,526 | INFO  | pool-12-thread-1 | rnal.service.FeaturesServiceImpl 1116 | 7 - org.apache.karaf.features.core
- 4.0.3 |   mvn:org.ops4j.pax.tipi/org.ops4j.pax.tipi.hamcrest.core/1.3.0.1
18:40:59,530 | INFO  | pool-12-thread-1 | rnal.service.FeaturesServiceImpl 1116 | 7 - org.apache.karaf.features.core
- 4.0.3 |   mvn:org.ops4j.pax.tipi/org.ops4j.pax.tipi.junit/4.12.0.1
18:40:59,599 | INFO  | pool-12-thread-1 | rnal.service.FeaturesServiceImpl 1116 | 7 - org.apache.karaf.features.core
- 4.0.3 |   mvn:org.ops4j.pax.url/pax-url-war/2.4.2/jar/uber
18:40:59,612 | INFO  | pool-12-thread-1 | rnal.service.FeaturesServiceImpl 1116 | 7 - org.apache.karaf.features.core
- 4.0.3 |   mvn:org.ops4j.pax.web/pax-web-api/4.2.3
18:40:59,617 | INFO  | pool-12-thread-1 | rnal.service.FeaturesServiceImpl 1116 | 7 - org.apache.karaf.features.core
- 4.0.3 |   mvn:org.ops4j.pax.web/pax-web-deployer/4.2.3
18:40:59,621 | INFO  | pool-12-thread-1 | rnal.service.FeaturesServiceImpl 1116 | 7 - org.apache.karaf.features.core
- 4.0.3 |   mvn:org.ops4j.pax.web/pax-web-extender-war/4.2.3
18:40:59,628 | INFO  | pool-12-thread-1 | rnal.service.FeaturesServiceImpl 1116 | 7 - org.apache.karaf.features.core
- 4.0.3 |   mvn:org.ops4j.pax.web/pax-web-extender-whiteboard/4.2.3
18:40:59,633 | INFO  | pool-12-thread-1 | rnal.service.FeaturesServiceImpl 1116 | 7 - org.apache.karaf.features.core
- 4.0.3 |   mvn:org.ops4j.pax.web/pax-web-jetty/4.2.3
18:40:59,648 | INFO  | pool-12-thread-1 | rnal.service.FeaturesServiceImpl 1116 | 7 - org.apache.karaf.features.core
- 4.0.3 |   mvn:org.ops4j.pax.web/pax-web-jsp/4.2.3
18:40:59,667 | INFO  | pool-12-thread-1 | rnal.service.FeaturesServiceImpl 1116 | 7 - org.apache.karaf.features.core
- 4.0.3 |   mvn:org.ops4j.pax.web/pax-web-runtime/4.2.3
18:40:59,673 | INFO  | pool-12-thread-1 | rnal.service.FeaturesServiceImpl 1116 | 7 - org.apache.karaf.features.core
- 4.0.3 |   mvn:org.ops4j.pax.web/pax-web-spi/4.2.3
18:40:59,680 | INFO  | pool-12-thread-1 | rnal.service.FeaturesServiceImpl 1116 | 7 - org.apache.karaf.features.core
- 4.0.3 |   wrap:mvn:org.tukaani/xz/1.4
18:40:59,685 | INFO  | pool-12-thread-1 | rnal.service.FeaturesServiceImpl 1116 | 7 - org.apache.karaf.features.core
- 4.0.3 |   mvn:org.yaml/snakeyaml/1.11
18:40:59,690 | INFO  | pool-12-thread-1 | rnal.service.FeaturesServiceImpl 1116 | 7 - org.apache.karaf.features.core
- 4.0.3 |   wrap:mvn:com.google.http-client/google-http-client/1.18.0-rc
18:40:59,696 | INFO  | pool-12-thread-1 | rnal.service.FeaturesServiceImpl 1116 | 7 - org.apache.karaf.features.core
- 4.0.3 |   wrap:mvn:com.maxmind.geoip2/geoip2/0.8.1
18:40:59,701 | INFO  | pool-12-thread-1 | rnal.service.FeaturesServiceImpl 1116 | 7 - org.apache.karaf.features.core
- 4.0.3 |   wrap:mvn:xpp3/xpp3_min/1.1.4c
18:40:59,704 | INFO  | pool-12-thread-1 | rnal.service.FeaturesServiceImpl 1116 | 7 - org.apache.karaf.features.core
- 4.0.3 |   mvn:com.thoughtworks.xstream/xstream/1.4.7
18:40:59,772 | INFO  | pool-12-thread-1 | l.service.FeatureConfigInstaller  205 | 7 - org.apache.karaf.features.core
- 4.0.3 | Creating configuration file /F:/hudson/hudson-slave/workspace/incubator-brooklyn-master-windows/karaf/itest/target/paxexam/unpack/4b94238b-b0f7-4a96-bcf5-30bcf1f74f7b/\/etc/jetty.xml
18:40:59,782 | INFO  | pool-12-thread-1 | rnal.service.FeaturesServiceImpl 1116 | 7 - org.apache.karaf.features.core
- 4.0.3 | Stopping bundles:
18:40:59,783 | INFO  | pool-12-thread-1 | rnal.service.FeaturesServiceImpl 1116 | 7 - org.apache.karaf.features.core
- 4.0.3 |   org.apache.sshd.core/0.14.0
18:40:59,791 | INFO  | pool-12-thread-1 | rnal.service.FeaturesServiceImpl 1116 | 7 - org.apache.karaf.features.core
- 4.0.3 |   org.apache.karaf.features.core/4.0.3
18:40:59,800 | INFO  | pool-12-thread-1 | rnal.service.FeaturesServiceImpl 1116 | 7 - org.apache.karaf.features.core
- 4.0.3 |   org.apache.felix.fileinstall/3.5.0
18:40:59,806 | INFO  | pool-12-thread-1 | rnal.service.FeaturesServiceImpl 1116 | 7 - org.apache.karaf.features.core
- 4.0.3 |   org.apache.felix.configadmin/1.8.8
18:40:59,807 | INFO  | pool-12-thread-1 | rnal.service.FeaturesServiceImpl 1116 | 7 - org.apache.karaf.features.core
- 4.0.3 |   org.ops4j.pax.logging.pax-logging-api/1.8.4
18:40:59,808 | INFO  | pool-12-thread-1 | j.pax.logging.internal.Activator   59 | 1 - org.ops4j.pax.logging.pax-logging-api
- 1.8.4 | Disabling SLF4J API support.
18:40:59,808 | INFO  | pool-12-thread-1 | j.pax.logging.internal.Activator   62 | 1 - org.ops4j.pax.logging.pax-logging-api
- 1.8.4 | Disabling Jakarta Commons Logging API support.
18:40:59,809 | INFO  | pool-12-thread-1 | j.pax.logging.internal.Activator   65 | 1 - org.ops4j.pax.logging.pax-logging-api
- 1.8.4 | Disabling Log4J API support.
18:40:59,809 | INFO  | pool-12-thread-1 | j.pax.logging.internal.Activator   68 | 1 - org.ops4j.pax.logging.pax-logging-api
- 1.8.4 | Disabling Avalon Logger API support.
18:40:59,809 | INFO  | pool-12-thread-1 | j.pax.logging.internal.Activator   71 | 1 - org.ops4j.pax.logging.pax-logging-api
- 1.8.4 | Disabling JULI Logger API support.
Exception in thread "Thread-27" java.lang.NullPointerException
	at org.apache.felix.framework.BundleWiringImpl.searchImports(BundleWiringImpl.java:1595)
	at org.apache.felix.framework.BundleWiringImpl.findClassOrResourceByDelegation(BundleWiringImpl.java:1525)
	at org.apache.felix.framework.BundleWiringImpl.access$400(BundleWiringImpl.java:79)
	at org.apache.felix.framework.BundleWiringImpl$BundleClassLoader.loadClass(BundleWiringImpl.java:2018)
	at java.lang.ClassLoader.loadClass(ClassLoader.java:356)
	at org.apache.brooklyn.util.text.Strings.lengthComparator(Strings.java:854)
	at org.apache.brooklyn.util.os.Os$1.run(Os.java:328)
18:41:23.955 [main] INFO  o.o.p.e.spi.reactors.ReactorManager - suite finished
Tests run: 3, Failures: 0, Errors: 0, Skipped: 0, Time elapsed: 46.276 sec - in org.apache.brooklyn.AssemblyTest

Results :

Tests run: 3, Failures: 0, Errors: 0, Skipped: 0

[JENKINS] Recording test results
log4j:WARN No appenders could be found for logger (org.apache.commons.beanutils.converters.BooleanConverter).
log4j:WARN Please initialize the log4j system properly.
[INFO] 
[INFO] --- maven-jar-plugin:2.5:jar (default-jar) @ brooklyn-itest ---
[INFO] Building jar: F:\hudson\hudson-slave\workspace\incubator-brooklyn-master-windows\karaf\itest\target\brooklyn-itest-0.9.0-SNAPSHOT.jar
[INFO] 
[INFO] --- maven-site-plugin:3.4:attach-descriptor (attach-descriptor) @ brooklyn-itest ---
[INFO] 
[INFO] --- maven-install-plugin:2.5.2:install (default-install) @ brooklyn-itest ---
[INFO] Installing F:\hudson\hudson-slave\workspace\incubator-brooklyn-master-windows\karaf\itest\target\brooklyn-itest-0.9.0-SNAPSHOT.jar
to f:\hudson\hudson-slave\maven-repositories\1\org\apache\brooklyn\brooklyn-itest\0.9.0-SNAPSHOT\brooklyn-itest-0.9.0-SNAPSHOT.jar
[INFO] Installing F:\hudson\hudson-slave\workspace\incubator-brooklyn-master-windows\karaf\itest\pom.xml
to f:\hudson\hudson-slave\maven-repositories\1\org\apache\brooklyn\brooklyn-itest\0.9.0-SNAPSHOT\brooklyn-itest-0.9.0-SNAPSHOT.pom
[JENKINS] Archiving disabled
[INFO]                                                                         
[INFO] ------------------------------------------------------------------------
[INFO] Skipping Brooklyn Distribution
[INFO] This project has been banned from the build due to previous failures.
[INFO] ------------------------------------------------------------------------
[INFO]                                                                         
[INFO] ------------------------------------------------------------------------
[INFO] Skipping Brooklyn QA
[INFO] This project has been banned from the build due to previous failures.
[INFO] ------------------------------------------------------------------------
[INFO]                                                                         
[INFO] ------------------------------------------------------------------------
[INFO] Skipping Brooklyn REST Client
[INFO] This project has been banned from the build due to previous failures.
[INFO] ------------------------------------------------------------------------
[INFO] ------------------------------------------------------------------------
[INFO] Reactor Summary:
[INFO] 
[INFO] Brooklyn Root ..................................... SUCCESS [2.117s]
[INFO] Brooklyn Parent Project ........................... SUCCESS [7.875s]
[INFO] Brooklyn Logback Configuration .................... SUCCESS [5.865s]
[INFO] Brooklyn Test Support Utilities ................... FAILURE [1.750s]
[INFO] Brooklyn Logback Includable Configuration ......... FAILURE [1.420s]
[INFO] Brooklyn Common Utilities ......................... SKIPPED
[INFO] Brooklyn API ...................................... SKIPPED
[INFO] Brooklyn Test Support ............................. SKIPPED
[INFO] CAMP Server Parent Project ........................ SUCCESS [1.118s]
[INFO] CAMP Base ......................................... SKIPPED
[INFO] Brooklyn REST Swagger Apidoc Utilities ............ SKIPPED
[INFO] CAMP Server ....................................... SKIPPED
[INFO] Brooklyn OSGi Utils ............................... SKIPPED
[INFO] Brooklyn Felix Runtime ............................ SKIPPED
[INFO] Brooklyn Groovy Utilities ......................... SKIPPED
[INFO] Brooklyn Core ..................................... SKIPPED
[INFO] Brooklyn Policies ................................. SKIPPED
[INFO] Brooklyn WinRM Software Entities .................. SKIPPED
[INFO] Brooklyn Jclouds Location Targets ................. SKIPPED
[INFO] Brooklyn Secure JMXMP Agent ....................... SKIPPED
[INFO] Brooklyn JMX RMI Agent ............................ SKIPPED
[INFO] Brooklyn Software Base ............................ SKIPPED
[INFO] Brooklyn Web App Software Entities ................ SKIPPED
[INFO] Brooklyn Messaging Software Entities .............. SKIPPED
[INFO] Brooklyn Database Software Entities ............... SKIPPED
[INFO] Brooklyn Monitoring Software Entities ............. SKIPPED
[INFO] Brooklyn OSGi Software Entities ................... SKIPPED
[INFO] Brooklyn NoSQL Data Store Software Entities ....... SKIPPED
[INFO] Brooklyn Network Software Entities ................ SKIPPED
[INFO] Brooklyn REST API ................................. SKIPPED
[INFO] Brooklyn CAMP REST API ............................ SKIPPED
[INFO] Brooklyn REST Server .............................. SKIPPED
[INFO] Brooklyn REST JavaScript Web GUI .................. SKIPPED
[INFO] Brooklyn Launcher ................................. SKIPPED
[INFO] Brooklyn Command Line Interface ................... SKIPPED
[INFO] Brooklyn Test Framework ........................... SKIPPED
[INFO] Brooklyn All Things ............................... SKIPPED
[INFO] Brooklyn Simple Web Cluster Example ............... SKIPPED
[INFO] Brooklyn Global Web Fabric Example ................ SKIPPED
[INFO] Brooklyn Simple Messaging Publish-Subscribe Example  SKIPPED
[INFO] Brooklyn NoSQL Cluster Examples ................... SKIPPED
[INFO] Brooklyn Karaf .................................... SUCCESS [0.242s]
[INFO] Brooklyn Karaf Features ........................... SUCCESS [4.300s]
[INFO] Brooklyn Karaf Distro ............................. SUCCESS [40.642s]
[INFO] Brooklyn Karaf pax-exam itest ..................... SUCCESS [1:07.285s]
[INFO] Brooklyn Distribution ............................. SKIPPED
[INFO] Brooklyn QA ....................................... SKIPPED
[INFO] Brooklyn REST Client .............................. SKIPPED
[INFO] ------------------------------------------------------------------------
[INFO] BUILD FAILURE
[INFO] ------------------------------------------------------------------------
[INFO] Total time: 2:27.561s
[INFO] Finished at: Fri Dec 04 18:41:28 GMT 2015
[INFO] Final Memory: 69M/243M
[INFO] ------------------------------------------------------------------------
[JENKINS] Archiving disabled
[JENKINS] Archiving disabled
[JENKINS] Archiving disabled
[JENKINS] Archiving disabled
[JENKINS] Archiving disabled
[JENKINS] Archiving disabled
[JENKINS] Archiving disabled
[JENKINS] Archiving disabled
[JENKINS] Archiving disabled
[JENKINS] Archiving disabled
[JENKINS] Archiving disabled
[JENKINS] Archiving disabled
[JENKINS] Archiving disabled
[JENKINS] Archiving disabled
[JENKINS] Archiving disabled
[JENKINS] Archiving disabled
[JENKINS] Archiving disabled
[JENKINS] Archiving disabled
[JENKINS] Archiving disabled
[JENKINS] Archiving disabled
[JENKINS] Archiving disabled
[JENKINS] Archiving disabled
[JENKINS] Archiving disabled
[JENKINS] Archiving disabled
[JENKINS] Archiving disabled
[JENKINS] Archiving disabled
[JENKINS] Archiving disabled
[JENKINS] Archiving disabled
[JENKINS] Archiving disabled
[JENKINS] Archiving disabled
[JENKINS] Archiving disabled
[JENKINS] Archiving disabled
[JENKINS] Archiving disabled
[JENKINS] Archiving disabled
[JENKINS] Archiving disabled
[JENKINS] Archiving disabled
[JENKINS] Archiving disabled
[JENKINS] Archiving disabled
[JENKINS] Archiving disabled
[JENKINS] Archiving disabled
[JENKINS] Archiving disabled
[JENKINS] Archiving disabled
[JENKINS] Archiving disabled
[JENKINS] Archiving disabled
[JENKINS] Archiving disabled
[JENKINS] Archiving disabled
[JENKINS] Archiving disabled
[JENKINS] Archiving disabled
Waiting for Jenkins to finish collecting data
[ERROR] Failed to execute goal org.apache.maven.plugins:maven-clean-plugin:2.6.1:clean (default-clean)
on project brooklyn-utils-test-support: Failed to clean project: Failed to delete F:\hudson\hudson-slave\workspace\incubator-brooklyn-master-windows\utils\test-support\target\brooklyn-utils-test-support-0.9.0-SNAPSHOT.jar
-> [Help 1]
[ERROR] Failed to execute goal org.apache.maven.plugins:maven-clean-plugin:2.6.1:clean (default-clean)
on project brooklyn-logback-includes: Failed to clean project: Failed to delete F:\hudson\hudson-slave\workspace\incubator-brooklyn-master-windows\usage\logback-includes\target\brooklyn-logback-includes-0.9.0-SNAPSHOT.jar
-> [Help 1]
[ERROR] 
[ERROR] To see the full stack trace of the errors, re-run Maven with the -e switch.
[ERROR] Re-run Maven using the -X switch to enable full debug logging.
[ERROR] 
[ERROR] For more information about the errors and possible solutions, please read the following
articles:
[ERROR] [Help 1] http://cwiki.apache.org/confluence/display/MAVEN/MojoExecutionException
[ERROR] 
[ERROR] After correcting the problems, you can resume the build with the command
[ERROR]   mvn <goals> -rf :brooklyn-utils-test-support
channel stopped

Mime
View raw message