brooklyn-dev mailing list archives

Site index · List index
Message view « Date » · « Thread »
Top « Date » · « Thread »
From Apache Jenkins Server <jenk...@builds.apache.org>
Subject Build failed in Jenkins: incubator-brooklyn-master-windows #389
Date Mon, 21 Dec 2015 13:35:33 GMT
See <https://builds.apache.org/job/incubator-brooklyn-master-windows/389/changes>

Changes:

[sam.corbett] Remove "public static final" from GeoDns entity interfaces

[sam.corbett] Simplify GeoDns tests

[sam.corbett] Group to be tracked by GeoDns can be set at entity creation

[sam.corbett] GeoDns excludes entities that are not running by default

[sam.corbett] GeoDns AWS behaviour note

[sam.corbett] Include a version for the maven-jar-plugin

[aled.sage] Avoid casting to BrooklynProperties

[aled.sage] Create BrooklynProperties interface

[aled.sage] Adds CampYamlParser (accessible in core)

[sam.corbett] Forbid all imports from com.google.api.client

[sam.corbett] downstream-parent does not set Export-Package

[sam.corbett] downstream-parent excludes a number of non-OSGi packages

[sam.corbett] Test loading downstream-project into catalogue

[alex.heneveld] introduce VersionComparator and use it where appropriate

[alex.heneveld] type registry: adds validation, best version support, aliases, tags

[aled.sage] BrooklynProperties handles externalised config

[aled.sage] Fix concurrent use of entity.setAttribute()

[alex.heneveld] clean-up of type registry work following PR comments; all addressed

[alex.heneveld] support isNull on Maybe, including an "absent because null" semantics.

[alex.heneveld] resolve the curious Maybe.Present(null) making use of new

[alex.heneveld] misc tidy

[aled.sage] Use Sanitiser.sanitize when logging

[aled.sage] MachineEntity.exec: better NPE if no driver

[aled.sage] Fix jclouds machine subnetHostname

[alex.heneveld] tidy-up following review of #1117, thx @iyovcheva

------------------------------------------
[...truncated 40432 lines...]
[INFO] ===============================================
[INFO]     Surefire test
[INFO]     Tests run: 2, Failures: 0, Skips: 0
[INFO] ===============================================
[INFO] Tests run: 2, Failures: 0, Errors: 0, Skipped: 0, Time elapsed: 8.591 sec - in TestSuite
[INFO] 
[INFO] Results :
[INFO] 
[INFO] Tests run: 2, Failures: 0, Errors: 0, Skipped: 0
[INFO] 
[INFO] [INFO] 
[INFO] [INFO] --- maven-jar-plugin:2.6:jar (default-jar) @ brooklyn-sample ---
[INFO] [INFO] Building jar: F:\hudson\hudson-slave\workspace\incubator-brooklyn-master-windows\usage\archetypes\quickstart\target\test-classes\projects\integration-test-1\project\brooklyn-sample\target\brooklyn-sample-0.1.0-SNAPSHOT.jar
[INFO] [INFO] 
[INFO] [INFO] --- maven-site-plugin:3.4:attach-descriptor (attach-descriptor) @ brooklyn-sample
---
[INFO] [INFO] 
[INFO] [INFO] --- maven-jar-plugin:2.6:test-jar (test-jar-creation) @ brooklyn-sample ---
[INFO] [INFO] Building jar: F:\hudson\hudson-slave\workspace\incubator-brooklyn-master-windows\usage\archetypes\quickstart\target\test-classes\projects\integration-test-1\project\brooklyn-sample\target\brooklyn-sample-0.1.0-SNAPSHOT-tests.jar
[INFO] [INFO] 
[INFO] [INFO] --- maven-install-plugin:2.5.2:install (default-install) @ brooklyn-sample ---
[INFO] [INFO] Installing F:\hudson\hudson-slave\workspace\incubator-brooklyn-master-windows\usage\archetypes\quickstart\target\test-classes\projects\integration-test-1\project\brooklyn-sample\target\brooklyn-sample-0.1.0-SNAPSHOT.jar
to F:\hudson\hudson-slave\maven-repositories\1\com\acme\sample\brooklyn-sample\0.1.0-SNAPSHOT\brooklyn-sample-0.1.0-SNAPSHOT.jar
[INFO] [INFO] Installing F:\hudson\hudson-slave\workspace\incubator-brooklyn-master-windows\usage\archetypes\quickstart\target\test-classes\projects\integration-test-1\project\brooklyn-sample\pom.xml
to F:\hudson\hudson-slave\maven-repositories\1\com\acme\sample\brooklyn-sample\0.1.0-SNAPSHOT\brooklyn-sample-0.1.0-SNAPSHOT.pom
[INFO] [INFO] Installing F:\hudson\hudson-slave\workspace\incubator-brooklyn-master-windows\usage\archetypes\quickstart\target\test-classes\projects\integration-test-1\project\brooklyn-sample\target\brooklyn-sample-0.1.0-SNAPSHOT-tests.jar
to F:\hudson\hudson-slave\maven-repositories\1\com\acme\sample\brooklyn-sample\0.1.0-SNAPSHOT\brooklyn-sample-0.1.0-SNAPSHOT-tests.jar
[INFO] [INFO] ------------------------------------------------------------------------
[INFO] [INFO] BUILD SUCCESS
[INFO] [INFO] ------------------------------------------------------------------------
[INFO] [INFO] Total time: 34.922s
[INFO] [INFO] Finished at: Mon Dec 21 13:28:44 GMT 2015
[INFO] [INFO] Final Memory: 43M/235M
[INFO] [INFO] ------------------------------------------------------------------------
[INFO] Post-archetype-generation invoker exit code: 0
[JENKINS] Recording test results
[INFO] 
[INFO] --- apache-rat-plugin:0.11:check (default) @ brooklyn-archetype-quickstart ---
[INFO] 51 implicit excludes (use -debug for more details).
[INFO] Exclude: sandbox/**
[INFO] Exclude: release/**
[INFO] Exclude: **/nbactions.xml
[INFO] Exclude: **/nb-configuration.xml
[INFO] Exclude: **/src/main/resources/archetype-resources/**/*
[INFO] Exclude: **/src/test/resources/projects/integration-test-1/goal.txt
[INFO] Exclude: **/src/test/resources/projects/integration-test-1/reference/**/*
[INFO] Exclude: **/src/main/java/sample/**/*Sample*.java
[INFO] Exclude: **/src/main/resources/logback-custom.xml
[INFO] Exclude: **/src/brooklyn-sample/README.md
[INFO] Exclude: **/src/brooklyn-sample/pom.xml
[INFO] Exclude: **/src/brooklyn-sample/src/main/assembly/files/conf/*
[INFO] Exclude: **/src/brooklyn-sample/src/main/java/**/*.java
[INFO] Exclude: **/src/brooklyn-sample/src/main/resources/logback-custom.xml
[INFO] Exclude: **/src/brooklyn-sample/src/test/java/**/*.java
[INFO] Exclude: **/.git/**
[INFO] Exclude: **/.gitignore
[INFO] Exclude: **/.repository/**
[INFO] Exclude: **/.idea/**
[INFO] Exclude: **/*.iml
[INFO] Exclude: **/.classpath/**
[INFO] Exclude: **/.project
[INFO] Exclude: **/.settings/**
[INFO] Exclude: **/*.log
[INFO] Exclude: **/brooklyn*.log.*
[INFO] Exclude: **/target/**
[INFO] Exclude: ignored/**
[INFO] Exclude: LICENSE.md
[INFO] Exclude: **/src/main/license/**
[INFO] Exclude: **/src/test/license/**
[INFO] Exclude: **/MANIFEST.MF
[INFO] Exclude: **/test-output/**
[INFO] Exclude: **/*.pem.pub
[INFO] Exclude: **/*.pem
[INFO] Exclude: **/*_rsa.pub
[INFO] Exclude: **/*_rsa
[INFO] Exclude: **/*.svg
[INFO] Exclude: **/*.crt
[INFO] Exclude: **/*.csr
[INFO] Exclude: **/*.key
[INFO] Exclude: **/*.key.org
[INFO] Exclude: **/*.psd
[INFO] Exclude: **/*.json
[INFO] Exclude: **/*.plxarc
[INFO] Exclude: **/src/test/resources/org/apache/brooklyn/entity/software/base/template_with_extra_substitutions.txt
[INFO] Exclude: **/src/main/resources/banner.txt
[INFO] Exclude: **/src/test/resources/ssl/certs/localhost/info.txt
[INFO] Exclude: **/src/main/history/dependencies.xml
[INFO] Exclude: **/sandbox/examples/src/main/scripts/amis.txt
[INFO] Exclude: docs/**
[INFO] 9 resources included (use -debug for more details)
[INFO] Rat check: Summary of files. Unapproved: 0 unknown: 0 generated: 0 approved: 7 licence.
[INFO] 
[INFO] --- maven-source-plugin:2.4:jar-no-fork (attach-sources) @ brooklyn-archetype-quickstart
---
[INFO] Building jar: F:\hudson\hudson-slave\workspace\incubator-brooklyn-master-windows\usage\archetypes\quickstart\target\brooklyn-archetype-quickstart-0.9.0-SNAPSHOT-sources.jar
[INFO] 
[INFO] --- maven-source-plugin:2.4:test-jar-no-fork (attach-sources) @ brooklyn-archetype-quickstart
---
[INFO] Building jar: F:\hudson\hudson-slave\workspace\incubator-brooklyn-master-windows\usage\archetypes\quickstart\target\brooklyn-archetype-quickstart-0.9.0-SNAPSHOT-test-sources.jar
[INFO] 
[INFO] --- maven-install-plugin:2.5.2:install (default-install) @ brooklyn-archetype-quickstart
---
[INFO] Installing F:\hudson\hudson-slave\workspace\incubator-brooklyn-master-windows\usage\archetypes\quickstart\target\brooklyn-archetype-quickstart-0.9.0-SNAPSHOT.jar
to f:\hudson\hudson-slave\maven-repositories\1\org\apache\brooklyn\brooklyn-archetype-quickstart\0.9.0-SNAPSHOT\brooklyn-archetype-quickstart-0.9.0-SNAPSHOT.jar
[INFO] Installing F:\hudson\hudson-slave\workspace\incubator-brooklyn-master-windows\usage\archetypes\quickstart\pom.xml
to f:\hudson\hudson-slave\maven-repositories\1\org\apache\brooklyn\brooklyn-archetype-quickstart\0.9.0-SNAPSHOT\brooklyn-archetype-quickstart-0.9.0-SNAPSHOT.pom
[INFO] Installing F:\hudson\hudson-slave\workspace\incubator-brooklyn-master-windows\usage\archetypes\quickstart\target\brooklyn-archetype-quickstart-0.9.0-SNAPSHOT-tests.jar
to f:\hudson\hudson-slave\maven-repositories\1\org\apache\brooklyn\brooklyn-archetype-quickstart\0.9.0-SNAPSHOT\brooklyn-archetype-quickstart-0.9.0-SNAPSHOT-tests.jar
[INFO] Installing F:\hudson\hudson-slave\workspace\incubator-brooklyn-master-windows\usage\archetypes\quickstart\target\brooklyn-archetype-quickstart-0.9.0-SNAPSHOT-sources.jar
to f:\hudson\hudson-slave\maven-repositories\1\org\apache\brooklyn\brooklyn-archetype-quickstart\0.9.0-SNAPSHOT\brooklyn-archetype-quickstart-0.9.0-SNAPSHOT-sources.jar
[INFO] Installing F:\hudson\hudson-slave\workspace\incubator-brooklyn-master-windows\usage\archetypes\quickstart\target\brooklyn-archetype-quickstart-0.9.0-SNAPSHOT-test-sources.jar
to f:\hudson\hudson-slave\maven-repositories\1\org\apache\brooklyn\brooklyn-archetype-quickstart\0.9.0-SNAPSHOT\brooklyn-archetype-quickstart-0.9.0-SNAPSHOT-test-sources.jar
[INFO] 
[INFO] --- maven-archetype-plugin:2.3:update-local-catalog (default-update-local-catalog)
@ brooklyn-archetype-quickstart ---
[JENKINS] Archiving disabled
[INFO]                                                                         
[INFO] ------------------------------------------------------------------------
[INFO] Skipping Brooklyn Distribution
[INFO] This project has been banned from the build due to previous failures.
[INFO] ------------------------------------------------------------------------
[INFO]                                                                         
[INFO] ------------------------------------------------------------------------
[INFO] Skipping Brooklyn QA
[INFO] This project has been banned from the build due to previous failures.
[INFO] ------------------------------------------------------------------------
[INFO]                                                                         
[INFO] ------------------------------------------------------------------------
[INFO] Skipping Brooklyn REST Client
[INFO] This project has been banned from the build due to previous failures.
[INFO] ------------------------------------------------------------------------
[INFO] ------------------------------------------------------------------------
[INFO] Reactor Summary:
[INFO] 
[INFO] Brooklyn Root ..................................... SUCCESS [21.263s]
[INFO] Brooklyn Parent Project ........................... SUCCESS [8.552s]
[INFO] Brooklyn Logback Configuration .................... SUCCESS [5.169s]
[INFO] Brooklyn Test Support Utilities ................... SUCCESS [4.830s]
[INFO] Brooklyn Logback Includable Configuration ......... SUCCESS [5.605s]
[INFO] Brooklyn Common Utilities ......................... SUCCESS [33.100s]
[INFO] Brooklyn API ...................................... SUCCESS [6.659s]
[INFO] Brooklyn Test Support ............................. SUCCESS [5.135s]
[INFO] Brooklyn Downstream Project Parent ................ SUCCESS [5.126s]
[INFO] CAMP Server Parent Project ........................ SUCCESS [6.912s]
[INFO] CAMP Base ......................................... SUCCESS [10.336s]
[INFO] Brooklyn REST Swagger Apidoc Utilities ............ SUCCESS [15.786s]
[INFO] CAMP Server ....................................... SUCCESS [15.253s]
[INFO] Brooklyn OSGi Utils ............................... SUCCESS [7.136s]
[INFO] Brooklyn Felix Runtime ............................ SUCCESS [18.722s]
[INFO] Brooklyn Groovy Utilities ......................... SUCCESS [3.301s]
[INFO] Brooklyn Core ..................................... FAILURE [4:20.047s]
[INFO] Brooklyn Examples Aggregator Project .............. SUCCESS [2.633s]
[INFO] Brooklyn Examples Aggregator Project - Webapps .... SUCCESS [1.509s]
[INFO] hello-world-webapp Maven Webapp ................... SUCCESS [2.771s]
[INFO] hello-world-sql-webapp Maven Webapp ............... SUCCESS [7.958s]
[INFO] Brooklyn Policies ................................. SKIPPED
[INFO] Brooklyn WinRM Software Entities .................. SKIPPED
[INFO] Brooklyn Jclouds Location Targets ................. SKIPPED
[INFO] Brooklyn Secure JMXMP Agent ....................... SKIPPED
[INFO] Brooklyn JMX RMI Agent ............................ SUCCESS [7.153s]
[INFO] Brooklyn Software Base ............................ SKIPPED
[INFO] Brooklyn Web App Software Entities ................ SKIPPED
[INFO] Brooklyn Messaging Software Entities .............. SKIPPED
[INFO] Brooklyn Database Software Entities ............... SKIPPED
[INFO] Brooklyn Monitoring Software Entities ............. SKIPPED
[INFO] Brooklyn OSGi Software Entities ................... SKIPPED
[INFO] Brooklyn NoSQL Data Store Software Entities ....... SKIPPED
[INFO] Brooklyn Network Software Entities ................ SKIPPED
[INFO] Brooklyn REST API ................................. SUCCESS [20.892s]
[INFO] Brooklyn CAMP REST API ............................ SKIPPED
[INFO] Brooklyn REST Server .............................. SKIPPED
[INFO] Brooklyn REST JavaScript Web GUI .................. SKIPPED
[INFO] Brooklyn Launcher ................................. SKIPPED
[INFO] Brooklyn Command Line Interface ................... SKIPPED
[INFO] Brooklyn Test Framework ........................... SKIPPED
[INFO] Brooklyn All Things ............................... SKIPPED
[INFO] Brooklyn Simple Web Cluster Example ............... SKIPPED
[INFO] Brooklyn Global Web Fabric Example ................ SKIPPED
[INFO] Brooklyn Simple Messaging Publish-Subscribe Example  SKIPPED
[INFO] Brooklyn NoSQL Cluster Examples ................... SKIPPED
[INFO] Brooklyn Karaf .................................... SUCCESS [16.002s]
[INFO] Brooklyn Karaf Shell Commands ..................... SUCCESS [16.665s]
[INFO] Brooklyn Hazelcast Storage ........................ SKIPPED
[INFO] Brooklyn Quick-Start Project Archetype ............ SUCCESS [42.235s]
[INFO] Brooklyn Distribution ............................. SKIPPED
[INFO] Brooklyn QA ....................................... SKIPPED
[INFO] Brooklyn REST Client .............................. SKIPPED
[INFO] ------------------------------------------------------------------------
[INFO] BUILD FAILURE
[INFO] ------------------------------------------------------------------------
[INFO] Total time: 12:49.454s
[INFO] Finished at: Mon Dec 21 13:28:46 GMT 2015
[INFO] Final Memory: 81M/243M
[INFO] ------------------------------------------------------------------------
[JENKINS] Archiving disabled
[JENKINS] Archiving disabled
[JENKINS] Archiving disabled
[JENKINS] Archiving disabled
[JENKINS] Archiving disabled
[JENKINS] Archiving disabled
[JENKINS] Archiving disabled
[JENKINS] Archiving disabled
[JENKINS] Archiving disabled
[JENKINS] Archiving disabled
[JENKINS] Archiving disabled
[JENKINS] Archiving disabled
[JENKINS] Archiving disabled
[JENKINS] Archiving disabled
[JENKINS] Archiving disabled
[JENKINS] Archiving disabled
[JENKINS] Archiving disabled
[JENKINS] Archiving disabled
[JENKINS] Archiving disabled
[JENKINS] Archiving disabled
[JENKINS] Archiving disabled
[JENKINS] Archiving disabled
[JENKINS] Archiving disabled
[JENKINS] Archiving disabled
[JENKINS] Archiving disabled
[JENKINS] Archiving disabled
[JENKINS] Archiving disabled
[JENKINS] Archiving disabled
[JENKINS] Archiving disabled
[JENKINS] Archiving disabled
[JENKINS] Archiving disabled
[JENKINS] Archiving disabled
[JENKINS] Archiving disabled
[JENKINS] Archiving disabled
[JENKINS] Archiving disabled
[JENKINS] Archiving disabled
[JENKINS] Archiving disabled
[JENKINS] Archiving disabled
[JENKINS] Archiving disabled
[JENKINS] Archiving disabled
[JENKINS] Archiving disabled
[JENKINS] Archiving disabled
[JENKINS] Archiving disabled
[JENKINS] Archiving disabled
[JENKINS] Archiving disabled
[JENKINS] Archiving disabled
[JENKINS] Archiving disabled
[JENKINS] Archiving disabled
[JENKINS] Archiving disabled
[JENKINS] Archiving disabled
[JENKINS] Archiving disabled
[JENKINS] Archiving disabled
[JENKINS] Archiving disabled
Waiting for Jenkins to finish collecting data
[ERROR] Failed to execute goal org.apache.maven.plugins:maven-surefire-plugin:2.18.1:test
(default-test) on project brooklyn-core: There are test failures.
[ERROR] 
[ERROR] Please refer to F:\hudson\hudson-slave\workspace\incubator-brooklyn-master-windows\core\target\surefire-reports
for the individual test results.
[ERROR] -> [Help 1]
[ERROR] 
[ERROR] To see the full stack trace of the errors, re-run Maven with the -e switch.
[ERROR] Re-run Maven using the -X switch to enable full debug logging.
[ERROR] 
[ERROR] For more information about the errors and possible solutions, please read the following
articles:
[ERROR] [Help 1] http://cwiki.apache.org/confluence/display/MAVEN/MojoFailureException
[ERROR] 
[ERROR] After correcting the problems, you can resume the build with the command
[ERROR]   mvn <goals> -rf :brooklyn-core
channel stopped

Mime
View raw message