brooklyn-dev mailing list archives

Site index · List index
Message view « Date » · « Thread »
Top « Date » · « Thread »
From Apache Jenkins Server <jenk...@builds.apache.org>
Subject Build failed in Jenkins: incubator-brooklyn-master-windows #359
Date Sat, 21 Nov 2015 15:14:24 GMT
See <https://builds.apache.org/job/incubator-brooklyn-master-windows/359/changes>

Changes:

[sam.corbett] Trivial fixes to doc/formatting/etc.

[sam.corbett] Simplify ResourceUtils argument check

[sam.corbett] Adds ResourceExists constraint to several entities

[hadrian] Fix eclipse 'Cannot cast' error

------------------------------------------
[...truncated 29404 lines...]
2015-11-21 14:44:48,679 INFO  TESTNG INVOKING CONFIGURATION: "Surefire test" - @BeforeMethod
org.apache.brooklyn.camp.brooklyn.AbstractYamlTest.setUp()
2015-11-21 14:44:48,681 INFO  TESTNG PASSED CONFIGURATION: "Surefire test" - @BeforeMethod
org.apache.brooklyn.camp.brooklyn.AbstractYamlTest.setUp() finished in 2 ms
2015-11-21 14:44:48,681 INFO  TESTNG INVOKING: "Surefire test" - org.apache.brooklyn.camp.brooklyn.catalog.SpecParameterUnwrappingTest.testDepentantCatalogsOverrideParameters(java.lang.Class)(value(s):
class org.apache.brooklyn.camp.brooklyn.catalog.SpecParameterUnwrappingTest$ConfigEntityForTest)
2015-11-21 14:44:48,739 INFO  TESTNG PASSED: "Surefire test" - org.apache.brooklyn.camp.brooklyn.catalog.SpecParameterUnwrappingTest.testDepentantCatalogsOverrideParameters(java.lang.Class)(value(s):
class org.apache.brooklyn.camp.brooklyn.catalog.SpecParameterUnwrappingTest$ConfigEntityForTest)
finished in 58 ms
2015-11-21 14:44:48,739 INFO  TESTNG INVOKING CONFIGURATION: "Surefire test" - @AfterMethod
org.apache.brooklyn.camp.brooklyn.AbstractYamlTest.tearDown()
2015-11-21 14:44:48,740 INFO  TESTNG PASSED CONFIGURATION: "Surefire test" - @AfterMethod
org.apache.brooklyn.camp.brooklyn.AbstractYamlTest.tearDown() finished in 1 ms
2015-11-21 14:44:48,740 INFO  TESTNG INVOKING CONFIGURATION: "Surefire test" - @BeforeMethod
org.apache.brooklyn.camp.brooklyn.AbstractYamlTest.setUp()
2015-11-21 14:44:48,743 INFO  TESTNG PASSED CONFIGURATION: "Surefire test" - @BeforeMethod
org.apache.brooklyn.camp.brooklyn.AbstractYamlTest.setUp() finished in 3 ms
2015-11-21 14:44:48,743 INFO  TESTNG INVOKING: "Surefire test" - org.apache.brooklyn.camp.brooklyn.catalog.SpecParameterUnwrappingTest.testDepentantCatalogsOverrideParameters(java.lang.Class)(value(s):
class org.apache.brooklyn.camp.brooklyn.catalog.SpecParameterUnwrappingTest$ConfigPolicyForTest)
2015-11-21 14:44:48,776 INFO  TESTNG PASSED: "Surefire test" - org.apache.brooklyn.camp.brooklyn.catalog.SpecParameterUnwrappingTest.testDepentantCatalogsOverrideParameters(java.lang.Class)(value(s):
class org.apache.brooklyn.camp.brooklyn.catalog.SpecParameterUnwrappingTest$ConfigPolicyForTest)
finished in 33 ms
2015-11-21 14:44:48,777 INFO  TESTNG INVOKING CONFIGURATION: "Surefire test" - @AfterMethod
org.apache.brooklyn.camp.brooklyn.AbstractYamlTest.tearDown()
2015-11-21 14:44:48,777 INFO  TESTNG PASSED CONFIGURATION: "Surefire test" - @AfterMethod
org.apache.brooklyn.camp.brooklyn.AbstractYamlTest.tearDown() finished in 0 ms
2015-11-21 14:44:48,778 INFO  TESTNG INVOKING CONFIGURATION: "Surefire test" - @BeforeMethod
org.apache.brooklyn.camp.brooklyn.AbstractYamlTest.setUp()
2015-11-21 14:44:48,780 INFO  TESTNG PASSED CONFIGURATION: "Surefire test" - @BeforeMethod
org.apache.brooklyn.camp.brooklyn.AbstractYamlTest.setUp() finished in 2 ms
2015-11-21 14:44:48,781 INFO  TESTNG INVOKING: "Surefire test" - org.apache.brooklyn.camp.brooklyn.catalog.SpecParameterUnwrappingTest.testDepentantCatalogsOverrideParameters(java.lang.Class)(value(s):
class org.apache.brooklyn.camp.brooklyn.catalog.SpecParameterUnwrappingTest$ConfigLocationForTest)
2015-11-21 14:44:48,837 INFO  TESTNG PASSED: "Surefire test" - org.apache.brooklyn.camp.brooklyn.catalog.SpecParameterUnwrappingTest.testDepentantCatalogsOverrideParameters(java.lang.Class)(value(s):
class org.apache.brooklyn.camp.brooklyn.catalog.SpecParameterUnwrappingTest$ConfigLocationForTest)
finished in 57 ms
2015-11-21 14:44:48,837 INFO  TESTNG INVOKING CONFIGURATION: "Surefire test" - @AfterMethod
org.apache.brooklyn.camp.brooklyn.AbstractYamlTest.tearDown()
2015-11-21 14:44:48,837 INFO  TESTNG PASSED CONFIGURATION: "Surefire test" - @AfterMethod
org.apache.brooklyn.camp.brooklyn.AbstractYamlTest.tearDown() finished in 0 ms
2015-11-21 14:44:48,838 INFO  TESTNG INVOKING CONFIGURATION: "Surefire test" - @BeforeMethod
org.apache.brooklyn.camp.brooklyn.AbstractYamlTest.setUp()
2015-11-21 14:44:48,841 INFO  TESTNG PASSED CONFIGURATION: "Surefire test" - @BeforeMethod
org.apache.brooklyn.camp.brooklyn.AbstractYamlTest.setUp() finished in 2 ms
2015-11-21 14:44:48,841 INFO  TESTNG INVOKING: "Surefire test" - org.apache.brooklyn.camp.brooklyn.catalog.SpecParameterUnwrappingTest.testParameters(java.lang.Class)(value(s):
class org.apache.brooklyn.camp.brooklyn.catalog.SpecParameterUnwrappingTest$ConfigEntityForTest)
2015-11-21 14:44:48,881 INFO  TESTNG PASSED: "Surefire test" - org.apache.brooklyn.camp.brooklyn.catalog.SpecParameterUnwrappingTest.testParameters(java.lang.Class)(value(s):
class org.apache.brooklyn.camp.brooklyn.catalog.SpecParameterUnwrappingTest$ConfigEntityForTest)
finished in 40 ms
2015-11-21 14:44:48,881 INFO  TESTNG INVOKING CONFIGURATION: "Surefire test" - @AfterMethod
org.apache.brooklyn.camp.brooklyn.AbstractYamlTest.tearDown()
2015-11-21 14:44:48,882 INFO  TESTNG PASSED CONFIGURATION: "Surefire test" - @AfterMethod
org.apache.brooklyn.camp.brooklyn.AbstractYamlTest.tearDown() finished in 1 ms
2015-11-21 14:44:48,882 INFO  TESTNG INVOKING CONFIGURATION: "Surefire test" - @BeforeMethod
org.apache.brooklyn.camp.brooklyn.AbstractYamlTest.setUp()
2015-11-21 14:44:48,884 INFO  TESTNG PASSED CONFIGURATION: "Surefire test" - @BeforeMethod
org.apache.brooklyn.camp.brooklyn.AbstractYamlTest.setUp() finished in 2 ms
2015-11-21 14:44:48,885 INFO  TESTNG INVOKING: "Surefire test" - org.apache.brooklyn.camp.brooklyn.catalog.SpecParameterUnwrappingTest.testParameters(java.lang.Class)(value(s):
class org.apache.brooklyn.camp.brooklyn.catalog.SpecParameterUnwrappingTest$ConfigPolicyForTest)
2015-11-21 14:44:48,974 INFO  TESTNG PASSED: "Surefire test" - org.apache.brooklyn.camp.brooklyn.catalog.SpecParameterUnwrappingTest.testParameters(java.lang.Class)(value(s):
class org.apache.brooklyn.camp.brooklyn.catalog.SpecParameterUnwrappingTest$ConfigPolicyForTest)
finished in 89 ms
2015-11-21 14:44:48,975 INFO  TESTNG INVOKING CONFIGURATION: "Surefire test" - @AfterMethod
org.apache.brooklyn.camp.brooklyn.AbstractYamlTest.tearDown()
2015-11-21 14:44:48,976 INFO  TESTNG PASSED CONFIGURATION: "Surefire test" - @AfterMethod
org.apache.brooklyn.camp.brooklyn.AbstractYamlTest.tearDown() finished in 1 ms
2015-11-21 14:44:48,976 INFO  TESTNG INVOKING CONFIGURATION: "Surefire test" - @BeforeMethod
org.apache.brooklyn.camp.brooklyn.AbstractYamlTest.setUp()
2015-11-21 14:44:48,978 INFO  TESTNG PASSED CONFIGURATION: "Surefire test" - @BeforeMethod
org.apache.brooklyn.camp.brooklyn.AbstractYamlTest.setUp() finished in 2 ms
2015-11-21 14:44:48,979 INFO  TESTNG INVOKING: "Surefire test" - org.apache.brooklyn.camp.brooklyn.catalog.SpecParameterUnwrappingTest.testParameters(java.lang.Class)(value(s):
class org.apache.brooklyn.camp.brooklyn.catalog.SpecParameterUnwrappingTest$ConfigLocationForTest)
2015-11-21 14:44:49,009 INFO  TESTNG PASSED: "Surefire test" - org.apache.brooklyn.camp.brooklyn.catalog.SpecParameterUnwrappingTest.testParameters(java.lang.Class)(value(s):
class org.apache.brooklyn.camp.brooklyn.catalog.SpecParameterUnwrappingTest$ConfigLocationForTest)
finished in 31 ms
2015-11-21 14:44:49,010 INFO  TESTNG INVOKING CONFIGURATION: "Surefire test" - @AfterMethod
org.apache.brooklyn.camp.brooklyn.AbstractYamlTest.tearDown()
2015-11-21 14:44:49,010 INFO  TESTNG PASSED CONFIGURATION: "Surefire test" - @AfterMethod
org.apache.brooklyn.camp.brooklyn.AbstractYamlTest.tearDown() finished in 0 ms
2015-11-21 14:44:49,011 INFO  TESTNG INVOKING CONFIGURATION: "Surefire test" - @BeforeMethod
org.apache.brooklyn.camp.brooklyn.AbstractYamlTest.setUp()
2015-11-21 14:44:49,012 INFO  TESTNG PASSED CONFIGURATION: "Surefire test" - @BeforeMethod
org.apache.brooklyn.camp.brooklyn.AbstractYamlTest.setUp() finished in 1 ms
2015-11-21 14:44:49,013 INFO  TESTNG INVOKING: "Surefire test" - org.apache.brooklyn.camp.brooklyn.catalog.SpecParameterUnwrappingTest.testParametersCoercedOnSetAndReferences()
SUREFIRE-859: [GC 755343K->510733K(777984K), 0.0290028 secs]
2015-11-21 14:44:49,453 INFO  Started application BasicApplicationImpl{id=sJ78h4cG}
2015-11-21 14:44:49,455 INFO  Started application BasicApplicationImpl{id=Jfb93Sy7}
2015-11-21 14:44:49,456 WARN  Setting BasicApplicationImpl{id=Jfb93Sy7} on-fire due to problems
when expected running, up=false, not-up-indicators: {}
2015-11-21 14:44:49,462 INFO  TESTNG PASSED: "Surefire test" - org.apache.brooklyn.camp.brooklyn.catalog.SpecParameterUnwrappingTest.testParametersCoercedOnSetAndReferences()
finished in 448 ms
2015-11-21 14:44:49,462 INFO  TESTNG INVOKING CONFIGURATION: "Surefire test" - @AfterMethod
org.apache.brooklyn.camp.brooklyn.AbstractYamlTest.tearDown()
2015-11-21 14:44:49,464 INFO  Stopping application BasicApplicationImpl{id=Jfb93Sy7}
2015-11-21 14:44:49,466 INFO  Stopping application BasicApplicationImpl{id=sJ78h4cG}
2015-11-21 14:44:49,469 INFO  Stopped application BasicApplicationImpl{id=sJ78h4cG}
2015-11-21 14:44:49,472 INFO  Stopped application BasicApplicationImpl{id=Jfb93Sy7}
2015-11-21 14:44:49,483 INFO  TESTNG PASSED CONFIGURATION: "Surefire test" - @AfterMethod
org.apache.brooklyn.camp.brooklyn.AbstractYamlTest.tearDown() finished in 21 ms
2015-11-21 14:44:49,484 INFO  TESTNG INVOKING CONFIGURATION: "Surefire test" - @BeforeMethod
org.apache.brooklyn.camp.brooklyn.AbstractYamlTest.setUp()
2015-11-21 14:44:49,487 INFO  TESTNG PASSED CONFIGURATION: "Surefire test" - @BeforeMethod
org.apache.brooklyn.camp.brooklyn.AbstractYamlTest.setUp() finished in 3 ms
2015-11-21 14:44:49,487 INFO  TESTNG INVOKING: "Surefire test" - org.apache.brooklyn.camp.brooklyn.catalog.SpecParameterUnwrappingTest.testRootParametersUnwrapped()
2015-11-21 14:44:49,530 INFO  TESTNG PASSED: "Surefire test" - org.apache.brooklyn.camp.brooklyn.catalog.SpecParameterUnwrappingTest.testRootParametersUnwrapped()
finished in 43 ms
2015-11-21 14:44:49,530 INFO  TESTNG INVOKING CONFIGURATION: "Surefire test" - @AfterMethod
org.apache.brooklyn.camp.brooklyn.AbstractYamlTest.tearDown()
2015-11-21 14:44:49,531 INFO  TESTNG PASSED CONFIGURATION: "Surefire test" - @AfterMethod
org.apache.brooklyn.camp.brooklyn.AbstractYamlTest.tearDown() finished in 1 ms
2015-11-21 14:44:49,531 INFO  TESTNG INVOKING CONFIGURATION: "Surefire test" - @BeforeMethod
org.apache.brooklyn.camp.brooklyn.AbstractYamlTest.setUp()
2015-11-21 14:44:49,533 INFO  TESTNG PASSED CONFIGURATION: "Surefire test" - @BeforeMethod
org.apache.brooklyn.camp.brooklyn.AbstractYamlTest.setUp() finished in 2 ms
2015-11-21 14:44:49,534 INFO  TESTNG INVOKING: "Surefire test" - org.apache.brooklyn.camp.brooklyn.catalog.SpecParameterUnwrappingTest.testUnresolvedCatalogItemParameters()
2015-11-21 14:44:49,631 INFO  TESTNG PASSED: "Surefire test" - org.apache.brooklyn.camp.brooklyn.catalog.SpecParameterUnwrappingTest.testUnresolvedCatalogItemParameters()
finished in 97 ms
2015-11-21 14:44:49,631 INFO  TESTNG INVOKING CONFIGURATION: "Surefire test" - @AfterMethod
org.apache.brooklyn.camp.brooklyn.AbstractYamlTest.tearDown()
2015-11-21 14:44:49,632 INFO  TESTNG PASSED CONFIGURATION: "Surefire test" - @AfterMethod
org.apache.brooklyn.camp.brooklyn.AbstractYamlTest.tearDown() finished in 1 ms
2015-11-21 14:44:49,698 INFO  TESTNG 
===============================================
    Surefire test
    Tests run: 266, Failures: 1, Skips: 1
===============================================
2015-11-21 14:44:49,699 INFO  BrooklynLeakListener.onFinish attempting to terminate all extant
ManagementContexts: name=Surefire test; includedGroups=[]; excludedGroups=[Integration, Acceptance,
Live, Broken, WIP]; suiteName=Surefire suite; outDir=F:\hudson\hudson-slave\workspace\incubator-brooklyn-master-windows\usage\camp\target\surefire-reports\Surefire
suite: no org.apache.brooklyn.core.management.internal.LocalManagementContext available, so
skipped
Tests run: 266, Failures: 1, Errors: 0, Skipped: 1, Time elapsed: 227.664 sec <<<
FAILURE! - in TestSuite
testWithAppEnricher(org.apache.brooklyn.camp.brooklyn.EnrichersSlightlySimplerYamlTest)  Time
elapsed: 0.884 sec  <<< FAILURE!
java.lang.AssertionError: Wrong URI:  expected [true] but found [false]
	at org.testng.Assert.fail(Assert.java:94)
	at org.testng.Assert.failNotEquals(Assert.java:494)
	at org.testng.Assert.assertTrue(Assert.java:42)
	at org.apache.brooklyn.camp.brooklyn.EnrichersSlightlySimplerYamlTest.testWithAppEnricher(EnrichersSlightlySimplerYamlTest.java:89)


Results :

Failed tests: 
  EnrichersSlightlySimplerYamlTest.testWithAppEnricher:89 Wrong URI:  expected [true] but
found [false]

Tests run: 265, Failures: 1, Errors: 0, Skipped: 0

[JENKINS] Recording test results
[JENKINS] Archiving disabled
[INFO]                                                                         
[INFO] ------------------------------------------------------------------------
[INFO] Skipping Brooklyn REST Server
[INFO] This project has been banned from the build due to previous failures.
[INFO] ------------------------------------------------------------------------
[INFO]                                                                         
[INFO] ------------------------------------------------------------------------
[INFO] Skipping Brooklyn REST JavaScript Web GUI
[INFO] This project has been banned from the build due to previous failures.
[INFO] ------------------------------------------------------------------------
[INFO]                                                                         
[INFO] ------------------------------------------------------------------------
[INFO] Skipping Brooklyn Launcher
[INFO] This project has been banned from the build due to previous failures.
[INFO] ------------------------------------------------------------------------
[INFO]                                                                         
[INFO] ------------------------------------------------------------------------
[INFO] Skipping Brooklyn Command Line Interface
[INFO] This project has been banned from the build due to previous failures.
[INFO] ------------------------------------------------------------------------
[INFO]                                                                         
[INFO] ------------------------------------------------------------------------
[INFO] Skipping Brooklyn Test Framework
[INFO] This project has been banned from the build due to previous failures.
[INFO] ------------------------------------------------------------------------
[INFO]                                                                         
[INFO] ------------------------------------------------------------------------
[INFO] Skipping Brooklyn All Things
[INFO] This project has been banned from the build due to previous failures.
[INFO] ------------------------------------------------------------------------
[INFO]                                                                         
[INFO] ------------------------------------------------------------------------
[INFO] Skipping Brooklyn Simple Web Cluster Example
[INFO] This project has been banned from the build due to previous failures.
[INFO] ------------------------------------------------------------------------
[INFO]                                                                         
[INFO] ------------------------------------------------------------------------
[INFO] Skipping Brooklyn Global Web Fabric Example
[INFO] This project has been banned from the build due to previous failures.
[INFO] ------------------------------------------------------------------------
[INFO]                                                                         
[INFO] ------------------------------------------------------------------------
[INFO] Skipping Brooklyn Simple Messaging Publish-Subscribe Example
[INFO] This project has been banned from the build due to previous failures.
[INFO] ------------------------------------------------------------------------
[INFO]                                                                         
[INFO] ------------------------------------------------------------------------
[INFO] Skipping Brooklyn NoSQL Cluster Examples
[INFO] This project has been banned from the build due to previous failures.
[INFO] ------------------------------------------------------------------------
[INFO]                                                                         
[INFO] ------------------------------------------------------------------------
[INFO] Skipping Brooklyn Distribution
[INFO] This project has been banned from the build due to previous failures.
[INFO] ------------------------------------------------------------------------
[INFO]                                                                         
[INFO] ------------------------------------------------------------------------
[INFO] Skipping Brooklyn QA
[INFO] This project has been banned from the build due to previous failures.
[INFO] ------------------------------------------------------------------------
[INFO]                                                                         
[INFO] ------------------------------------------------------------------------
[INFO] Skipping Brooklyn REST Client
[INFO] This project has been banned from the build due to previous failures.
[INFO] ------------------------------------------------------------------------
[INFO] ------------------------------------------------------------------------
[INFO] Reactor Summary:
[INFO] 
[INFO] Brooklyn Root ..................................... SUCCESS [3.922s]
[INFO] Brooklyn Parent Project ........................... SUCCESS [6.955s]
[INFO] Brooklyn Test Support Utilities ................... SUCCESS [7.773s]
[INFO] Brooklyn Logback Includable Configuration ......... SUCCESS [1.110s]
[INFO] Brooklyn Common Utilities ......................... SUCCESS [31.789s]
[INFO] Brooklyn API ...................................... SUCCESS [5.408s]
[INFO] Brooklyn Test Support ............................. SUCCESS [1.939s]
[INFO] Brooklyn OSGi Utils ............................... SUCCESS [3.339s]
[INFO] Brooklyn Felix Runtime ............................ SUCCESS [4.291s]
[INFO] Brooklyn Groovy Utilities ......................... SUCCESS [1.540s]
[INFO] Brooklyn Core ..................................... SUCCESS [4:22.563s]
[INFO] Brooklyn Policies ................................. SUCCESS [1:28.319s]
[INFO] Brooklyn WinRM Software Entities .................. SUCCESS [10.129s]
[INFO] Brooklyn Jclouds Location Targets ................. SUCCESS [42.415s]
[INFO] Brooklyn Secure JMXMP Agent ....................... SUCCESS [10.825s]
[INFO] Brooklyn JMX RMI Agent ............................ SUCCESS [0.903s]
[INFO] Brooklyn Software Base ............................ SUCCESS [1:11.838s]
[INFO] Brooklyn Web App Software Entities ................ SUCCESS [1:56.479s]
[INFO] Brooklyn Messaging Software Entities .............. SUCCESS [11.618s]
[INFO] Brooklyn Database Software Entities ............... SUCCESS [7.185s]
[INFO] Brooklyn Monitoring Software Entities ............. SUCCESS [4.617s]
[INFO] Brooklyn OSGi Software Entities ................... SUCCESS [4.512s]
[INFO] Brooklyn NoSQL Data Store Software Entities ....... SUCCESS [26.614s]
[INFO] Brooklyn Network Software Entities ................ SUCCESS [4.771s]
[INFO] Brooklyn CAMP REST API ............................ FAILURE [3:57.374s]
[INFO] Brooklyn REST Server .............................. SKIPPED
[INFO] Brooklyn REST JavaScript Web GUI .................. SKIPPED
[INFO] Brooklyn Launcher ................................. SKIPPED
[INFO] Brooklyn Command Line Interface ................... SKIPPED
[INFO] Brooklyn Test Framework ........................... SKIPPED
[INFO] Brooklyn All Things ............................... SKIPPED
[INFO] Brooklyn Simple Web Cluster Example ............... SKIPPED
[INFO] Brooklyn Global Web Fabric Example ................ SKIPPED
[INFO] Brooklyn Simple Messaging Publish-Subscribe Example  SKIPPED
[INFO] Brooklyn NoSQL Cluster Examples ................... SKIPPED
[INFO] Brooklyn Distribution ............................. SKIPPED
[INFO] Brooklyn QA ....................................... SKIPPED
[INFO] Brooklyn REST Client .............................. SKIPPED
[INFO] ------------------------------------------------------------------------
[INFO] BUILD FAILURE
[INFO] ------------------------------------------------------------------------
[INFO] Total time: 16:23.076s
[INFO] Finished at: Sat Nov 21 14:44:51 GMT 2015
[INFO] Final Memory: 85M/236M
[INFO] ------------------------------------------------------------------------
[JENKINS] Archiving disabled
[JENKINS] Archiving disabled
[JENKINS] Archiving disabled
[JENKINS] Archiving disabled
[JENKINS] Archiving disabled
[JENKINS] Archiving disabled
[JENKINS] Archiving disabled
[JENKINS] Archiving disabled
[JENKINS] Archiving disabled
[JENKINS] Archiving disabled
[JENKINS] Archiving disabled
[JENKINS] Archiving disabled
[JENKINS] Archiving disabled
[JENKINS] Archiving disabled
[JENKINS] Archiving disabled
[JENKINS] Archiving disabled
[JENKINS] Archiving disabled
[JENKINS] Archiving disabled
[JENKINS] Archiving disabled
[JENKINS] Archiving disabled
[JENKINS] Archiving disabled
[JENKINS] Archiving disabled
[JENKINS] Archiving disabled
[JENKINS] Archiving disabled
[JENKINS] Archiving disabled
[JENKINS] Archiving disabled
[JENKINS] Archiving disabled
[JENKINS] Archiving disabled
[JENKINS] Archiving disabled
[JENKINS] Archiving disabled
[JENKINS] Archiving disabled
[JENKINS] Archiving disabled
[JENKINS] Archiving disabled
[JENKINS] Archiving disabled
[JENKINS] Archiving disabled
[JENKINS] Archiving disabled
[JENKINS] Archiving disabled
[JENKINS] Archiving disabled
Waiting for Jenkins to finish collecting data
[ERROR] Failed to execute goal org.apache.maven.plugins:maven-surefire-plugin:2.18.1:test
(default-test) on project brooklyn-camp: Error occurred in starting fork, check output in
log -> [Help 1]
[ERROR] 
[ERROR] To see the full stack trace of the errors, re-run Maven with the -e switch.
[ERROR] Re-run Maven using the -X switch to enable full debug logging.
[ERROR] 
[ERROR] For more information about the errors and possible solutions, please read the following
articles:
[ERROR] [Help 1] http://cwiki.apache.org/confluence/display/MAVEN/MojoFailureException
[ERROR] 
[ERROR] After correcting the problems, you can resume the build with the command
[ERROR]   mvn <goals> -rf :brooklyn-camp
channel stopped

Mime
View raw message