brooklyn-dev mailing list archives

Site index · List index
Message view « Date » · « Thread »
Top « Date » · « Thread »
From Apache Jenkins Server <jenk...@builds.apache.org>
Subject Build failed in Jenkins: incubator-brooklyn-master-build #654
Date Wed, 18 Nov 2015 12:34:35 GMT
See <https://builds.apache.org/job/incubator-brooklyn-master-build/654/>

------------------------------------------
[...truncated 15468 lines...]
2015-11-18 12:34:05,801 INFO  TESTNG INVOKING CONFIGURATION: "Surefire test" - @BeforeMethod
org.apache.brooklyn.core.location.MachinesTest.setUp()
2015-11-18 12:34:05,823 INFO  TESTNG PASSED CONFIGURATION: "Surefire test" - @BeforeMethod
org.apache.brooklyn.core.location.MachinesTest.setUp() finished in 22 ms
2015-11-18 12:34:05,823 INFO  TESTNG INVOKING: "Surefire test" - org.apache.brooklyn.core.location.MachinesTest.testFindSubnetOrPrivateIpFromLocationWithoutPrivate()
2015-11-18 12:34:05,836 INFO  TESTNG PASSED: "Surefire test" - org.apache.brooklyn.core.location.MachinesTest.testFindSubnetOrPrivateIpFromLocationWithoutPrivate()
finished in 13 ms
2015-11-18 12:34:05,837 INFO  TESTNG INVOKING CONFIGURATION: "Surefire test" - @AfterMethod
org.apache.brooklyn.core.test.BrooklynMgmtUnitTestSupport.tearDown()
2015-11-18 12:34:05,843 INFO  TESTNG PASSED CONFIGURATION: "Surefire test" - @AfterMethod
org.apache.brooklyn.core.test.BrooklynMgmtUnitTestSupport.tearDown() finished in 6 ms
2015-11-18 12:34:05,844 INFO  TESTNG INVOKING CONFIGURATION: "Surefire test" - @BeforeMethod
org.apache.brooklyn.core.location.MachinesTest.setUp()
2015-11-18 12:34:05,868 INFO  TESTNG PASSED CONFIGURATION: "Surefire test" - @BeforeMethod
org.apache.brooklyn.core.location.MachinesTest.setUp() finished in 24 ms
2015-11-18 12:34:05,868 INFO  TESTNG INVOKING: "Surefire test" - org.apache.brooklyn.core.location.MachinesTest.testFindSubnetOrPrivateIpWithAddressAttributePrefersLocationPrivateIp()
2015-11-18 12:34:05,882 INFO  TESTNG PASSED: "Surefire test" - org.apache.brooklyn.core.location.MachinesTest.testFindSubnetOrPrivateIpWithAddressAttributePrefersLocationPrivateIp()
finished in 14 ms
2015-11-18 12:34:05,882 INFO  TESTNG INVOKING CONFIGURATION: "Surefire test" - @AfterMethod
org.apache.brooklyn.core.test.BrooklynMgmtUnitTestSupport.tearDown()
2015-11-18 12:34:05,888 INFO  TESTNG PASSED CONFIGURATION: "Surefire test" - @AfterMethod
org.apache.brooklyn.core.test.BrooklynMgmtUnitTestSupport.tearDown() finished in 6 ms
2015-11-18 12:34:05,888 INFO  TESTNG INVOKING CONFIGURATION: "Surefire test" - @BeforeMethod
org.apache.brooklyn.core.location.MachinesTest.setUp()
2015-11-18 12:34:05,912 INFO  TESTNG PASSED CONFIGURATION: "Surefire test" - @BeforeMethod
org.apache.brooklyn.core.location.MachinesTest.setUp() finished in 24 ms
2015-11-18 12:34:05,912 INFO  TESTNG INVOKING: "Surefire test" - org.apache.brooklyn.core.location.MachinesTest.testFindUniqueMachineLocation()
2015-11-18 12:34:05,912 INFO  TESTNG PASSED: "Surefire test" - org.apache.brooklyn.core.location.MachinesTest.testFindUniqueMachineLocation()
finished in 0 ms
2015-11-18 12:34:05,912 INFO  TESTNG INVOKING CONFIGURATION: "Surefire test" - @AfterMethod
org.apache.brooklyn.core.test.BrooklynMgmtUnitTestSupport.tearDown()
2015-11-18 12:34:05,915 INFO  TESTNG PASSED CONFIGURATION: "Surefire test" - @AfterMethod
org.apache.brooklyn.core.test.BrooklynMgmtUnitTestSupport.tearDown() finished in 3 ms
2015-11-18 12:34:05,915 INFO  TESTNG INVOKING CONFIGURATION: "Surefire test" - @BeforeMethod
org.apache.brooklyn.core.location.MachinesTest.setUp()
2015-11-18 12:34:05,935 INFO  TESTNG PASSED CONFIGURATION: "Surefire test" - @BeforeMethod
org.apache.brooklyn.core.location.MachinesTest.setUp() finished in 20 ms
2015-11-18 12:34:05,935 INFO  TESTNG INVOKING: "Surefire test" - org.apache.brooklyn.core.location.MachinesTest.testFindUniqueMachineLocationOfType()
2015-11-18 12:34:05,935 INFO  TESTNG PASSED: "Surefire test" - org.apache.brooklyn.core.location.MachinesTest.testFindUniqueMachineLocationOfType()
finished in 0 ms
2015-11-18 12:34:05,935 INFO  TESTNG INVOKING CONFIGURATION: "Surefire test" - @AfterMethod
org.apache.brooklyn.core.test.BrooklynMgmtUnitTestSupport.tearDown()
2015-11-18 12:34:05,938 INFO  TESTNG PASSED CONFIGURATION: "Surefire test" - @AfterMethod
org.apache.brooklyn.core.test.BrooklynMgmtUnitTestSupport.tearDown() finished in 3 ms
2015-11-18 12:34:05,939 INFO  TESTNG INVOKING CONFIGURATION: "Surefire test" - @BeforeMethod
org.apache.brooklyn.core.location.MachinesTest.setUp()
2015-11-18 12:34:05,959 INFO  TESTNG PASSED CONFIGURATION: "Surefire test" - @BeforeMethod
org.apache.brooklyn.core.location.MachinesTest.setUp() finished in 20 ms
2015-11-18 12:34:05,960 INFO  TESTNG INVOKING: "Surefire test" - org.apache.brooklyn.core.location.MachinesTest.testFindUniqueSshMachineLocation()
2015-11-18 12:34:05,960 INFO  TESTNG PASSED: "Surefire test" - org.apache.brooklyn.core.location.MachinesTest.testFindUniqueSshMachineLocation()
finished in 0 ms
2015-11-18 12:34:05,960 INFO  TESTNG INVOKING CONFIGURATION: "Surefire test" - @AfterMethod
org.apache.brooklyn.core.test.BrooklynMgmtUnitTestSupport.tearDown()
2015-11-18 12:34:05,963 INFO  TESTNG PASSED CONFIGURATION: "Surefire test" - @AfterMethod
org.apache.brooklyn.core.test.BrooklynMgmtUnitTestSupport.tearDown() finished in 3 ms
2015-11-18 12:34:05,964 INFO  TESTNG INVOKING CONFIGURATION: "Surefire test" - @BeforeMethod
org.apache.brooklyn.core.location.MachinesTest.setUp()
2015-11-18 12:34:05,982 INFO  TESTNG PASSED CONFIGURATION: "Surefire test" - @BeforeMethod
org.apache.brooklyn.core.location.MachinesTest.setUp() finished in 18 ms
2015-11-18 12:34:05,982 INFO  TESTNG INVOKING: "Surefire test" - org.apache.brooklyn.core.location.MachinesTest.testWarnIfLocalhost()
2015-11-18 12:34:05,982 WARN  my message
2015-11-18 12:34:05,982 INFO  TESTNG PASSED: "Surefire test" - org.apache.brooklyn.core.location.MachinesTest.testWarnIfLocalhost()
finished in 0 ms
2015-11-18 12:34:05,983 INFO  TESTNG INVOKING CONFIGURATION: "Surefire test" - @AfterMethod
org.apache.brooklyn.core.test.BrooklynMgmtUnitTestSupport.tearDown()
2015-11-18 12:34:05,986 INFO  TESTNG PASSED CONFIGURATION: "Surefire test" - @AfterMethod
org.apache.brooklyn.core.test.BrooklynMgmtUnitTestSupport.tearDown() finished in 3 ms
2015-11-18 12:34:05,987 INFO  TESTNG INVOKING CONFIGURATION: "Surefire test" - @BeforeMethod
org.apache.brooklyn.core.location.LocationPropertiesFromBrooklynPropertiesTest.setUp()
2015-11-18 12:34:05,987 INFO  TESTNG PASSED CONFIGURATION: "Surefire test" - @BeforeMethod
org.apache.brooklyn.core.location.LocationPropertiesFromBrooklynPropertiesTest.setUp() finished
in 1 ms
2015-11-18 12:34:05,987 INFO  TESTNG INVOKING: "Surefire test" - org.apache.brooklyn.core.location.LocationPropertiesFromBrooklynPropertiesTest.testConvertsDeprecatedFormats()
2015-11-18 12:34:05,987 WARN  Deprecated key private-key-data, transformed to privateKeyData;
will not be supported in future versions
2015-11-18 12:34:05,987 WARN  Deprecated key public-key-file, transformed to publicKeyFile;
will not be supported in future versions
2015-11-18 12:34:05,987 WARN  Deprecated key private-key-file, transformed to privateKeyFile;
will not be supported in future versions
2015-11-18 12:34:05,987 INFO  TESTNG PASSED: "Surefire test" - org.apache.brooklyn.core.location.LocationPropertiesFromBrooklynPropertiesTest.testConvertsDeprecatedFormats()
finished in 0 ms
2015-11-18 12:34:05,987 INFO  TESTNG INVOKING CONFIGURATION: "Surefire test" - @BeforeMethod
org.apache.brooklyn.core.location.LocationPropertiesFromBrooklynPropertiesTest.setUp()
2015-11-18 12:34:05,987 INFO  TESTNG PASSED CONFIGURATION: "Surefire test" - @BeforeMethod
org.apache.brooklyn.core.location.LocationPropertiesFromBrooklynPropertiesTest.setUp() finished
in 0 ms
2015-11-18 12:34:05,988 INFO  TESTNG INVOKING: "Surefire test" - org.apache.brooklyn.core.location.LocationPropertiesFromBrooklynPropertiesTest.testExtractProviderProperties()
2015-11-18 12:34:05,988 INFO  TESTNG PASSED: "Surefire test" - org.apache.brooklyn.core.location.LocationPropertiesFromBrooklynPropertiesTest.testExtractProviderProperties()
finished in 0 ms
2015-11-18 12:34:05,988 INFO  TESTNG INVOKING CONFIGURATION: "Surefire test" - @BeforeMethod
org.apache.brooklyn.core.location.LocationPropertiesFromBrooklynPropertiesTest.setUp()
2015-11-18 12:34:05,988 INFO  TESTNG PASSED CONFIGURATION: "Surefire test" - @BeforeMethod
org.apache.brooklyn.core.location.LocationPropertiesFromBrooklynPropertiesTest.setUp() finished
in 0 ms
2015-11-18 12:34:05,988 INFO  TESTNG INVOKING: "Surefire test" - org.apache.brooklyn.core.location.LocationPropertiesFromBrooklynPropertiesTest.testExtractNamedLocationProperties()
2015-11-18 12:34:05,988 INFO  TESTNG PASSED: "Surefire test" - org.apache.brooklyn.core.location.LocationPropertiesFromBrooklynPropertiesTest.testExtractNamedLocationProperties()
finished in 0 ms
2015-11-18 12:34:05,988 INFO  TESTNG INVOKING CONFIGURATION: "Surefire test" - @BeforeMethod
org.apache.brooklyn.core.location.LocationPropertiesFromBrooklynPropertiesTest.setUp()
2015-11-18 12:34:05,989 INFO  TESTNG PASSED CONFIGURATION: "Surefire test" - @BeforeMethod
org.apache.brooklyn.core.location.LocationPropertiesFromBrooklynPropertiesTest.setUp() finished
in 1 ms
2015-11-18 12:34:05,989 INFO  TESTNG INVOKING: "Surefire test" - org.apache.brooklyn.core.location.LocationPropertiesFromBrooklynPropertiesTest.testThrowsIfProviderDoesNotMatchNamed()
2015-11-18 12:34:05,989 INFO  TESTNG PASSED: "Surefire test" - org.apache.brooklyn.core.location.LocationPropertiesFromBrooklynPropertiesTest.testThrowsIfProviderDoesNotMatchNamed()
finished in 0 ms
2015-11-18 12:34:06,149 INFO  TESTNG 
===============================================
    Surefire test
    Tests run: 1602, Failures: 1, Skips: 0
===============================================
2015-11-18 12:34:06,150 INFO  BrooklynLeakListener.onFinish attempting to terminate all extant
ManagementContexts: name=Surefire test; includedGroups=[]; excludedGroups=[Integration, Acceptance,
Live, Broken, WIP]; suiteName=Surefire suite; outDir=<https://builds.apache.org/job/incubator-brooklyn-master-build/ws/core/target/surefire-reports/Surefire>
suite: no org.apache.brooklyn.core.management.internal.LocalManagementContext available, so
skipped
SUREFIRE-859: [GC 504470K->292262K(760832K), 0.0240870 secs]
2015-11-18 12:34:06,673 WARN  Task Task[LSM.publish(Application[I64qb8Vy].Sensor: entity.children.removed
(org.apache.brooklyn.api.entity.Entity)=TestEntityImpl{id=KHTaHnPU} @ 1447850045841);[subscription-delivery-entity-I64qb8Vy[Application[I64qb8Vy]]]:wbmkAmQi]
is being finalized before completion
SUREFIRE-859: [GC 504742K->293982K(764928K), 0.0264370 secs]
Tests run: 1602, Failures: 1, Errors: 0, Skipped: 0, Time elapsed: 128.894 sec <<<
FAILURE! - in TestSuite
testTransitionsThroughLifecycles(org.apache.brooklyn.entity.stock.BasicStartableTest)  Time
elapsed: 0.054 sec  <<< FAILURE!
java.lang.AssertionError: Expected=[starting, running, stopping, stopped], actual=[starting,
running, stopping]: Expected iterator returned more elements than the actual iterator.
	at org.testng.Assert.fail(Assert.java:94)
	at org.testng.Assert.assertEquals(Assert.java:606)
	at org.testng.Assert.assertEquals(Assert.java:643)
	at org.apache.brooklyn.entity.stock.BasicStartableTest.testTransitionsThroughLifecycles(BasicStartableTest.java:164)

2015-11-18 12:34:07,846 INFO  Brooklyn shutdown: stopping entities [TestEntityImpl{id=MjWlHxEk},
TestEntityImpl{id=QBS0Duam}, BlockingEntityImpl{id=LGWWkrQZ}]

Results :

Failed tests: 
  BasicStartableTest.testTransitionsThroughLifecycles:164 Expected=[starting, running, stopping,
stopped], actual=[starting, running, stopping]: Expected iterator returned more elements than
the actual iterator.

Tests run: 1602, Failures: 1, Errors: 0, Skipped: 0

[JENKINS] Recording test results
[INFO] ------------------------------------------------------------------------
[INFO] Reactor Summary:
[INFO] 
[INFO] Brooklyn Root ..................................... SUCCESS [2.351s]
[INFO] Brooklyn Parent Project ........................... SUCCESS [3.778s]
[INFO] Brooklyn Logback Configuration .................... SUCCESS [4.035s]
[INFO] Brooklyn Test Support Utilities ................... SUCCESS [6.974s]
[INFO] Brooklyn Logback Includable Configuration ......... SUCCESS [1.887s]
[INFO] Brooklyn Common Utilities ......................... SUCCESS [23.371s]
[INFO] Brooklyn API ...................................... SUCCESS [4.183s]
[INFO] Brooklyn Test Support ............................. SUCCESS [2.443s]
[INFO] Brooklyn Downstream Project Parent ................ SUCCESS [1.267s]
[INFO] CAMP Server Parent Project ........................ SUCCESS [0.696s]
[INFO] CAMP Base ......................................... SUCCESS [4.552s]
[INFO] Brooklyn REST Swagger Apidoc Utilities ............ SUCCESS [3.346s]
[INFO] CAMP Server ....................................... SUCCESS [7.320s]
[INFO] Brooklyn OSGi Utils ............................... SUCCESS [3.610s]
[INFO] Brooklyn Felix Runtime ............................ SUCCESS [4.264s]
[INFO] Brooklyn Groovy Utilities ......................... SUCCESS [2.012s]
[INFO] Brooklyn Core ..................................... FAILURE [2:41.287s]
[INFO] Brooklyn Examples Aggregator Project .............. SKIPPED
[INFO] Brooklyn Examples Aggregator Project - Webapps .... SKIPPED
[INFO] hello-world-webapp Maven Webapp ................... SKIPPED
[INFO] hello-world-sql-webapp Maven Webapp ............... SKIPPED
[INFO] Brooklyn Policies ................................. SKIPPED
[INFO] Brooklyn WinRM Software Entities .................. SKIPPED
[INFO] Brooklyn Jclouds Location Targets ................. SKIPPED
[INFO] Brooklyn Secure JMXMP Agent ....................... SKIPPED
[INFO] Brooklyn JMX RMI Agent ............................ SKIPPED
[INFO] Brooklyn Software Base ............................ SKIPPED
[INFO] Brooklyn Web App Software Entities ................ SKIPPED
[INFO] Brooklyn Messaging Software Entities .............. SKIPPED
[INFO] Brooklyn Database Software Entities ............... SKIPPED
[INFO] Brooklyn Monitoring Software Entities ............. SKIPPED
[INFO] Brooklyn OSGi Software Entities ................... SKIPPED
[INFO] Brooklyn NoSQL Data Store Software Entities ....... SKIPPED
[INFO] Brooklyn Network Software Entities ................ SKIPPED
[INFO] Brooklyn REST API ................................. SKIPPED
[INFO] Brooklyn CAMP REST API ............................ SKIPPED
[INFO] Brooklyn REST Server .............................. SKIPPED
[INFO] Brooklyn REST JavaScript Web GUI .................. SKIPPED
[INFO] Brooklyn Launcher ................................. SKIPPED
[INFO] Brooklyn Command Line Interface ................... SKIPPED
[INFO] Brooklyn Test Framework ........................... SKIPPED
[INFO] Brooklyn All Things ............................... SKIPPED
[INFO] Brooklyn Simple Web Cluster Example ............... SKIPPED
[INFO] Brooklyn Global Web Fabric Example ................ SKIPPED
[INFO] Brooklyn Simple Messaging Publish-Subscribe Example  SKIPPED
[INFO] Brooklyn NoSQL Cluster Examples ................... SKIPPED
[INFO] Brooklyn Karaf .................................... SKIPPED
[INFO] Brooklyn Karaf Features ........................... SKIPPED
[INFO] Brooklyn Karaf Distro ............................. SKIPPED
[INFO] Brooklyn Karaf Shell Commands ..................... SKIPPED
[INFO] Brooklyn Hazelcast Storage ........................ SKIPPED
[INFO] Brooklyn Quick-Start Project Archetype ............ SKIPPED
[INFO] Brooklyn Distribution ............................. SKIPPED
[INFO] Brooklyn QA ....................................... SKIPPED
[INFO] Brooklyn REST Client .............................. SKIPPED
[INFO] ------------------------------------------------------------------------
[INFO] BUILD FAILURE
[INFO] ------------------------------------------------------------------------
[INFO] Total time: 4:15.016s
[INFO] Finished at: Wed Nov 18 12:34:08 UTC 2015
[INFO] Final Memory: 75M/496M
[INFO] ------------------------------------------------------------------------
Waiting for Jenkins to finish collecting data
[ERROR] Failed to execute goal org.apache.maven.plugins:maven-surefire-plugin:2.18.1:test
(default-test) on project brooklyn-core: There are test failures.
[ERROR] 
[ERROR] Please refer to <https://builds.apache.org/job/incubator-brooklyn-master-build/ws/core/target/surefire-reports>
for the individual test results.
[ERROR] -> [Help 1]
[ERROR] 
[ERROR] To see the full stack trace of the errors, re-run Maven with the -e switch.
[ERROR] Re-run Maven using the -X switch to enable full debug logging.
[ERROR] 
[ERROR] For more information about the errors and possible solutions, please read the following
articles:
[ERROR] [Help 1] http://cwiki.apache.org/confluence/display/MAVEN/MojoFailureException
[ERROR] 
[ERROR] After correcting the problems, you can resume the build with the command
[ERROR]   mvn <goals> -rf :brooklyn-core
[JENKINS] Archiving <https://builds.apache.org/job/incubator-brooklyn-master-build/ws/policy/pom.xml>
to org.apache.brooklyn/brooklyn-policy/0.9.0-SNAPSHOT/brooklyn-policy-0.9.0-SNAPSHOT.pom
[JENKINS] Archiving <https://builds.apache.org/job/incubator-brooklyn-master-build/ws/software/osgi/pom.xml>
to org.apache.brooklyn/brooklyn-software-osgi/0.9.0-SNAPSHOT/brooklyn-software-osgi-0.9.0-SNAPSHOT.pom
[JENKINS] Archiving <https://builds.apache.org/job/incubator-brooklyn-master-build/ws/examples/simple-messaging-pubsub/pom.xml>
to org.apache.brooklyn.example/brooklyn-example-simple-messaging-pubsub/0.9.0-SNAPSHOT/brooklyn-example-simple-messaging-pubsub-0.9.0-SNAPSHOT.pom
[JENKINS] Archiving <https://builds.apache.org/job/incubator-brooklyn-master-build/ws/examples/webapps/hello-world-webapp/pom.xml>
to org.apache.brooklyn.example/brooklyn-example-hello-world-webapp/0.9.0-SNAPSHOT/brooklyn-example-hello-world-webapp-0.9.0-SNAPSHOT.pom
[JENKINS] Archiving <https://builds.apache.org/job/incubator-brooklyn-master-build/ws/core/pom.xml>
to org.apache.brooklyn/brooklyn-core/0.9.0-SNAPSHOT/brooklyn-core-0.9.0-SNAPSHOT.pom
[JENKINS] Archiving <https://builds.apache.org/job/incubator-brooklyn-master-build/ws/usage/jsgui/pom.xml>
to org.apache.brooklyn/brooklyn-jsgui/0.9.0-SNAPSHOT/brooklyn-jsgui-0.9.0-SNAPSHOT.pom
[JENKINS] Archiving <https://builds.apache.org/job/incubator-brooklyn-master-build/ws/utils/groovy/pom.xml>
to org.apache.brooklyn/brooklyn-utils-groovy/0.9.0-SNAPSHOT/brooklyn-utils-groovy-0.9.0-SNAPSHOT.pom
[JENKINS] Archiving <https://builds.apache.org/job/incubator-brooklyn-master-build/ws/utils/groovy/target/brooklyn-utils-groovy-0.9.0-SNAPSHOT.jar>
to org.apache.brooklyn/brooklyn-utils-groovy/0.9.0-SNAPSHOT/brooklyn-utils-groovy-0.9.0-SNAPSHOT.jar
[JENKINS] Archiving <https://builds.apache.org/job/incubator-brooklyn-master-build/ws/utils/groovy/target/brooklyn-utils-groovy-0.9.0-SNAPSHOT-tests.jar>
to org.apache.brooklyn/brooklyn-utils-groovy/0.9.0-SNAPSHOT/brooklyn-utils-groovy-0.9.0-SNAPSHOT-tests.jar
[JENKINS] Archiving <https://builds.apache.org/job/incubator-brooklyn-master-build/ws/utils/groovy/target/brooklyn-utils-groovy-0.9.0-SNAPSHOT-sources.jar>
to org.apache.brooklyn/brooklyn-utils-groovy/0.9.0-SNAPSHOT/brooklyn-utils-groovy-0.9.0-SNAPSHOT-sources.jar
[JENKINS] Archiving <https://builds.apache.org/job/incubator-brooklyn-master-build/ws/utils/common/pom.xml>
to org.apache.brooklyn/brooklyn-utils-common/0.9.0-SNAPSHOT/brooklyn-utils-common-0.9.0-SNAPSHOT.pom
[JENKINS] Archiving <https://builds.apache.org/job/incubator-brooklyn-master-build/ws/utils/common/target/brooklyn-utils-common-0.9.0-SNAPSHOT.jar>
to org.apache.brooklyn/brooklyn-utils-common/0.9.0-SNAPSHOT/brooklyn-utils-common-0.9.0-SNAPSHOT.jar
[JENKINS] Archiving <https://builds.apache.org/job/incubator-brooklyn-master-build/ws/utils/common/target/brooklyn-utils-common-0.9.0-SNAPSHOT-tests.jar>
to org.apache.brooklyn/brooklyn-utils-common/0.9.0-SNAPSHOT/brooklyn-utils-common-0.9.0-SNAPSHOT-tests.jar
[JENKINS] Archiving <https://builds.apache.org/job/incubator-brooklyn-master-build/ws/utils/common/target/brooklyn-utils-common-0.9.0-SNAPSHOT-sources.jar>
to org.apache.brooklyn/brooklyn-utils-common/0.9.0-SNAPSHOT/brooklyn-utils-common-0.9.0-SNAPSHOT-sources.jar
[JENKINS] Archiving <https://builds.apache.org/job/incubator-brooklyn-master-build/ws/locations/jclouds/pom.xml>
to org.apache.brooklyn/brooklyn-locations-jclouds/0.9.0-SNAPSHOT/brooklyn-locations-jclouds-0.9.0-SNAPSHOT.pom
[JENKINS] Archiving <https://builds.apache.org/job/incubator-brooklyn-master-build/ws/examples/simple-web-cluster/pom.xml>
to org.apache.brooklyn.example/brooklyn-example-simple-web-cluster/0.9.0-SNAPSHOT/brooklyn-example-simple-web-cluster-0.9.0-SNAPSHOT.pom
[JENKINS] Archiving <https://builds.apache.org/job/incubator-brooklyn-master-build/ws/usage/downstream-parent/pom.xml>
to org.apache.brooklyn/brooklyn-downstream-parent/0.9.0-SNAPSHOT/brooklyn-downstream-parent-0.9.0-SNAPSHOT.pom
[JENKINS] Archiving <https://builds.apache.org/job/incubator-brooklyn-master-build/ws/software/database/pom.xml>
to org.apache.brooklyn/brooklyn-software-database/0.9.0-SNAPSHOT/brooklyn-software-database-0.9.0-SNAPSHOT.pom
[JENKINS] Archiving <https://builds.apache.org/job/incubator-brooklyn-master-build/ws/usage/qa/pom.xml>
to org.apache.brooklyn/brooklyn-qa/0.9.0-SNAPSHOT/brooklyn-qa-0.9.0-SNAPSHOT.pom
[JENKINS] Archiving <https://builds.apache.org/job/incubator-brooklyn-master-build/ws/usage/rest-server/pom.xml>
to org.apache.brooklyn/brooklyn-rest-server/0.9.0-SNAPSHOT/brooklyn-rest-server-0.9.0-SNAPSHOT.pom
[JENKINS] Archiving <https://builds.apache.org/job/incubator-brooklyn-master-build/ws/usage/rest-client/pom.xml>
to org.apache.brooklyn/brooklyn-rest-client/0.9.0-SNAPSHOT/brooklyn-rest-client-0.9.0-SNAPSHOT.pom
[JENKINS] Archiving <https://builds.apache.org/job/incubator-brooklyn-master-build/ws/utils/jmx/jmxmp-ssl-agent/pom.xml>
to org.apache.brooklyn/brooklyn-jmxmp-agent/0.9.0-SNAPSHOT/brooklyn-jmxmp-agent-0.9.0-SNAPSHOT.pom
[JENKINS] Archiving <https://builds.apache.org/job/incubator-brooklyn-master-build/ws/karaf/apache-brooklyn/pom.xml>
to org.apache.brooklyn/apache-brooklyn/0.9.0-SNAPSHOT/apache-brooklyn-0.9.0-SNAPSHOT.pom
[JENKINS] Archiving <https://builds.apache.org/job/incubator-brooklyn-master-build/ws/utils/jmx/jmxrmi-agent/pom.xml>
to org.apache.brooklyn/brooklyn-jmxrmi-agent/0.9.0-SNAPSHOT/brooklyn-jmxrmi-agent-0.9.0-SNAPSHOT.pom
[JENKINS] Archiving <https://builds.apache.org/job/incubator-brooklyn-master-build/ws/usage/camp/pom.xml>
to org.apache.brooklyn/brooklyn-camp/0.9.0-SNAPSHOT/brooklyn-camp-0.9.0-SNAPSHOT.pom
[JENKINS] Archiving <https://builds.apache.org/job/incubator-brooklyn-master-build/ws/examples/global-web-fabric/pom.xml>
to org.apache.brooklyn.example/brooklyn-example-global-web-fabric/0.9.0-SNAPSHOT/brooklyn-example-global-web-fabric-0.9.0-SNAPSHOT.pom
[JENKINS] Archiving <https://builds.apache.org/job/incubator-brooklyn-master-build/ws/usage/archetypes/quickstart/pom.xml>
to org.apache.brooklyn/brooklyn-archetype-quickstart/0.9.0-SNAPSHOT/brooklyn-archetype-quickstart-0.9.0-SNAPSHOT.pom
[JENKINS] Archiving <https://builds.apache.org/job/incubator-brooklyn-master-build/ws/software/nosql/pom.xml>
to org.apache.brooklyn/brooklyn-software-nosql/0.9.0-SNAPSHOT/brooklyn-software-nosql-0.9.0-SNAPSHOT.pom
[JENKINS] Archiving <https://builds.apache.org/job/incubator-brooklyn-master-build/ws/software/base/pom.xml>
to org.apache.brooklyn/brooklyn-software-base/0.9.0-SNAPSHOT/brooklyn-software-base-0.9.0-SNAPSHOT.pom
[JENKINS] Archiving <https://builds.apache.org/job/incubator-brooklyn-master-build/ws/examples/webapps/hello-world-sql/pom.xml>
to org.apache.brooklyn.example/brooklyn-example-hello-world-sql-webapp/0.9.0-SNAPSHOT/brooklyn-example-hello-world-sql-webapp-0.9.0-SNAPSHOT.pom
[JENKINS] Archiving <https://builds.apache.org/job/incubator-brooklyn-master-build/ws/usage/logback-includes/pom.xml>
to org.apache.brooklyn/brooklyn-logback-includes/0.9.0-SNAPSHOT/brooklyn-logback-includes-0.9.0-SNAPSHOT.pom
[JENKINS] Archiving <https://builds.apache.org/job/incubator-brooklyn-master-build/ws/usage/logback-includes/target/brooklyn-logback-includes-0.9.0-SNAPSHOT.jar>
to org.apache.brooklyn/brooklyn-logback-includes/0.9.0-SNAPSHOT/brooklyn-logback-includes-0.9.0-SNAPSHOT.jar
[JENKINS] Archiving <https://builds.apache.org/job/incubator-brooklyn-master-build/ws/usage/logback-includes/target/brooklyn-logback-includes-0.9.0-SNAPSHOT-sources.jar>
to org.apache.brooklyn/brooklyn-logback-includes/0.9.0-SNAPSHOT/brooklyn-logback-includes-0.9.0-SNAPSHOT-sources.jar
[JENKINS] Archiving <https://builds.apache.org/job/incubator-brooklyn-master-build/ws/pom.xml>
to org.apache.brooklyn/brooklyn/0.9.0-SNAPSHOT/brooklyn-0.9.0-SNAPSHOT.pom
[JENKINS] Archiving <https://builds.apache.org/job/incubator-brooklyn-master-build/ws/utils/test-support/pom.xml>
to org.apache.brooklyn/brooklyn-utils-test-support/0.9.0-SNAPSHOT/brooklyn-utils-test-support-0.9.0-SNAPSHOT.pom
[JENKINS] Archiving <https://builds.apache.org/job/incubator-brooklyn-master-build/ws/utils/test-support/target/brooklyn-utils-test-support-0.9.0-SNAPSHOT.jar>
to org.apache.brooklyn/brooklyn-utils-test-support/0.9.0-SNAPSHOT/brooklyn-utils-test-support-0.9.0-SNAPSHOT.jar
[JENKINS] Archiving <https://builds.apache.org/job/incubator-brooklyn-master-build/ws/utils/test-support/target/brooklyn-utils-test-support-0.9.0-SNAPSHOT-sources.jar>
to org.apache.brooklyn/brooklyn-utils-test-support/0.9.0-SNAPSHOT/brooklyn-utils-test-support-0.9.0-SNAPSHOT-sources.jar
[JENKINS] Archiving <https://builds.apache.org/job/incubator-brooklyn-master-build/ws/software/monitoring/pom.xml>
to org.apache.brooklyn/brooklyn-software-monitoring/0.9.0-SNAPSHOT/brooklyn-software-monitoring-0.9.0-SNAPSHOT.pom
[JENKINS] Archiving <https://builds.apache.org/job/incubator-brooklyn-master-build/ws/storage/hazelcast/pom.xml>
to org.apache.brooklyn/brooklyn-storage-hazelcast/0.9.0-SNAPSHOT/brooklyn-storage-hazelcast-0.9.0-SNAPSHOT.pom
[JENKINS] Archiving <https://builds.apache.org/job/incubator-brooklyn-master-build/ws/usage/test-framework/pom.xml>
to org.apache.brooklyn/brooklyn-test-framework/0.9.0-SNAPSHOT/brooklyn-test-framework-0.9.0-SNAPSHOT.pom
[JENKINS] Archiving <https://builds.apache.org/job/incubator-brooklyn-master-build/ws/karaf/commands/pom.xml>
to org.apache.brooklyn/brooklyn-commands/0.9.0-SNAPSHOT/brooklyn-commands-0.9.0-SNAPSHOT.pom
[JENKINS] Archiving <https://builds.apache.org/job/incubator-brooklyn-master-build/ws/software/messaging/pom.xml>
to org.apache.brooklyn/brooklyn-software-messaging/0.9.0-SNAPSHOT/brooklyn-software-messaging-0.9.0-SNAPSHOT.pom
[JENKINS] Archiving <https://builds.apache.org/job/incubator-brooklyn-master-build/ws/usage/rest-api/pom.xml>
to org.apache.brooklyn/brooklyn-rest-api/0.9.0-SNAPSHOT/brooklyn-rest-api-0.9.0-SNAPSHOT.pom
[JENKINS] Archiving <https://builds.apache.org/job/incubator-brooklyn-master-build/ws/utils/rt-osgi/pom.xml>
to org.apache.brooklyn/brooklyn-rt-osgi/0.9.0-SNAPSHOT/brooklyn-rt-osgi-0.9.0-SNAPSHOT.pom
[JENKINS] Archiving <https://builds.apache.org/job/incubator-brooklyn-master-build/ws/utils/rt-osgi/target/brooklyn-rt-osgi-0.9.0-SNAPSHOT.jar>
to org.apache.brooklyn/brooklyn-rt-osgi/0.9.0-SNAPSHOT/brooklyn-rt-osgi-0.9.0-SNAPSHOT.jar
[JENKINS] Archiving <https://builds.apache.org/job/incubator-brooklyn-master-build/ws/utils/rt-osgi/target/brooklyn-rt-osgi-0.9.0-SNAPSHOT-tests.jar>
to org.apache.brooklyn/brooklyn-rt-osgi/0.9.0-SNAPSHOT/brooklyn-rt-osgi-0.9.0-SNAPSHOT-tests.jar
[JENKINS] Archiving <https://builds.apache.org/job/incubator-brooklyn-master-build/ws/utils/rt-osgi/target/brooklyn-rt-osgi-0.9.0-SNAPSHOT-sources.jar>
to org.apache.brooklyn/brooklyn-rt-osgi/0.9.0-SNAPSHOT/brooklyn-rt-osgi-0.9.0-SNAPSHOT-sources.jar
[JENKINS] Archiving <https://builds.apache.org/job/incubator-brooklyn-master-build/ws/examples/simple-nosql-cluster/pom.xml>
to org.apache.brooklyn.example/brooklyn-example-simple-nosql-cluster/0.9.0-SNAPSHOT/brooklyn-example-simple-nosql-cluster-0.9.0-SNAPSHOT.pom
[JENKINS] Archiving <https://builds.apache.org/job/incubator-brooklyn-master-build/ws/examples/webapps/pom.xml>
to org.apache.brooklyn.example/brooklyn-examples-webapps-parent/0.9.0-SNAPSHOT/brooklyn-examples-webapps-parent-0.9.0-SNAPSHOT.pom
[JENKINS] Archiving <https://builds.apache.org/job/incubator-brooklyn-master-build/ws/usage/logback-xml/pom.xml>
to org.apache.brooklyn/brooklyn-logback-xml/0.9.0-SNAPSHOT/brooklyn-logback-xml-0.9.0-SNAPSHOT.pom
[JENKINS] Archiving <https://builds.apache.org/job/incubator-brooklyn-master-build/ws/usage/logback-xml/target/brooklyn-logback-xml-0.9.0-SNAPSHOT.jar>
to org.apache.brooklyn/brooklyn-logback-xml/0.9.0-SNAPSHOT/brooklyn-logback-xml-0.9.0-SNAPSHOT.jar
[JENKINS] Archiving <https://builds.apache.org/job/incubator-brooklyn-master-build/ws/usage/logback-xml/target/brooklyn-logback-xml-0.9.0-SNAPSHOT-sources.jar>
to org.apache.brooklyn/brooklyn-logback-xml/0.9.0-SNAPSHOT/brooklyn-logback-xml-0.9.0-SNAPSHOT-sources.jar
[JENKINS] Archiving <https://builds.apache.org/job/incubator-brooklyn-master-build/ws/karaf/features/pom.xml>
to org.apache.brooklyn/brooklyn-features/0.9.0-SNAPSHOT/brooklyn-features-0.9.0-SNAPSHOT.pom
[JENKINS] Archiving <https://builds.apache.org/job/incubator-brooklyn-master-build/ws/camp/camp-server/pom.xml>
to org.apache.brooklyn.camp/camp-server/0.9.0-SNAPSHOT/camp-server-0.9.0-SNAPSHOT.pom
[JENKINS] Archiving <https://builds.apache.org/job/incubator-brooklyn-master-build/ws/camp/camp-server/target/camp-server-0.9.0-SNAPSHOT.jar>
to org.apache.brooklyn.camp/camp-server/0.9.0-SNAPSHOT/camp-server-0.9.0-SNAPSHOT.jar
[JENKINS] Archiving <https://builds.apache.org/job/incubator-brooklyn-master-build/ws/camp/camp-server/target/camp-server-0.9.0-SNAPSHOT-tests.jar>
to org.apache.brooklyn.camp/camp-server/0.9.0-SNAPSHOT/camp-server-0.9.0-SNAPSHOT-tests.jar
[JENKINS] Archiving <https://builds.apache.org/job/incubator-brooklyn-master-build/ws/camp/camp-server/target/camp-server-0.9.0-SNAPSHOT-sources.jar>
to org.apache.brooklyn.camp/camp-server/0.9.0-SNAPSHOT/camp-server-0.9.0-SNAPSHOT-sources.jar
[JENKINS] Archiving <https://builds.apache.org/job/incubator-brooklyn-master-build/ws/examples/pom.xml>
to org.apache.brooklyn.example/brooklyn-examples-parent/0.9.0-SNAPSHOT/brooklyn-examples-parent-0.9.0-SNAPSHOT.pom
[JENKINS] Archiving <https://builds.apache.org/job/incubator-brooklyn-master-build/ws/software/webapp/pom.xml>
to org.apache.brooklyn/brooklyn-software-webapp/0.9.0-SNAPSHOT/brooklyn-software-webapp-0.9.0-SNAPSHOT.pom
[JENKINS] Archiving <https://builds.apache.org/job/incubator-brooklyn-master-build/ws/usage/test-support/pom.xml>
to org.apache.brooklyn/brooklyn-test-support/0.9.0-SNAPSHOT/brooklyn-test-support-0.9.0-SNAPSHOT.pom
[JENKINS] Archiving <https://builds.apache.org/job/incubator-brooklyn-master-build/ws/usage/test-support/target/brooklyn-test-support-0.9.0-SNAPSHOT.jar>
to org.apache.brooklyn/brooklyn-test-support/0.9.0-SNAPSHOT/brooklyn-test-support-0.9.0-SNAPSHOT.jar
[JENKINS] Archiving <https://builds.apache.org/job/incubator-brooklyn-master-build/ws/usage/test-support/target/brooklyn-test-support-0.9.0-SNAPSHOT-sources.jar>
to org.apache.brooklyn/brooklyn-test-support/0.9.0-SNAPSHOT/brooklyn-test-support-0.9.0-SNAPSHOT-sources.jar
[JENKINS] Archiving <https://builds.apache.org/job/incubator-brooklyn-master-build/ws/karaf/pom.xml>
to org.apache.brooklyn/brooklyn-karaf/0.9.0-SNAPSHOT/brooklyn-karaf-0.9.0-SNAPSHOT.pom
[JENKINS] Archiving <https://builds.apache.org/job/incubator-brooklyn-master-build/ws/utils/rt-felix/pom.xml>
to org.apache.brooklyn/brooklyn-rt-felix/0.9.0-SNAPSHOT/brooklyn-rt-felix-0.9.0-SNAPSHOT.pom
[JENKINS] Archiving <https://builds.apache.org/job/incubator-brooklyn-master-build/ws/utils/rt-felix/target/brooklyn-rt-felix-0.9.0-SNAPSHOT.jar>
to org.apache.brooklyn/brooklyn-rt-felix/0.9.0-SNAPSHOT/brooklyn-rt-felix-0.9.0-SNAPSHOT.jar
[JENKINS] Archiving <https://builds.apache.org/job/incubator-brooklyn-master-build/ws/utils/rt-felix/target/brooklyn-rt-felix-0.9.0-SNAPSHOT-tests.jar>
to org.apache.brooklyn/brooklyn-rt-felix/0.9.0-SNAPSHOT/brooklyn-rt-felix-0.9.0-SNAPSHOT-tests.jar
[JENKINS] Archiving <https://builds.apache.org/job/incubator-brooklyn-master-build/ws/utils/rt-felix/target/brooklyn-rt-felix-0.9.0-SNAPSHOT-sources.jar>
to org.apache.brooklyn/brooklyn-rt-felix/0.9.0-SNAPSHOT/brooklyn-rt-felix-0.9.0-SNAPSHOT-sources.jar
[JENKINS] Archiving <https://builds.apache.org/job/incubator-brooklyn-master-build/ws/software/winrm/pom.xml>
to org.apache.brooklyn/brooklyn-software-winrm/0.9.0-SNAPSHOT/brooklyn-software-winrm-0.9.0-SNAPSHOT.pom
[JENKINS] Archiving <https://builds.apache.org/job/incubator-brooklyn-master-build/ws/camp/camp-base/pom.xml>
to org.apache.brooklyn.camp/camp-base/0.9.0-SNAPSHOT/camp-base-0.9.0-SNAPSHOT.pom
[JENKINS] Archiving <https://builds.apache.org/job/incubator-brooklyn-master-build/ws/camp/camp-base/target/camp-base-0.9.0-SNAPSHOT.jar>
to org.apache.brooklyn.camp/camp-base/0.9.0-SNAPSHOT/camp-base-0.9.0-SNAPSHOT.jar
[JENKINS] Archiving <https://builds.apache.org/job/incubator-brooklyn-master-build/ws/camp/camp-base/target/camp-base-0.9.0-SNAPSHOT-tests.jar>
to org.apache.brooklyn.camp/camp-base/0.9.0-SNAPSHOT/camp-base-0.9.0-SNAPSHOT-tests.jar
[JENKINS] Archiving <https://builds.apache.org/job/incubator-brooklyn-master-build/ws/camp/camp-base/target/camp-base-0.9.0-SNAPSHOT-sources.jar>
to org.apache.brooklyn.camp/camp-base/0.9.0-SNAPSHOT/camp-base-0.9.0-SNAPSHOT-sources.jar
[JENKINS] Archiving <https://builds.apache.org/job/incubator-brooklyn-master-build/ws/software/network/pom.xml>
to org.apache.brooklyn/brooklyn-software-network/0.9.0-SNAPSHOT/brooklyn-software-network-0.9.0-SNAPSHOT.pom
[JENKINS] Archiving <https://builds.apache.org/job/incubator-brooklyn-master-build/ws/usage/dist/pom.xml>
to org.apache.brooklyn/brooklyn-dist/0.9.0-SNAPSHOT/brooklyn-dist-0.9.0-SNAPSHOT.pom
[JENKINS] Archiving <https://builds.apache.org/job/incubator-brooklyn-master-build/ws/parent/pom.xml>
to org.apache.brooklyn/brooklyn-parent/0.9.0-SNAPSHOT/brooklyn-parent-0.9.0-SNAPSHOT.pom
Compressed 81.58 KB of artifacts by 78.4% relative to #653
[JENKINS] Archiving <https://builds.apache.org/job/incubator-brooklyn-master-build/ws/usage/cli/pom.xml>
to org.apache.brooklyn/brooklyn-cli/0.9.0-SNAPSHOT/brooklyn-cli-0.9.0-SNAPSHOT.pom
[JENKINS] Archiving <https://builds.apache.org/job/incubator-brooklyn-master-build/ws/usage/launcher/pom.xml>
to org.apache.brooklyn/brooklyn-launcher/0.9.0-SNAPSHOT/brooklyn-launcher-0.9.0-SNAPSHOT.pom
[JENKINS] Archiving <https://builds.apache.org/job/incubator-brooklyn-master-build/ws/utils/rest-swagger/pom.xml>
to org.apache.brooklyn/brooklyn-utils-rest-swagger/0.9.0-SNAPSHOT/brooklyn-utils-rest-swagger-0.9.0-SNAPSHOT.pom
[JENKINS] Archiving <https://builds.apache.org/job/incubator-brooklyn-master-build/ws/utils/rest-swagger/target/brooklyn-utils-rest-swagger-0.9.0-SNAPSHOT.jar>
to org.apache.brooklyn/brooklyn-utils-rest-swagger/0.9.0-SNAPSHOT/brooklyn-utils-rest-swagger-0.9.0-SNAPSHOT.jar
[JENKINS] Archiving <https://builds.apache.org/job/incubator-brooklyn-master-build/ws/utils/rest-swagger/target/brooklyn-utils-rest-swagger-0.9.0-SNAPSHOT-sources.jar>
to org.apache.brooklyn/brooklyn-utils-rest-swagger/0.9.0-SNAPSHOT/brooklyn-utils-rest-swagger-0.9.0-SNAPSHOT-sources.jar
[JENKINS] Archiving <https://builds.apache.org/job/incubator-brooklyn-master-build/ws/camp/pom.xml>
to org.apache.brooklyn.camp/camp-parent/0.9.0-SNAPSHOT/camp-parent-0.9.0-SNAPSHOT.pom
[JENKINS] Archiving <https://builds.apache.org/job/incubator-brooklyn-master-build/ws/api/pom.xml>
to org.apache.brooklyn/brooklyn-api/0.9.0-SNAPSHOT/brooklyn-api-0.9.0-SNAPSHOT.pom
[JENKINS] Archiving <https://builds.apache.org/job/incubator-brooklyn-master-build/ws/api/target/brooklyn-api-0.9.0-SNAPSHOT.jar>
to org.apache.brooklyn/brooklyn-api/0.9.0-SNAPSHOT/brooklyn-api-0.9.0-SNAPSHOT.jar
[JENKINS] Archiving <https://builds.apache.org/job/incubator-brooklyn-master-build/ws/api/target/brooklyn-api-0.9.0-SNAPSHOT-sources.jar>
to org.apache.brooklyn/brooklyn-api/0.9.0-SNAPSHOT/brooklyn-api-0.9.0-SNAPSHOT-sources.jar
[JENKINS] Archiving <https://builds.apache.org/job/incubator-brooklyn-master-build/ws/usage/all/pom.xml>
to org.apache.brooklyn/brooklyn-all/0.9.0-SNAPSHOT/brooklyn-all-0.9.0-SNAPSHOT.pom
channel stopped

Mime
View raw message