brooklyn-dev mailing list archives

Site index · List index
Message view « Date » · « Thread »
Top « Date » · « Thread »
From Apache Jenkins Server <jenk...@builds.apache.org>
Subject Build failed in Jenkins: incubator-brooklyn-master-build #627
Date Thu, 05 Nov 2015 13:59:00 GMT
See <https://builds.apache.org/job/incubator-brooklyn-master-build/627/changes>

Changes:

[sam.corbett] Update Tomcat 7 download version

------------------------------------------
[...truncated 1591 lines...]
2015-11-05 13:53:46,078 INFO  TESTNG PASSED: "Surefire test" - org.apache.brooklyn.util.net.CidrTest.test_0_0_0_0_32_Bytes()
finished in 0 ms
2015-11-05 13:53:46,078 INFO  TESTNG INVOKING: "Surefire test" - org.apache.brooklyn.util.net.CidrTest.test_0_0_0_0_32_String()
2015-11-05 13:53:46,078 INFO  TESTNG PASSED: "Surefire test" - org.apache.brooklyn.util.net.CidrTest.test_0_0_0_0_32_String()
finished in 0 ms
2015-11-05 13:53:46,079 INFO  TESTNG INVOKING: "Surefire test" - org.apache.brooklyn.util.net.CidrTest.test_0_0_0_0_Bytes()
2015-11-05 13:53:46,079 INFO  TESTNG PASSED: "Surefire test" - org.apache.brooklyn.util.net.CidrTest.test_0_0_0_0_Bytes()
finished in 0 ms
2015-11-05 13:53:46,079 INFO  TESTNG INVOKING: "Surefire test" - org.apache.brooklyn.util.net.CidrTest.test_0_0_0_0_String()
2015-11-05 13:53:46,079 INFO  TESTNG PASSED: "Surefire test" - org.apache.brooklyn.util.net.CidrTest.test_0_0_0_0_String()
finished in 0 ms
2015-11-05 13:53:46,079 INFO  TESTNG INVOKING: "Surefire test" - org.apache.brooklyn.util.net.CidrTest.test_10_0_0_0_6_LessTwoBitsOneIsSignificant()
2015-11-05 13:53:46,080 INFO  TESTNG PASSED: "Surefire test" - org.apache.brooklyn.util.net.CidrTest.test_10_0_0_0_6_LessTwoBitsOneIsSignificant()
finished in 1 ms
2015-11-05 13:53:46,080 INFO  TESTNG INVOKING: "Surefire test" - org.apache.brooklyn.util.net.CidrTest.test_10_0_0_0_7_LessABit()
2015-11-05 13:53:46,080 INFO  TESTNG PASSED: "Surefire test" - org.apache.brooklyn.util.net.CidrTest.test_10_0_0_0_7_LessABit()
finished in 0 ms
2015-11-05 13:53:46,081 INFO  TESTNG INVOKING: "Surefire test" - org.apache.brooklyn.util.net.CidrTest.test_10_0_0_0_Byte()
2015-11-05 13:53:46,081 INFO  TESTNG PASSED: "Surefire test" - org.apache.brooklyn.util.net.CidrTest.test_10_0_0_0_Byte()
finished in 0 ms
2015-11-05 13:53:46,081 INFO  TESTNG INVOKING: "Surefire test" - org.apache.brooklyn.util.net.CidrTest.test_10_0_0_0_ExtraBytes()
2015-11-05 13:53:46,081 INFO  TESTNG PASSED: "Surefire test" - org.apache.brooklyn.util.net.CidrTest.test_10_0_0_0_ExtraBytes()
finished in 0 ms
2015-11-05 13:53:46,082 INFO  TESTNG INVOKING: "Surefire test" - org.apache.brooklyn.util.net.CidrTest.test_10_0_0_0_String()
2015-11-05 13:53:46,082 INFO  TESTNG PASSED: "Surefire test" - org.apache.brooklyn.util.net.CidrTest.test_10_0_0_0_String()
finished in 1 ms
2015-11-05 13:53:46,082 INFO  TESTNG INVOKING: "Surefire test" - org.apache.brooklyn.util.net.CidrTest.test_10_0_blah_6()
2015-11-05 13:53:46,082 INFO  TESTNG PASSED: "Surefire test" - org.apache.brooklyn.util.net.CidrTest.test_10_0_blah_6()
finished in 0 ms
2015-11-05 13:53:46,083 INFO  TESTNG INVOKING: "Surefire test" - org.apache.brooklyn.util.net.UrlsTest.testDataUrl()
2015-11-05 13:53:46,118 INFO  TESTNG PASSED: "Surefire test" - org.apache.brooklyn.util.net.UrlsTest.testDataUrl()
finished in 35 ms
2015-11-05 13:53:46,119 INFO  TESTNG INVOKING: "Surefire test" - org.apache.brooklyn.util.net.UrlsTest.testGetBasename()
2015-11-05 13:53:46,119 INFO  TESTNG PASSED: "Surefire test" - org.apache.brooklyn.util.net.UrlsTest.testGetBasename()
finished in 0 ms
2015-11-05 13:53:46,119 INFO  TESTNG INVOKING: "Surefire test" - org.apache.brooklyn.util.net.UrlsTest.testIsUrlWithProtocol()
2015-11-05 13:53:46,120 INFO  TESTNG PASSED: "Surefire test" - org.apache.brooklyn.util.net.UrlsTest.testIsUrlWithProtocol()
finished in 1 ms
2015-11-05 13:53:46,120 INFO  TESTNG INVOKING: "Surefire test" - org.apache.brooklyn.util.net.UrlsTest.testMergePaths()
2015-11-05 13:53:46,120 INFO  TESTNG PASSED: "Surefire test" - org.apache.brooklyn.util.net.UrlsTest.testMergePaths()
finished in 0 ms
2015-11-05 13:53:46,120 INFO  TESTNG INVOKING: "Surefire test" - org.apache.brooklyn.util.net.UrlsTest.testMergePathsNPEsOnNulls()
2015-11-05 13:53:46,121 INFO  TESTNG PASSED: "Surefire test" - org.apache.brooklyn.util.net.UrlsTest.testMergePathsNPEsOnNulls()
finished in 1 ms
2015-11-05 13:53:46,121 INFO  TESTNG INVOKING: "Surefire test" - org.apache.brooklyn.util.net.UrlsTest.testPathEncode()
2015-11-05 13:53:46,121 INFO  TESTNG PASSED: "Surefire test" - org.apache.brooklyn.util.net.UrlsTest.testPathEncode()
finished in 0 ms
2015-11-05 13:53:46,121 INFO  TESTNG INVOKING: "Surefire test" - org.apache.brooklyn.util.net.UrlsTest.testUrlToUriToStringAndBack()
2015-11-05 13:53:46,122 INFO  TESTNG PASSED: "Surefire test" - org.apache.brooklyn.util.net.UrlsTest.testUrlToUriToStringAndBack()
finished in 1 ms
2015-11-05 13:53:46,122 INFO  TESTNG INVOKING: "Surefire test" - org.apache.brooklyn.util.net.UserAndHostAndPortTest.testFromParts()
2015-11-05 13:53:46,123 INFO  TESTNG PASSED: "Surefire test" - org.apache.brooklyn.util.net.UserAndHostAndPortTest.testFromParts()
finished in 1 ms
2015-11-05 13:53:46,124 INFO  TESTNG INVOKING: "Surefire test" - org.apache.brooklyn.util.net.UserAndHostAndPortTest.testFromString()
2015-11-05 13:53:46,124 INFO  TESTNG PASSED: "Surefire test" - org.apache.brooklyn.util.net.UserAndHostAndPortTest.testFromString()
finished in 0 ms
2015-11-05 13:53:46,124 INFO  TESTNG INVOKING: "Surefire test" - org.apache.brooklyn.util.net.NetworkingUtilsTest.test10_x_x_xSubnetPrivate()
2015-11-05 13:53:46,125 INFO  TESTNG PASSED: "Surefire test" - org.apache.brooklyn.util.net.NetworkingUtilsTest.test10_x_x_xSubnetPrivate()
finished in 0 ms
2015-11-05 13:53:46,125 INFO  TESTNG INVOKING: "Surefire test" - org.apache.brooklyn.util.net.NetworkingUtilsTest.test172_16_x_xSubnetPrivate()
2015-11-05 13:53:46,125 INFO  TESTNG PASSED: "Surefire test" - org.apache.brooklyn.util.net.NetworkingUtilsTest.test172_16_x_xSubnetPrivate()
finished in 0 ms
2015-11-05 13:53:46,125 INFO  TESTNG INVOKING: "Surefire test" - org.apache.brooklyn.util.net.NetworkingUtilsTest.testGetInetAddressWithFixedNameByIp()
2015-11-05 13:53:46,126 INFO  TESTNG PASSED: "Surefire test" - org.apache.brooklyn.util.net.NetworkingUtilsTest.testGetInetAddressWithFixedNameByIp()
finished in 1 ms
2015-11-05 13:53:46,126 INFO  TESTNG INVOKING: "Surefire test" - org.apache.brooklyn.util.net.NetworkingUtilsTest.testGetInetAddressWithFixedNameByIpBytes()
2015-11-05 13:53:46,126 INFO  TESTNG PASSED: "Surefire test" - org.apache.brooklyn.util.net.NetworkingUtilsTest.testGetInetAddressWithFixedNameByIpBytes()
finished in 0 ms
2015-11-05 13:53:46,127 INFO  TESTNG INVOKING: "Surefire test" - org.apache.brooklyn.util.net.NetworkingUtilsTest.testIsPortAvailableReportsFalseWhenPortIsInUse()
2015-11-05 13:53:46,128 INFO  acquired port on 58768 for test NetworkingUtilsTest.testIsPortAvailableReportsFalseWhenPortIsInUse
2015-11-05 13:53:46,129 INFO  TESTNG PASSED: "Surefire test" - org.apache.brooklyn.util.net.NetworkingUtilsTest.testIsPortAvailableReportsFalseWhenPortIsInUse()
finished in 2 ms
2015-11-05 13:53:46,130 INFO  TESTNG INVOKING: "Surefire test" - org.apache.brooklyn.util.net.NetworkingUtilsTest.testIsPortAvailableReportsPromptly()
2015-11-05 13:53:46,131 INFO  TESTNG PASSED: "Surefire test" - org.apache.brooklyn.util.net.NetworkingUtilsTest.testIsPortAvailableReportsPromptly()
finished in 1 ms
2015-11-05 13:53:46,131 INFO  TESTNG INVOKING: "Surefire test" - org.apache.brooklyn.util.net.NetworkingUtilsTest.testIsPortAvailableReportsTrueWhenPortIsFree()
2015-11-05 13:53:46,140 INFO  TESTNG PASSED: "Surefire test" - org.apache.brooklyn.util.net.NetworkingUtilsTest.testIsPortAvailableReportsTrueWhenPortIsFree()
finished in 9 ms
2015-11-05 13:53:46,140 INFO  TESTNG INVOKING: "Surefire test" - org.apache.brooklyn.util.net.NetworkingUtilsTest.testIsPortAvailableValidatesAddress()
2015-11-05 13:53:46,141 INFO  TESTNG PASSED: "Surefire test" - org.apache.brooklyn.util.net.NetworkingUtilsTest.testIsPortAvailableValidatesAddress()
finished in 1 ms
2015-11-05 13:53:46,141 INFO  TESTNG INVOKING: "Surefire test" - org.apache.brooklyn.util.net.NetworkingUtilsTest.testLocalhostIpLookup()
2015-11-05 13:53:46,141 INFO  TESTNG PASSED: "Surefire test" - org.apache.brooklyn.util.net.NetworkingUtilsTest.testLocalhostIpLookup()
finished in 0 ms
2015-11-05 13:53:46,141 INFO  TESTNG INVOKING: "Surefire test" - org.apache.brooklyn.util.net.NetworkingUtilsTest.testLocalhostLookup()
2015-11-05 13:53:46,142 INFO  TESTNG PASSED: "Surefire test" - org.apache.brooklyn.util.net.NetworkingUtilsTest.testLocalhostLookup()
finished in 1 ms
2015-11-05 13:53:46,142 INFO  TESTNG INVOKING: "Surefire test" - org.apache.brooklyn.util.net.NetworkingUtilsTest.testValidIp()
2015-11-05 13:53:46,142 INFO  TESTNG PASSED: "Surefire test" - org.apache.brooklyn.util.net.NetworkingUtilsTest.testValidIp()
finished in 0 ms
2015-11-05 13:53:46,241 INFO  TESTNG 
===============================================
    Surefire test
    Tests run: 408, Failures: 1, Skips: 0
===============================================
2015-11-05 13:53:46,241 INFO  BrooklynLeakListener.onFinish attempting to terminate all extant
ManagementContexts: name=Surefire test; includedGroups=[]; excludedGroups=[Integration, Acceptance,
Live, WIP]; suiteName=Surefire suite; outDir=<https://builds.apache.org/job/incubator-brooklyn-master-build/ws/utils/common/target/surefire-reports/Surefire>
suite: no org.apache.brooklyn.core.management.internal.LocalManagementContext available, so
skipped
SUREFIRE-859: [GC 206665K->9173K(753664K), 0.0135480 secs]
Tests run: 408, Failures: 1, Errors: 0, Skipped: 0, Time elapsed: 169.018 sec <<<
FAILURE! - in TestSuite
shouldAssertContentEventuallyContainsText(org.apache.brooklyn.util.HttpAssertsTest)  Time
elapsed: 32.021 sec  <<< FAILURE!
java.lang.AssertionError: Assertion failed
	at java.net.PlainSocketImpl.socketConnect(Native Method)
	at java.net.AbstractPlainSocketImpl.doConnect(AbstractPlainSocketImpl.java:339)
	at java.net.AbstractPlainSocketImpl.connectToAddress(AbstractPlainSocketImpl.java:200)
	at java.net.AbstractPlainSocketImpl.connect(AbstractPlainSocketImpl.java:182)
	at java.net.SocksSocketImpl.connect(SocksSocketImpl.java:392)
	at java.net.Socket.connect(Socket.java:579)
	at java.net.Socket.connect(Socket.java:528)
	at sun.net.NetworkClient.doConnect(NetworkClient.java:180)
	at sun.net.www.http.HttpClient.openServer(HttpClient.java:432)
	at sun.net.www.http.HttpClient.openServer(HttpClient.java:527)
	at sun.net.www.http.HttpClient.<init>(HttpClient.java:211)
	at sun.net.www.http.HttpClient.New(HttpClient.java:308)
	at sun.net.www.http.HttpClient.New(HttpClient.java:326)
	at sun.net.www.protocol.http.HttpURLConnection.getNewHttpClient(HttpURLConnection.java:997)
	at sun.net.www.protocol.http.HttpURLConnection.plainConnect(HttpURLConnection.java:933)
	at sun.net.www.protocol.http.HttpURLConnection.connect(HttpURLConnection.java:851)
	at sun.net.www.protocol.http.HttpURLConnection.getInputStream(HttpURLConnection.java:1301)
	at org.apache.brooklyn.util.http.HttpTool.getContent(HttpTool.java:172)
	at org.apache.brooklyn.util.http.HttpAsserts.assertContentContainsText(HttpAsserts.java:179)
	at org.apache.brooklyn.util.http.HttpAsserts$3.run(HttpAsserts.java:250)
	at org.apache.brooklyn.test.Asserts$RunnableAdapter.call(Asserts.java:1078)
	at org.apache.brooklyn.test.Asserts.succeedsEventually(Asserts.java:869)
	at org.apache.brooklyn.test.Asserts.succeedsEventually(Asserts.java:796)
	at org.apache.brooklyn.util.http.HttpAsserts.assertEventually(HttpAsserts.java:257)
	at org.apache.brooklyn.util.http.HttpAsserts.assertContentEventuallyContainsText(HttpAsserts.java:248)
	at org.apache.brooklyn.util.http.HttpAsserts.assertContentEventuallyContainsText(HttpAsserts.java:244)
	at org.apache.brooklyn.util.HttpAssertsTest.shouldAssertContentEventuallyContainsText(HttpAssertsTest.java:214)


Results :

Failed tests: 
  HttpAssertsTest.shouldAssertContentEventuallyContainsText:214 Assertion failed

Tests run: 408, Failures: 1, Errors: 0, Skipped: 0

[JENKINS] Recording test results
log4j:WARN No appenders could be found for logger (org.apache.commons.beanutils.converters.BooleanConverter).
log4j:WARN Please initialize the log4j system properly.
[INFO] ------------------------------------------------------------------------
[INFO] Reactor Summary:
[INFO] 
[INFO] Brooklyn Root ..................................... SUCCESS [1.869s]
[INFO] Brooklyn Parent Project ........................... SUCCESS [2.585s]
[INFO] Brooklyn Logback Configuration .................... SUCCESS [3.789s]
[INFO] Brooklyn Test Support Utilities ................... SUCCESS [3.187s]
[INFO] Brooklyn Logback Includable Configuration ......... SUCCESS [1.916s]
[INFO] Brooklyn Common Utilities ......................... FAILURE [3:03.515s]
[INFO] Brooklyn API ...................................... SKIPPED
[INFO] Brooklyn Test Support ............................. SKIPPED
[INFO] Brooklyn Downstream Project Parent ................ SKIPPED
[INFO] CAMP Server Parent Project ........................ SKIPPED
[INFO] CAMP Base ......................................... SKIPPED
[INFO] Brooklyn REST Swagger Apidoc Utilities ............ SKIPPED
[INFO] CAMP Server ....................................... SKIPPED
[INFO] Brooklyn OSGi Utils ............................... SKIPPED
[INFO] Brooklyn Felix Runtime ............................ SKIPPED
[INFO] Brooklyn Groovy Utilities ......................... SKIPPED
[INFO] Brooklyn Core ..................................... SKIPPED
[INFO] Brooklyn Examples Aggregator Project .............. SKIPPED
[INFO] Brooklyn Examples Aggregator Project - Webapps .... SKIPPED
[INFO] hello-world-webapp Maven Webapp ................... SKIPPED
[INFO] hello-world-sql-webapp Maven Webapp ............... SKIPPED
[INFO] Brooklyn Policies ................................. SKIPPED
[INFO] Brooklyn WinRM Software Entities .................. SKIPPED
[INFO] Brooklyn Jclouds Location Targets ................. SKIPPED
[INFO] Brooklyn Secure JMXMP Agent ....................... SKIPPED
[INFO] Brooklyn JMX RMI Agent ............................ SKIPPED
[INFO] Brooklyn Software Base ............................ SKIPPED
[INFO] Brooklyn Web App Software Entities ................ SKIPPED
[INFO] Brooklyn Messaging Software Entities .............. SKIPPED
[INFO] Brooklyn Database Software Entities ............... SKIPPED
[INFO] Brooklyn Monitoring Software Entities ............. SKIPPED
[INFO] Brooklyn OSGi Software Entities ................... SKIPPED
[INFO] Brooklyn NoSQL Data Store Software Entities ....... SKIPPED
[INFO] Brooklyn Network Software Entities ................ SKIPPED
[INFO] Brooklyn REST API ................................. SKIPPED
[INFO] Brooklyn CAMP REST API ............................ SKIPPED
[INFO] Brooklyn REST Server .............................. SKIPPED
[INFO] Brooklyn REST JavaScript Web GUI .................. SKIPPED
[INFO] Brooklyn Launcher ................................. SKIPPED
[INFO] Brooklyn Command Line Interface ................... SKIPPED
[INFO] Brooklyn All Things ............................... SKIPPED
[INFO] Brooklyn Simple Web Cluster Example ............... SKIPPED
[INFO] Brooklyn Global Web Fabric Example ................ SKIPPED
[INFO] Brooklyn Simple Messaging Publish-Subscribe Example  SKIPPED
[INFO] Brooklyn NoSQL Cluster Examples ................... SKIPPED
[INFO] Brooklyn Karaf .................................... SKIPPED
[INFO] Brooklyn Karaf Features ........................... SKIPPED
[INFO] Brooklyn Karaf Distro ............................. SKIPPED
[INFO] Brooklyn Karaf Shell Commands ..................... SKIPPED
[INFO] Brooklyn Hazelcast Storage ........................ SKIPPED
[INFO] Brooklyn Quick-Start Project Archetype ............ SKIPPED
[INFO] Brooklyn Distribution ............................. SKIPPED
[INFO] Brooklyn QA ....................................... SKIPPED
[INFO] Brooklyn REST Client .............................. SKIPPED
[INFO] ------------------------------------------------------------------------
[INFO] BUILD FAILURE
[INFO] ------------------------------------------------------------------------
[INFO] Total time: 3:23.786s
[INFO] Finished at: Thu Nov 05 13:53:54 UTC 2015
[INFO] Final Memory: 53M/242M
[INFO] ------------------------------------------------------------------------
Waiting for Jenkins to finish collecting data[ERROR] Failed to execute goal org.apache.maven.plugins:maven-surefire-plugin:2.18.1:test
(default-test) on project brooklyn-utils-common: There are test failures.
[ERROR] 
[ERROR] Please refer to <https://builds.apache.org/job/incubator-brooklyn-master-build/ws/utils/common/target/surefire-reports>
for the individual test results.
[ERROR] -> [Help 1]
[ERROR] 
[ERROR] To see the full stack trace of the errors, re-run Maven with the -e switch.
[ERROR] Re-run Maven using the -X switch to enable full debug logging.
[ERROR] 
[ERROR] For more information about the errors and possible solutions, please read the following
articles:
[ERROR] [Help 1] http://cwiki.apache.org/confluence/display/MAVEN/MojoFailureException
[ERROR] 
[ERROR] After correcting the problems, you can resume the build with the command
[ERROR]   mvn <goals> -rf :brooklyn-utils-common

[JENKINS] Archiving <https://builds.apache.org/job/incubator-brooklyn-master-build/ws/policy/pom.xml>
to org.apache.brooklyn/brooklyn-policy/0.9.0-SNAPSHOT/brooklyn-policy-0.9.0-SNAPSHOT.pom
[JENKINS] Archiving <https://builds.apache.org/job/incubator-brooklyn-master-build/ws/software/osgi/pom.xml>
to org.apache.brooklyn/brooklyn-software-osgi/0.9.0-SNAPSHOT/brooklyn-software-osgi-0.9.0-SNAPSHOT.pom
[JENKINS] Archiving <https://builds.apache.org/job/incubator-brooklyn-master-build/ws/examples/simple-messaging-pubsub/pom.xml>
to org.apache.brooklyn.example/brooklyn-example-simple-messaging-pubsub/0.9.0-SNAPSHOT/brooklyn-example-simple-messaging-pubsub-0.9.0-SNAPSHOT.pom
[JENKINS] Archiving <https://builds.apache.org/job/incubator-brooklyn-master-build/ws/examples/webapps/hello-world-webapp/pom.xml>
to org.apache.brooklyn.example/brooklyn-example-hello-world-webapp/0.9.0-SNAPSHOT/brooklyn-example-hello-world-webapp-0.9.0-SNAPSHOT.pom
[JENKINS] Archiving <https://builds.apache.org/job/incubator-brooklyn-master-build/ws/core/pom.xml>
to org.apache.brooklyn/brooklyn-core/0.9.0-SNAPSHOT/brooklyn-core-0.9.0-SNAPSHOT.pom
[JENKINS] Archiving <https://builds.apache.org/job/incubator-brooklyn-master-build/ws/usage/jsgui/pom.xml>
to org.apache.brooklyn/brooklyn-jsgui/0.9.0-SNAPSHOT/brooklyn-jsgui-0.9.0-SNAPSHOT.pom
[JENKINS] Archiving <https://builds.apache.org/job/incubator-brooklyn-master-build/ws/utils/common/pom.xml>
to org.apache.brooklyn/brooklyn-utils-common/0.9.0-SNAPSHOT/brooklyn-utils-common-0.9.0-SNAPSHOT.pom
[JENKINS] Archiving <https://builds.apache.org/job/incubator-brooklyn-master-build/ws/utils/groovy/pom.xml>
to org.apache.brooklyn/brooklyn-utils-groovy/0.9.0-SNAPSHOT/brooklyn-utils-groovy-0.9.0-SNAPSHOT.pom
[JENKINS] Archiving <https://builds.apache.org/job/incubator-brooklyn-master-build/ws/locations/jclouds/pom.xml>
to org.apache.brooklyn/brooklyn-locations-jclouds/0.9.0-SNAPSHOT/brooklyn-locations-jclouds-0.9.0-SNAPSHOT.pom
[JENKINS] Archiving <https://builds.apache.org/job/incubator-brooklyn-master-build/ws/examples/simple-web-cluster/pom.xml>
to org.apache.brooklyn.example/brooklyn-example-simple-web-cluster/0.9.0-SNAPSHOT/brooklyn-example-simple-web-cluster-0.9.0-SNAPSHOT.pom
[JENKINS] Archiving <https://builds.apache.org/job/incubator-brooklyn-master-build/ws/usage/downstream-parent/pom.xml>
to org.apache.brooklyn/brooklyn-downstream-parent/0.9.0-SNAPSHOT/brooklyn-downstream-parent-0.9.0-SNAPSHOT.pom
[JENKINS] Archiving <https://builds.apache.org/job/incubator-brooklyn-master-build/ws/software/database/pom.xml>
to org.apache.brooklyn/brooklyn-software-database/0.9.0-SNAPSHOT/brooklyn-software-database-0.9.0-SNAPSHOT.pom
[JENKINS] Archiving <https://builds.apache.org/job/incubator-brooklyn-master-build/ws/usage/qa/pom.xml>
to org.apache.brooklyn/brooklyn-qa/0.9.0-SNAPSHOT/brooklyn-qa-0.9.0-SNAPSHOT.pom
[JENKINS] Archiving <https://builds.apache.org/job/incubator-brooklyn-master-build/ws/usage/rest-server/pom.xml>
to org.apache.brooklyn/brooklyn-rest-server/0.9.0-SNAPSHOT/brooklyn-rest-server-0.9.0-SNAPSHOT.pom
[JENKINS] Archiving <https://builds.apache.org/job/incubator-brooklyn-master-build/ws/usage/rest-client/pom.xml>
to org.apache.brooklyn/brooklyn-rest-client/0.9.0-SNAPSHOT/brooklyn-rest-client-0.9.0-SNAPSHOT.pom
[JENKINS] Archiving <https://builds.apache.org/job/incubator-brooklyn-master-build/ws/utils/jmx/jmxmp-ssl-agent/pom.xml>
to org.apache.brooklyn/brooklyn-jmxmp-agent/0.9.0-SNAPSHOT/brooklyn-jmxmp-agent-0.9.0-SNAPSHOT.pom
[JENKINS] Archiving <https://builds.apache.org/job/incubator-brooklyn-master-build/ws/karaf/apache-brooklyn/pom.xml>
to org.apache.brooklyn/apache-brooklyn/0.9.0-SNAPSHOT/apache-brooklyn-0.9.0-SNAPSHOT.pom
[JENKINS] Archiving <https://builds.apache.org/job/incubator-brooklyn-master-build/ws/utils/jmx/jmxrmi-agent/pom.xml>
to org.apache.brooklyn/brooklyn-jmxrmi-agent/0.9.0-SNAPSHOT/brooklyn-jmxrmi-agent-0.9.0-SNAPSHOT.pom
[JENKINS] Archiving <https://builds.apache.org/job/incubator-brooklyn-master-build/ws/usage/camp/pom.xml>
to org.apache.brooklyn/brooklyn-camp/0.9.0-SNAPSHOT/brooklyn-camp-0.9.0-SNAPSHOT.pom
[JENKINS] Archiving <https://builds.apache.org/job/incubator-brooklyn-master-build/ws/examples/global-web-fabric/pom.xml>
to org.apache.brooklyn.example/brooklyn-example-global-web-fabric/0.9.0-SNAPSHOT/brooklyn-example-global-web-fabric-0.9.0-SNAPSHOT.pom
[JENKINS] Archiving <https://builds.apache.org/job/incubator-brooklyn-master-build/ws/usage/archetypes/quickstart/pom.xml>
to org.apache.brooklyn/brooklyn-archetype-quickstart/0.9.0-SNAPSHOT/brooklyn-archetype-quickstart-0.9.0-SNAPSHOT.pom
[JENKINS] Archiving <https://builds.apache.org/job/incubator-brooklyn-master-build/ws/software/nosql/pom.xml>
to org.apache.brooklyn/brooklyn-software-nosql/0.9.0-SNAPSHOT/brooklyn-software-nosql-0.9.0-SNAPSHOT.pom
[JENKINS] Archiving <https://builds.apache.org/job/incubator-brooklyn-master-build/ws/software/base/pom.xml>
to org.apache.brooklyn/brooklyn-software-base/0.9.0-SNAPSHOT/brooklyn-software-base-0.9.0-SNAPSHOT.pom
[JENKINS] Archiving <https://builds.apache.org/job/incubator-brooklyn-master-build/ws/examples/webapps/hello-world-sql/pom.xml>
to org.apache.brooklyn.example/brooklyn-example-hello-world-sql-webapp/0.9.0-SNAPSHOT/brooklyn-example-hello-world-sql-webapp-0.9.0-SNAPSHOT.pom
[JENKINS] Archiving <https://builds.apache.org/job/incubator-brooklyn-master-build/ws/usage/logback-includes/pom.xml>
to org.apache.brooklyn/brooklyn-logback-includes/0.9.0-SNAPSHOT/brooklyn-logback-includes-0.9.0-SNAPSHOT.pom
[JENKINS] Archiving <https://builds.apache.org/job/incubator-brooklyn-master-build/ws/usage/logback-includes/target/brooklyn-logback-includes-0.9.0-SNAPSHOT.jar>
to org.apache.brooklyn/brooklyn-logback-includes/0.9.0-SNAPSHOT/brooklyn-logback-includes-0.9.0-SNAPSHOT.jar
[JENKINS] Archiving <https://builds.apache.org/job/incubator-brooklyn-master-build/ws/usage/logback-includes/target/brooklyn-logback-includes-0.9.0-SNAPSHOT-sources.jar>
to org.apache.brooklyn/brooklyn-logback-includes/0.9.0-SNAPSHOT/brooklyn-logback-includes-0.9.0-SNAPSHOT-sources.jar
[JENKINS] Archiving <https://builds.apache.org/job/incubator-brooklyn-master-build/ws/pom.xml>
to org.apache.brooklyn/brooklyn/0.9.0-SNAPSHOT/brooklyn-0.9.0-SNAPSHOT.pom
[JENKINS] Archiving <https://builds.apache.org/job/incubator-brooklyn-master-build/ws/utils/test-support/pom.xml>
to org.apache.brooklyn/brooklyn-utils-test-support/0.9.0-SNAPSHOT/brooklyn-utils-test-support-0.9.0-SNAPSHOT.pom
[JENKINS] Archiving <https://builds.apache.org/job/incubator-brooklyn-master-build/ws/utils/test-support/target/brooklyn-utils-test-support-0.9.0-SNAPSHOT.jar>
to org.apache.brooklyn/brooklyn-utils-test-support/0.9.0-SNAPSHOT/brooklyn-utils-test-support-0.9.0-SNAPSHOT.jar
[JENKINS] Archiving <https://builds.apache.org/job/incubator-brooklyn-master-build/ws/utils/test-support/target/brooklyn-utils-test-support-0.9.0-SNAPSHOT-sources.jar>
to org.apache.brooklyn/brooklyn-utils-test-support/0.9.0-SNAPSHOT/brooklyn-utils-test-support-0.9.0-SNAPSHOT-sources.jar
[JENKINS] Archiving <https://builds.apache.org/job/incubator-brooklyn-master-build/ws/software/monitoring/pom.xml>
to org.apache.brooklyn/brooklyn-software-monitoring/0.9.0-SNAPSHOT/brooklyn-software-monitoring-0.9.0-SNAPSHOT.pom
[JENKINS] Archiving <https://builds.apache.org/job/incubator-brooklyn-master-build/ws/storage/hazelcast/pom.xml>
to org.apache.brooklyn/brooklyn-storage-hazelcast/0.9.0-SNAPSHOT/brooklyn-storage-hazelcast-0.9.0-SNAPSHOT.pom
[JENKINS] Archiving <https://builds.apache.org/job/incubator-brooklyn-master-build/ws/karaf/commands/pom.xml>
to org.apache.brooklyn/brooklyn-commands/0.9.0-SNAPSHOT/brooklyn-commands-0.9.0-SNAPSHOT.pom
[JENKINS] Archiving <https://builds.apache.org/job/incubator-brooklyn-master-build/ws/software/messaging/pom.xml>
to org.apache.brooklyn/brooklyn-software-messaging/0.9.0-SNAPSHOT/brooklyn-software-messaging-0.9.0-SNAPSHOT.pom
[JENKINS] Archiving <https://builds.apache.org/job/incubator-brooklyn-master-build/ws/usage/rest-api/pom.xml>
to org.apache.brooklyn/brooklyn-rest-api/0.9.0-SNAPSHOT/brooklyn-rest-api-0.9.0-SNAPSHOT.pom
[JENKINS] Archiving <https://builds.apache.org/job/incubator-brooklyn-master-build/ws/utils/rt-osgi/pom.xml>
to org.apache.brooklyn/brooklyn-rt-osgi/0.9.0-SNAPSHOT/brooklyn-rt-osgi-0.9.0-SNAPSHOT.pom
[JENKINS] Archiving <https://builds.apache.org/job/incubator-brooklyn-master-build/ws/examples/simple-nosql-cluster/pom.xml>
to org.apache.brooklyn.example/brooklyn-example-simple-nosql-cluster/0.9.0-SNAPSHOT/brooklyn-example-simple-nosql-cluster-0.9.0-SNAPSHOT.pom
[JENKINS] Archiving <https://builds.apache.org/job/incubator-brooklyn-master-build/ws/examples/webapps/pom.xml>
to org.apache.brooklyn.example/brooklyn-examples-webapps-parent/0.9.0-SNAPSHOT/brooklyn-examples-webapps-parent-0.9.0-SNAPSHOT.pom
[JENKINS] Archiving <https://builds.apache.org/job/incubator-brooklyn-master-build/ws/usage/logback-xml/pom.xml>
to org.apache.brooklyn/brooklyn-logback-xml/0.9.0-SNAPSHOT/brooklyn-logback-xml-0.9.0-SNAPSHOT.pom
[JENKINS] Archiving <https://builds.apache.org/job/incubator-brooklyn-master-build/ws/usage/logback-xml/target/brooklyn-logback-xml-0.9.0-SNAPSHOT.jar>
to org.apache.brooklyn/brooklyn-logback-xml/0.9.0-SNAPSHOT/brooklyn-logback-xml-0.9.0-SNAPSHOT.jar
[JENKINS] Archiving <https://builds.apache.org/job/incubator-brooklyn-master-build/ws/usage/logback-xml/target/brooklyn-logback-xml-0.9.0-SNAPSHOT-sources.jar>
to org.apache.brooklyn/brooklyn-logback-xml/0.9.0-SNAPSHOT/brooklyn-logback-xml-0.9.0-SNAPSHOT-sources.jar
[JENKINS] Archiving <https://builds.apache.org/job/incubator-brooklyn-master-build/ws/karaf/features/pom.xml>
to org.apache.brooklyn/brooklyn-features/0.9.0-SNAPSHOT/brooklyn-features-0.9.0-SNAPSHOT.pom
[JENKINS] Archiving <https://builds.apache.org/job/incubator-brooklyn-master-build/ws/camp/camp-server/pom.xml>
to org.apache.brooklyn.camp/camp-server/0.9.0-SNAPSHOT/camp-server-0.9.0-SNAPSHOT.pom
[JENKINS] Archiving <https://builds.apache.org/job/incubator-brooklyn-master-build/ws/examples/pom.xml>
to org.apache.brooklyn.example/brooklyn-examples-parent/0.9.0-SNAPSHOT/brooklyn-examples-parent-0.9.0-SNAPSHOT.pom
[JENKINS] Archiving <https://builds.apache.org/job/incubator-brooklyn-master-build/ws/software/webapp/pom.xml>
to org.apache.brooklyn/brooklyn-software-webapp/0.9.0-SNAPSHOT/brooklyn-software-webapp-0.9.0-SNAPSHOT.pom
[JENKINS] Archiving <https://builds.apache.org/job/incubator-brooklyn-master-build/ws/usage/test-support/pom.xml>
to org.apache.brooklyn/brooklyn-test-support/0.9.0-SNAPSHOT/brooklyn-test-support-0.9.0-SNAPSHOT.pom
[JENKINS] Archiving <https://builds.apache.org/job/incubator-brooklyn-master-build/ws/karaf/pom.xml>
to org.apache.brooklyn/brooklyn-karaf/0.9.0-SNAPSHOT/brooklyn-karaf-0.9.0-SNAPSHOT.pom
[JENKINS] Archiving <https://builds.apache.org/job/incubator-brooklyn-master-build/ws/utils/rt-felix/pom.xml>
to org.apache.brooklyn/brooklyn-rt-felix/0.9.0-SNAPSHOT/brooklyn-rt-felix-0.9.0-SNAPSHOT.pom
[JENKINS] Archiving <https://builds.apache.org/job/incubator-brooklyn-master-build/ws/software/winrm/pom.xml>
to org.apache.brooklyn/brooklyn-software-winrm/0.9.0-SNAPSHOT/brooklyn-software-winrm-0.9.0-SNAPSHOT.pom
[JENKINS] Archiving <https://builds.apache.org/job/incubator-brooklyn-master-build/ws/camp/camp-base/pom.xml>
to org.apache.brooklyn.camp/camp-base/0.9.0-SNAPSHOT/camp-base-0.9.0-SNAPSHOT.pom
[JENKINS] Archiving <https://builds.apache.org/job/incubator-brooklyn-master-build/ws/software/network/pom.xml>
to org.apache.brooklyn/brooklyn-software-network/0.9.0-SNAPSHOT/brooklyn-software-network-0.9.0-SNAPSHOT.pom
[JENKINS] Archiving <https://builds.apache.org/job/incubator-brooklyn-master-build/ws/usage/dist/pom.xml>
to org.apache.brooklyn/brooklyn-dist/0.9.0-SNAPSHOT/brooklyn-dist-0.9.0-SNAPSHOT.pom
[JENKINS] Archiving <https://builds.apache.org/job/incubator-brooklyn-master-build/ws/parent/pom.xml>
to org.apache.brooklyn/brooklyn-parent/0.9.0-SNAPSHOT/brooklyn-parent-0.9.0-SNAPSHOT.pom
Compressed 81.94 KB of artifacts by 78.1% relative to #626
[JENKINS] Archiving <https://builds.apache.org/job/incubator-brooklyn-master-build/ws/usage/cli/pom.xml>
to org.apache.brooklyn/brooklyn-cli/0.9.0-SNAPSHOT/brooklyn-cli-0.9.0-SNAPSHOT.pom
[JENKINS] Archiving <https://builds.apache.org/job/incubator-brooklyn-master-build/ws/usage/launcher/pom.xml>
to org.apache.brooklyn/brooklyn-launcher/0.9.0-SNAPSHOT/brooklyn-launcher-0.9.0-SNAPSHOT.pom
[JENKINS] Archiving <https://builds.apache.org/job/incubator-brooklyn-master-build/ws/utils/rest-swagger/pom.xml>
to org.apache.brooklyn/brooklyn-utils-rest-swagger/0.9.0-SNAPSHOT/brooklyn-utils-rest-swagger-0.9.0-SNAPSHOT.pom
[JENKINS] Archiving <https://builds.apache.org/job/incubator-brooklyn-master-build/ws/camp/pom.xml>
to org.apache.brooklyn.camp/camp-parent/0.9.0-SNAPSHOT/camp-parent-0.9.0-SNAPSHOT.pom
[JENKINS] Archiving <https://builds.apache.org/job/incubator-brooklyn-master-build/ws/api/pom.xml>
to org.apache.brooklyn/brooklyn-api/0.9.0-SNAPSHOT/brooklyn-api-0.9.0-SNAPSHOT.pom
[JENKINS] Archiving <https://builds.apache.org/job/incubator-brooklyn-master-build/ws/usage/all/pom.xml>
to org.apache.brooklyn/brooklyn-all/0.9.0-SNAPSHOT/brooklyn-all-0.9.0-SNAPSHOT.pom
channel stopped

Mime
View raw message