brooklyn-dev mailing list archives

Site index · List index
Message view « Date » · « Thread »
Top « Date » · « Thread »
From Apache Jenkins Server <jenk...@builds.apache.org>
Subject Build failed in Jenkins: incubator-brooklyn-master-windows #330
Date Thu, 22 Oct 2015 13:39:22 GMT
See <https://builds.apache.org/job/incubator-brooklyn-master-windows/330/changes>

Changes:

[aled.sage] Improves logging in JcloudsLocation

[aled.sage] Fixes SetHostnameCustomizer for machines with no addresses

------------------------------------------
[...truncated 31128 lines...]
2015-10-22 14:39:55,008 INFO  TESTNG INVOKING: "Surefire test" - org.apache.brooklyn.camp.brooklyn.catalog.CatalogYamlVersioningTest.testUnversionedReference()
SUREFIRE-859: [GC 712999K->499121K(763008K), 0.0161973 secs]
2015-10-22 14:39:55,169 INFO  CAMP created 'BasicApplicationImpl{id=EEStg8id}'
2015-10-22 14:39:55,171 INFO  Test - created org.apache.brooklyn.camp.spi.Assembly@33faadae[id=EEStg8id;
type=Assembly]
2015-10-22 14:39:55,171 INFO  App - BasicApplicationImpl{id=EEStg8id}
2015-10-22 14:39:55,181 INFO  Started application BasicApplicationImpl{id=EEStg8id}
2015-10-22 14:39:55,182 INFO  TESTNG PASSED: "Surefire test" - org.apache.brooklyn.camp.brooklyn.catalog.CatalogYamlVersioningTest.testUnversionedReference()
finished in 175 ms
2015-10-22 14:39:55,183 INFO  TESTNG INVOKING CONFIGURATION: "Surefire test" - @AfterMethod
org.apache.brooklyn.camp.brooklyn.AbstractYamlTest.tearDown()
2015-10-22 14:39:55,185 INFO  Stopping application BasicApplicationImpl{id=EEStg8id}
2015-10-22 14:39:55,186 INFO  Stopped application BasicApplicationImpl{id=EEStg8id}
2015-10-22 14:39:55,504 INFO  TESTNG PASSED CONFIGURATION: "Surefire test" - @AfterMethod
org.apache.brooklyn.camp.brooklyn.AbstractYamlTest.tearDown() finished in 321 ms
2015-10-22 14:39:55,505 INFO  TESTNG INVOKING CONFIGURATION: "Surefire test" - @BeforeMethod
org.apache.brooklyn.camp.brooklyn.catalog.CatalogYamlVersioningTest.setUp()
SUREFIRE-859: [GC 715377K->503259K(766464K), 0.1030477 secs]
2015-10-22 14:39:56,494 INFO  TESTNG PASSED CONFIGURATION: "Surefire test" - @BeforeMethod
org.apache.brooklyn.camp.brooklyn.catalog.CatalogYamlVersioningTest.setUp() finished in 990
ms
2015-10-22 14:39:56,494 INFO  TESTNG INVOKING: "Surefire test" - org.apache.brooklyn.camp.brooklyn.catalog.CatalogYamlVersioningTest.testVersionedReference()
2015-10-22 14:39:56,666 INFO  CAMP created 'BasicApplicationImpl{id=WcUCFKmI}'
2015-10-22 14:39:56,667 INFO  Test - created org.apache.brooklyn.camp.spi.Assembly@34a1d298[id=WcUCFKmI;
type=Assembly]
2015-10-22 14:39:56,667 INFO  App - BasicApplicationImpl{id=WcUCFKmI}
2015-10-22 14:39:56,677 INFO  Started application BasicApplicationImpl{id=WcUCFKmI}
2015-10-22 14:39:56,679 INFO  TESTNG PASSED: "Surefire test" - org.apache.brooklyn.camp.brooklyn.catalog.CatalogYamlVersioningTest.testVersionedReference()
finished in 185 ms
2015-10-22 14:39:56,680 INFO  TESTNG INVOKING CONFIGURATION: "Surefire test" - @AfterMethod
org.apache.brooklyn.camp.brooklyn.AbstractYamlTest.tearDown()
2015-10-22 14:39:56,699 INFO  Stopping application BasicApplicationImpl{id=WcUCFKmI}
2015-10-22 14:39:56,706 INFO  Stopped application BasicApplicationImpl{id=WcUCFKmI}
2015-10-22 14:39:57,053 INFO  TESTNG PASSED CONFIGURATION: "Surefire test" - @AfterMethod
org.apache.brooklyn.camp.brooklyn.AbstractYamlTest.tearDown() finished in 373 ms
2015-10-22 14:39:57,054 INFO  TESTNG INVOKING CONFIGURATION: "Surefire test" - @BeforeMethod
org.apache.brooklyn.camp.brooklyn.catalog.CatalogYamlVersioningTest.setUp()
SUREFIRE-859: [GC 724187K->501408K(765184K), 0.0204931 secs]
2015-10-22 14:39:58,040 INFO  TESTNG PASSED CONFIGURATION: "Surefire test" - @BeforeMethod
org.apache.brooklyn.camp.brooklyn.catalog.CatalogYamlVersioningTest.setUp() finished in 986
ms
2015-10-22 14:39:58,041 INFO  TESTNG INVOKING: "Surefire test" - org.apache.brooklyn.camp.brooklyn.catalog.CatalogYamlVersioningTest.testVersionedReferenceJustAddedExplicitVersion()
SUREFIRE-859: [GC 722336K->503766K(768384K), 0.0464179 secs]
2015-10-22 14:39:58,311 INFO  CAMP created 'BasicApplicationImpl{id=PfbA5nIf}'
2015-10-22 14:39:58,312 INFO  Test - created org.apache.brooklyn.camp.spi.Assembly@32e9c4d8[id=PfbA5nIf;
type=Assembly]
2015-10-22 14:39:58,312 INFO  App - BasicApplicationImpl{id=PfbA5nIf}
2015-10-22 14:39:58,351 INFO  Started application BasicApplicationImpl{id=PfbA5nIf}
2015-10-22 14:39:58,353 INFO  TESTNG PASSED: "Surefire test" - org.apache.brooklyn.camp.brooklyn.catalog.CatalogYamlVersioningTest.testVersionedReferenceJustAddedExplicitVersion()
finished in 312 ms
2015-10-22 14:39:58,354 INFO  TESTNG INVOKING CONFIGURATION: "Surefire test" - @AfterMethod
org.apache.brooklyn.camp.brooklyn.AbstractYamlTest.tearDown()
2015-10-22 14:39:58,356 INFO  Stopping application BasicApplicationImpl{id=PfbA5nIf}
2015-10-22 14:39:58,370 INFO  Stopped application BasicApplicationImpl{id=PfbA5nIf}
2015-10-22 14:39:58,877 INFO  TESTNG PASSED CONFIGURATION: "Surefire test" - @AfterMethod
org.apache.brooklyn.camp.brooklyn.AbstractYamlTest.tearDown() finished in 523 ms
2015-10-22 14:39:58,878 INFO  TESTNG INVOKING CONFIGURATION: "Surefire test" - @BeforeMethod
org.apache.brooklyn.camp.brooklyn.catalog.CatalogYamlVersioningTest.setUp()
SUREFIRE-859: [GC 728790K->507965K(767360K), 0.0396386 secs]
2015-10-22 14:39:59,754 INFO  TESTNG PASSED CONFIGURATION: "Surefire test" - @BeforeMethod
org.apache.brooklyn.camp.brooklyn.catalog.CatalogYamlVersioningTest.setUp() finished in 877
ms
2015-10-22 14:39:59,755 INFO  TESTNG INVOKING: "Surefire test" - org.apache.brooklyn.camp.brooklyn.catalog.CatalogYamlVersioningTest.testVersionedReferenceJustAddedImplicitVersionSyntax()
2015-10-22 14:39:59,964 INFO  CAMP created 'BasicApplicationImpl{id=k4Mn3Q9f}'
2015-10-22 14:39:59,965 INFO  Test - created org.apache.brooklyn.camp.spi.Assembly@72d2a563[id=k4Mn3Q9f;
type=Assembly]
2015-10-22 14:39:59,965 INFO  App - BasicApplicationImpl{id=k4Mn3Q9f}
2015-10-22 14:39:59,973 INFO  Started application BasicApplicationImpl{id=k4Mn3Q9f}
2015-10-22 14:40:00,005 INFO  TESTNG PASSED: "Surefire test" - org.apache.brooklyn.camp.brooklyn.catalog.CatalogYamlVersioningTest.testVersionedReferenceJustAddedImplicitVersionSyntax()
finished in 251 ms
2015-10-22 14:40:00,006 INFO  TESTNG INVOKING CONFIGURATION: "Surefire test" - @AfterMethod
org.apache.brooklyn.camp.brooklyn.AbstractYamlTest.tearDown()
2015-10-22 14:40:00,007 INFO  Stopping application BasicApplicationImpl{id=k4Mn3Q9f}
2015-10-22 14:40:00,010 INFO  Stopped application BasicApplicationImpl{id=k4Mn3Q9f}
2015-10-22 14:40:00,411 INFO  TESTNG PASSED CONFIGURATION: "Surefire test" - @AfterMethod
org.apache.brooklyn.camp.brooklyn.AbstractYamlTest.tearDown() finished in 405 ms
2015-10-22 14:40:00,411 INFO  TESTNG INVOKING CONFIGURATION: "Surefire test" - @BeforeMethod
org.apache.brooklyn.camp.brooklyn.AbstractYamlTest.setUp()
SUREFIRE-859: [GC 732989K->506520K(770368K), 0.0212940 secs]
2015-10-22 14:40:01,877 INFO  TESTNG PASSED CONFIGURATION: "Surefire test" - @BeforeMethod
org.apache.brooklyn.camp.brooklyn.AbstractYamlTest.setUp() finished in 1466 ms
2015-10-22 14:40:01,878 INFO  TESTNG INVOKING: "Surefire test" - org.apache.brooklyn.camp.brooklyn.spi.creation.service.ServiceTypeResolverTest.testAddCatalogItemVerySimple()
2015-10-22 14:40:01,900 INFO  TESTNG PASSED: "Surefire test" - org.apache.brooklyn.camp.brooklyn.spi.creation.service.ServiceTypeResolverTest.testAddCatalogItemVerySimple()
finished in 23 ms
2015-10-22 14:40:01,901 INFO  TESTNG INVOKING CONFIGURATION: "Surefire test" - @AfterMethod
org.apache.brooklyn.camp.brooklyn.AbstractYamlTest.tearDown()
2015-10-22 14:40:02,395 INFO  TESTNG PASSED CONFIGURATION: "Surefire test" - @AfterMethod
org.apache.brooklyn.camp.brooklyn.AbstractYamlTest.tearDown() finished in 495 ms
2015-10-22 14:40:02,518 INFO  TESTNG 
===============================================
    Surefire test
    Tests run: 227, Failures: 1, Skips: 0
===============================================
2015-10-22 14:40:02,519 INFO  BrooklynLeakListener.onFinish attempting to terminate all extant
ManagementContexts: name=Surefire test; includedGroups=[]; excludedGroups=[Integration, Acceptance,
Live, WIP]; suiteName=Surefire suite; outDir=F:\hudson\hudson-slave\workspace\incubator-brooklyn-master-windows\usage\camp\target\surefire-reports\Surefire
suite: no org.apache.brooklyn.core.management.internal.LocalManagementContext available, so
skipped
SUREFIRE-859: [GC 735704K->504175K(769536K), 0.0091302 secs]
Tests run: 227, Failures: 1, Errors: 0, Skipped: 0, Time elapsed: 406.854 sec <<<
FAILURE! - in TestSuite
testRebindWithCatalogPropertiesForDeprecationAndEnablementAbsent(org.apache.brooklyn.camp.brooklyn.catalog.CatalogYamlRebindTest)
 Time elapsed: 0.385 sec  <<< FAILURE!
java.nio.file.InvalidPathException: Illegal char <:> at index 73: C:\Windows\TEMP\CatalogYamlRebindTest-OhNs\catalog\my.catalog.app.id.load:0.1.0.vWfmp4fW.tmp
	at sun.nio.fs.WindowsPathParser.normalize(WindowsPathParser.java:176)
	at sun.nio.fs.WindowsPathParser.parse(WindowsPathParser.java:147)
	at sun.nio.fs.WindowsPathParser.parse(WindowsPathParser.java:77)
	at sun.nio.fs.WindowsPath.parse(WindowsPath.java:94)
	at sun.nio.fs.WindowsFileSystem.getPath(WindowsFileSystem.java:255)
	at java.io.File.toPath(File.java:2069)
	at org.apache.brooklyn.util.io.FilePermissions.apply(FilePermissions.java:61)
	at org.apache.brooklyn.util.io.FileUtil.setFilePermissionsTo600(FileUtil.java:72)
	at org.apache.brooklyn.core.mgmt.persist.FileBasedStoreObjectAccessor.put(FileBasedStoreObjectAccessor.java:82)
	at org.apache.brooklyn.camp.brooklyn.catalog.CatalogYamlRebindTest$1.apply(CatalogYamlRebindTest.java:216)
	at org.apache.brooklyn.camp.brooklyn.catalog.CatalogYamlRebindTest$1.apply(CatalogYamlRebindTest.java:209)
	at org.apache.brooklyn.core.mgmt.rebind.RebindTestUtils.rebindAll(RebindTestUtils.java:433)
	at org.apache.brooklyn.core.mgmt.rebind.RebindTestUtils.rebind(RebindTestUtils.java:318)
	at org.apache.brooklyn.core.mgmt.rebind.RebindTestFixture.rebind(RebindTestFixture.java:258)
	at org.apache.brooklyn.camp.brooklyn.AbstractYamlRebindTest.rebind(AbstractYamlRebindTest.java:86)
	at org.apache.brooklyn.camp.brooklyn.catalog.CatalogYamlRebindTest.runRebindWithCatalogAndApp(CatalogYamlRebindTest.java:208)
	at org.apache.brooklyn.camp.brooklyn.catalog.CatalogYamlRebindTest.testRebindWithCatalogPropertiesForDeprecationAndEnablementAbsent(CatalogYamlRebindTest.java:123)


Results :

Failed tests: 
  CatalogYamlRebindTest.testRebindWithCatalogPropertiesForDeprecationAndEnablementAbsent:123->runRebindWithCatalogAndApp:208->AbstractYamlRebindTest.rebind:86->RebindTestFixture.rebind:258
ยป InvalidPath

Tests run: 227, Failures: 1, Errors: 0, Skipped: 0

[JENKINS] Recording test results
[JENKINS] Archiving disabled
[INFO]                                                                         
[INFO] ------------------------------------------------------------------------
[INFO] Skipping Brooklyn REST Server
[INFO] This project has been banned from the build due to previous failures.
[INFO] ------------------------------------------------------------------------
[INFO]                                                                         
[INFO] ------------------------------------------------------------------------
[INFO] Skipping Brooklyn REST JavaScript Web GUI
[INFO] This project has been banned from the build due to previous failures.
[INFO] ------------------------------------------------------------------------
[INFO]                                                                         
[INFO] ------------------------------------------------------------------------
[INFO] Skipping Brooklyn Launcher
[INFO] This project has been banned from the build due to previous failures.
[INFO] ------------------------------------------------------------------------
[INFO]                                                                         
[INFO] ------------------------------------------------------------------------
[INFO] Skipping Brooklyn Command Line Interface
[INFO] This project has been banned from the build due to previous failures.
[INFO] ------------------------------------------------------------------------
[INFO]                                                                         
[INFO] ------------------------------------------------------------------------
[INFO] Skipping Brooklyn All Things
[INFO] This project has been banned from the build due to previous failures.
[INFO] ------------------------------------------------------------------------
[INFO]                                                                         
[INFO] ------------------------------------------------------------------------
[INFO] Skipping Brooklyn Simple Web Cluster Example
[INFO] This project has been banned from the build due to previous failures.
[INFO] ------------------------------------------------------------------------
[INFO]                                                                         
[INFO] ------------------------------------------------------------------------
[INFO] Skipping Brooklyn Global Web Fabric Example
[INFO] This project has been banned from the build due to previous failures.
[INFO] ------------------------------------------------------------------------
[INFO]                                                                         
[INFO] ------------------------------------------------------------------------
[INFO] Skipping Brooklyn Simple Messaging Publish-Subscribe Example
[INFO] This project has been banned from the build due to previous failures.
[INFO] ------------------------------------------------------------------------
[INFO]                                                                         
[INFO] ------------------------------------------------------------------------
[INFO] Skipping Brooklyn NoSQL Cluster Examples
[INFO] This project has been banned from the build due to previous failures.
[INFO] ------------------------------------------------------------------------
[INFO]                                                                         
[INFO] ------------------------------------------------------------------------
[INFO] Skipping Brooklyn Distribution
[INFO] This project has been banned from the build due to previous failures.
[INFO] ------------------------------------------------------------------------
[INFO]                                                                         
[INFO] ------------------------------------------------------------------------
[INFO] Skipping Brooklyn QA
[INFO] This project has been banned from the build due to previous failures.
[INFO] ------------------------------------------------------------------------
[INFO]                                                                         
[INFO] ------------------------------------------------------------------------
[INFO] Skipping Brooklyn REST Client
[INFO] This project has been banned from the build due to previous failures.
[INFO] ------------------------------------------------------------------------
[INFO] ------------------------------------------------------------------------
[INFO] Reactor Summary:
[INFO] 
[INFO] Brooklyn Root ..................................... SUCCESS [5.772s]
[INFO] Brooklyn Parent Project ........................... SUCCESS [21.928s]
[INFO] Brooklyn Logback Configuration .................... SUCCESS [23.723s]
[INFO] Brooklyn Test Support Utilities ................... SUCCESS [20.375s]
[INFO] Brooklyn Logback Includable Configuration ......... SUCCESS [1.950s]
[INFO] Brooklyn Common Utilities ......................... SUCCESS [45.970s]
[INFO] Brooklyn API ...................................... SUCCESS [8.831s]
[INFO] Brooklyn Test Support ............................. SUCCESS [22.505s]
[INFO] CAMP Server Parent Project ........................ SUCCESS [1.419s]
[INFO] CAMP Base ......................................... SUCCESS [43.845s]
[INFO] Brooklyn Groovy Utilities ......................... SUCCESS [39.670s]
[INFO] Brooklyn Core ..................................... SUCCESS [10:18.653s]
[INFO] Brooklyn Policies ................................. SUCCESS [4:06.973s]
[INFO] Brooklyn WinRM Software Entities .................. SUCCESS [28.222s]
[INFO] Brooklyn Jclouds Location Targets ................. SUCCESS [1:41.783s]
[INFO] Brooklyn Secure JMXMP Agent ....................... SUCCESS [27.284s]
[INFO] Brooklyn JMX RMI Agent ............................ SUCCESS [7.704s]
[INFO] Brooklyn Software Base ............................ SUCCESS [2:23.690s]
[INFO] Brooklyn Web App Software Entities ................ SUCCESS [3:00.709s]
[INFO] Brooklyn Database Software Entities ............... SUCCESS [21.822s]
[INFO] Brooklyn NoSQL Data Store Software Entities ....... SUCCESS [1:01.125s]
[INFO] Brooklyn CAMP REST API ............................ FAILURE [7:16.654s]
[INFO] Brooklyn REST Server .............................. SKIPPED
[INFO] Brooklyn REST JavaScript Web GUI .................. SKIPPED
[INFO] Brooklyn Launcher ................................. SKIPPED
[INFO] Brooklyn Command Line Interface ................... SKIPPED
[INFO] Brooklyn All Things ............................... SKIPPED
[INFO] Brooklyn Simple Web Cluster Example ............... SKIPPED
[INFO] Brooklyn Global Web Fabric Example ................ SKIPPED
[INFO] Brooklyn Simple Messaging Publish-Subscribe Example  SKIPPED
[INFO] Brooklyn NoSQL Cluster Examples ................... SKIPPED
[INFO] Brooklyn Distribution ............................. SKIPPED
[INFO] Brooklyn QA ....................................... SKIPPED
[INFO] Brooklyn REST Client .............................. SKIPPED
[INFO] ------------------------------------------------------------------------
[INFO] BUILD FAILURE
[INFO] ------------------------------------------------------------------------
[INFO] Total time: 35:28.648s
[INFO] Finished at: Thu Oct 22 14:40:06 BST 2015
[INFO] Final Memory: 63M/241M
[INFO] ------------------------------------------------------------------------
[JENKINS] Archiving disabled
[JENKINS] Archiving disabled
[JENKINS] Archiving disabled
[JENKINS] Archiving disabled
[JENKINS] Archiving disabled
[JENKINS] Archiving disabled
[JENKINS] Archiving disabled
[JENKINS] Archiving disabled
[JENKINS] Archiving disabled
[JENKINS] Archiving disabled
[JENKINS] Archiving disabled
[JENKINS] Archiving disabled
[JENKINS] Archiving disabled
[JENKINS] Archiving disabled
[JENKINS] Archiving disabled
[JENKINS] Archiving disabled
[JENKINS] Archiving disabled
[JENKINS] Archiving disabled
[JENKINS] Archiving disabled
[JENKINS] Archiving disabled
[JENKINS] Archiving disabled
[JENKINS] Archiving disabled
[JENKINS] Archiving disabled
[JENKINS] Archiving disabled
[JENKINS] Archiving disabled
[JENKINS] Archiving disabled
[JENKINS] Archiving disabled
[JENKINS] Archiving disabled
[JENKINS] Archiving disabled
[JENKINS] Archiving disabled
[JENKINS] Archiving disabled
[JENKINS] Archiving disabled
[JENKINS] Archiving disabled
[JENKINS] Archiving disabled
Waiting for Jenkins to finish collecting data
[ERROR] Failed to execute goal org.apache.maven.plugins:maven-surefire-plugin:2.18.1:test
(default-test) on project brooklyn-camp: There are test failures.
[ERROR] 
[ERROR] Please refer to F:\hudson\hudson-slave\workspace\incubator-brooklyn-master-windows\usage\camp\target\surefire-reports
for the individual test results.
[ERROR] -> [Help 1]
[ERROR] 
[ERROR] To see the full stack trace of the errors, re-run Maven with the -e switch.
[ERROR] Re-run Maven using the -X switch to enable full debug logging.
[ERROR] 
[ERROR] For more information about the errors and possible solutions, please read the following
articles:
[ERROR] [Help 1] http://cwiki.apache.org/confluence/display/MAVEN/MojoFailureException
[ERROR] 
[ERROR] After correcting the problems, you can resume the build with the command
[ERROR]   mvn <goals> -rf :brooklyn-camp
channel stopped

Mime
View raw message