brooklyn-dev mailing list archives

Site index · List index
Message view « Date » · « Thread »
Top « Date » · « Thread »
From Apache Jenkins Server <jenk...@builds.apache.org>
Subject Build failed in Jenkins: incubator-brooklyn-master-windows #311
Date Wed, 14 Oct 2015 22:07:14 GMT
See <https://builds.apache.org/job/incubator-brooklyn-master-windows/311/changes>

Changes:

[guglielmo.nigri] Extend brooklynnode.classpath config options

------------------------------------------
[...truncated 28118 lines...]
2015-10-14 23:07:37,067 INFO  TESTNG PASSED CONFIGURATION: "Surefire test" - @BeforeMethod
org.apache.brooklyn.camp.brooklyn.catalog.CatalogYamlVersioningTest.setUp() finished in 776
ms
2015-10-14 23:07:37,067 INFO  TESTNG INVOKING: "Surefire test" - org.apache.brooklyn.camp.brooklyn.catalog.CatalogYamlVersioningTest.testVersionedReferenceJustAddedImplicitVersionSyntax()
2015-10-14 23:07:37,132 INFO  CAMP placing 'BasicApplicationImpl{id=Y1YjLBxQ}' under management
2015-10-14 23:07:37,134 INFO  Test - created org.apache.brooklyn.camp.spi.Assembly@624a0344[id=Y1YjLBxQ;
type=Assembly]
2015-10-14 23:07:37,134 INFO  App - BasicApplicationImpl{id=Y1YjLBxQ}
2015-10-14 23:07:37,140 INFO  Started application BasicApplicationImpl{id=Y1YjLBxQ}
2015-10-14 23:07:37,140 INFO  TESTNG PASSED: "Surefire test" - org.apache.brooklyn.camp.brooklyn.catalog.CatalogYamlVersioningTest.testVersionedReferenceJustAddedImplicitVersionSyntax()
finished in 73 ms
2015-10-14 23:07:37,141 INFO  TESTNG INVOKING CONFIGURATION: "Surefire test" - @AfterMethod
org.apache.brooklyn.camp.brooklyn.AbstractYamlTest.tearDown()
2015-10-14 23:07:37,142 INFO  Stopping application BasicApplicationImpl{id=Y1YjLBxQ}
2015-10-14 23:07:37,144 INFO  Stopped application BasicApplicationImpl{id=Y1YjLBxQ}
2015-10-14 23:07:37,714 INFO  TESTNG PASSED CONFIGURATION: "Surefire test" - @AfterMethod
org.apache.brooklyn.camp.brooklyn.AbstractYamlTest.tearDown() finished in 573 ms
2015-10-14 23:07:37,715 INFO  TESTNG INVOKING: "Surefire test" - org.apache.brooklyn.camp.brooklyn.spi.dsl.DslParseTest.testParseFunctionChain()
2015-10-14 23:07:37,715 INFO  TESTNG PASSED: "Surefire test" - org.apache.brooklyn.camp.brooklyn.spi.dsl.DslParseTest.testParseFunctionChain()
finished in 0 ms
2015-10-14 23:07:37,716 INFO  TESTNG INVOKING: "Surefire test" - org.apache.brooklyn.camp.brooklyn.spi.dsl.DslParseTest.testParseMultiArgMultiTypeFunction()
2015-10-14 23:07:37,716 INFO  TESTNG PASSED: "Surefire test" - org.apache.brooklyn.camp.brooklyn.spi.dsl.DslParseTest.testParseMultiArgMultiTypeFunction()
finished in 0 ms
2015-10-14 23:07:37,716 INFO  TESTNG INVOKING: "Surefire test" - org.apache.brooklyn.camp.brooklyn.spi.dsl.DslParseTest.testParseNoArgFunction()
2015-10-14 23:07:37,716 INFO  TESTNG PASSED: "Surefire test" - org.apache.brooklyn.camp.brooklyn.spi.dsl.DslParseTest.testParseNoArgFunction()
finished in 0 ms
2015-10-14 23:07:37,716 INFO  TESTNG INVOKING: "Surefire test" - org.apache.brooklyn.camp.brooklyn.spi.dsl.DslParseTest.testParseOneArgFunction()
2015-10-14 23:07:37,716 INFO  TESTNG PASSED: "Surefire test" - org.apache.brooklyn.camp.brooklyn.spi.dsl.DslParseTest.testParseOneArgFunction()
finished in 0 ms
2015-10-14 23:07:37,716 INFO  TESTNG INVOKING: "Surefire test" - org.apache.brooklyn.camp.brooklyn.spi.dsl.DslParseTest.testParseString()
2015-10-14 23:07:37,716 INFO  TESTNG PASSED: "Surefire test" - org.apache.brooklyn.camp.brooklyn.spi.dsl.DslParseTest.testParseString()
finished in 0 ms
2015-10-14 23:07:37,717 INFO  TESTNG INVOKING CONFIGURATION: "Surefire test" - @BeforeMethod
org.apache.brooklyn.camp.brooklyn.test.lite.CampYamlLiteTest.setUp()
SUREFIRE-859: [GC 670195K->443255K(767552K), 0.0114204 secs]
2015-10-14 23:07:38,556 INFO  TESTNG PASSED CONFIGURATION: "Surefire test" - @BeforeMethod
org.apache.brooklyn.camp.brooklyn.test.lite.CampYamlLiteTest.setUp() finished in 838 ms
2015-10-14 23:07:38,556 INFO  TESTNG INVOKING: "Surefire test" - org.apache.brooklyn.camp.brooklyn.test.lite.CampYamlLiteTest.testAddChildrenEffector()
SUREFIRE-859: [GC 668855K->445833K(770432K), 0.0140540 secs]
2015-10-14 23:07:38,745 INFO  TESTNG PASSED: "Surefire test" - org.apache.brooklyn.camp.brooklyn.test.lite.CampYamlLiteTest.testAddChildrenEffector()
finished in 189 ms
2015-10-14 23:07:38,745 INFO  TESTNG INVOKING CONFIGURATION: "Surefire test" - @AfterMethod
org.apache.brooklyn.camp.brooklyn.test.lite.CampYamlLiteTest.tearDown()
2015-10-14 23:07:39,087 INFO  TESTNG PASSED CONFIGURATION: "Surefire test" - @AfterMethod
org.apache.brooklyn.camp.brooklyn.test.lite.CampYamlLiteTest.tearDown() finished in 342 ms
2015-10-14 23:07:39,088 INFO  TESTNG INVOKING CONFIGURATION: "Surefire test" - @BeforeMethod
org.apache.brooklyn.camp.brooklyn.test.lite.CampYamlLiteTest.setUp()
SUREFIRE-859: [GC 675081K->450011K(769536K), 0.0170737 secs]
2015-10-14 23:07:40,018 INFO  TESTNG PASSED CONFIGURATION: "Surefire test" - @BeforeMethod
org.apache.brooklyn.camp.brooklyn.test.lite.CampYamlLiteTest.setUp() finished in 931 ms
2015-10-14 23:07:40,018 INFO  TESTNG INVOKING: "Surefire test" - org.apache.brooklyn.camp.brooklyn.test.lite.CampYamlLiteTest.testRegisterCustomEntityWithBundleWhereEntityIsFromCoreAndIconFromBundle()
2015-10-14 23:07:40,040 INFO  TESTNG PASSED: "Surefire test" - org.apache.brooklyn.camp.brooklyn.test.lite.CampYamlLiteTest.testRegisterCustomEntityWithBundleWhereEntityIsFromCoreAndIconFromBundle()
finished in 22 ms
2015-10-14 23:07:40,040 INFO  TESTNG INVOKING CONFIGURATION: "Surefire test" - @AfterMethod
org.apache.brooklyn.camp.brooklyn.test.lite.CampYamlLiteTest.tearDown()
2015-10-14 23:07:40,499 INFO  TESTNG PASSED CONFIGURATION: "Surefire test" - @AfterMethod
org.apache.brooklyn.camp.brooklyn.test.lite.CampYamlLiteTest.tearDown() finished in 459 ms
2015-10-14 23:07:40,500 INFO  TESTNG INVOKING CONFIGURATION: "Surefire test" - @BeforeMethod
org.apache.brooklyn.camp.brooklyn.test.lite.CampYamlLiteTest.setUp()
SUREFIRE-859: [GC 678803K->449665K(772288K), 0.0114682 secs]
2015-10-14 23:07:41,237 INFO  TESTNG PASSED CONFIGURATION: "Surefire test" - @BeforeMethod
org.apache.brooklyn.camp.brooklyn.test.lite.CampYamlLiteTest.setUp() finished in 738 ms
2015-10-14 23:07:41,237 INFO  TESTNG INVOKING: "Surefire test" - org.apache.brooklyn.camp.brooklyn.test.lite.CampYamlLiteTest.testResetXmlWithCustomEntity()
SUREFIRE-859: [GC 682689K->452764K(771456K), 0.0233393 secs]
2015-10-14 23:07:42,907 INFO  TESTNG PASSED: "Surefire test" - org.apache.brooklyn.camp.brooklyn.test.lite.CampYamlLiteTest.testResetXmlWithCustomEntity()
finished in 1670 ms
2015-10-14 23:07:42,907 INFO  TESTNG INVOKING CONFIGURATION: "Surefire test" - @AfterMethod
org.apache.brooklyn.camp.brooklyn.test.lite.CampYamlLiteTest.tearDown()
2015-10-14 23:07:43,257 INFO  TESTNG PASSED CONFIGURATION: "Surefire test" - @AfterMethod
org.apache.brooklyn.camp.brooklyn.test.lite.CampYamlLiteTest.tearDown() finished in 350 ms
2015-10-14 23:07:43,258 INFO  TESTNG INVOKING CONFIGURATION: "Surefire test" - @BeforeMethod
org.apache.brooklyn.camp.brooklyn.test.lite.CampYamlLiteTest.setUp()
SUREFIRE-859: [GC 685788K->452909K(773632K), 0.0121943 secs]
2015-10-14 23:07:44,015 INFO  TESTNG PASSED CONFIGURATION: "Surefire test" - @BeforeMethod
org.apache.brooklyn.camp.brooklyn.test.lite.CampYamlLiteTest.setUp() finished in 758 ms
2015-10-14 23:07:44,015 INFO  TESTNG INVOKING: "Surefire test" - org.apache.brooklyn.camp.brooklyn.test.lite.CampYamlLiteTest.testYamlServiceForCatalog()
2015-10-14 23:07:44,029 INFO  TESTNG PASSED: "Surefire test" - org.apache.brooklyn.camp.brooklyn.test.lite.CampYamlLiteTest.testYamlServiceForCatalog()
finished in 14 ms
2015-10-14 23:07:44,029 INFO  TESTNG INVOKING CONFIGURATION: "Surefire test" - @AfterMethod
org.apache.brooklyn.camp.brooklyn.test.lite.CampYamlLiteTest.tearDown()
2015-10-14 23:07:44,472 INFO  TESTNG PASSED CONFIGURATION: "Surefire test" - @AfterMethod
org.apache.brooklyn.camp.brooklyn.test.lite.CampYamlLiteTest.tearDown() finished in 443 ms
2015-10-14 23:07:44,472 INFO  TESTNG INVOKING CONFIGURATION: "Surefire test" - @BeforeMethod
org.apache.brooklyn.camp.brooklyn.test.lite.CampYamlLiteTest.setUp()
SUREFIRE-859: [GC 688941K->452334K(773120K), 0.0088235 secs]
2015-10-14 23:07:45,115 INFO  TESTNG PASSED CONFIGURATION: "Surefire test" - @BeforeMethod
org.apache.brooklyn.camp.brooklyn.test.lite.CampYamlLiteTest.setUp() finished in 643 ms
2015-10-14 23:07:45,115 INFO  TESTNG INVOKING: "Surefire test" - org.apache.brooklyn.camp.brooklyn.test.lite.CampYamlLiteTest.testYamlServiceMatchAndBrooklynInstantiate()
2015-10-14 23:07:45,117 INFO  AT is:
org.apache.brooklyn.camp.spi.AssemblyTemplate@29356e35[id=hFB4LgeW; type=AssemblyTemplate]
2015-10-14 23:07:45,147 INFO  TESTNG PASSED: "Surefire test" - org.apache.brooklyn.camp.brooklyn.test.lite.CampYamlLiteTest.testYamlServiceMatchAndBrooklynInstantiate()
finished in 32 ms
2015-10-14 23:07:45,148 INFO  TESTNG INVOKING CONFIGURATION: "Surefire test" - @AfterMethod
org.apache.brooklyn.camp.brooklyn.test.lite.CampYamlLiteTest.tearDown()
2015-10-14 23:07:45,826 INFO  TESTNG PASSED CONFIGURATION: "Surefire test" - @AfterMethod
org.apache.brooklyn.camp.brooklyn.test.lite.CampYamlLiteTest.tearDown() finished in 678 ms
2015-10-14 23:07:45,879 INFO  TESTNG 
===============================================
    Surefire test
    Tests run: 221, Failures: 1, Skips: 0
===============================================
2015-10-14 23:07:45,880 INFO  BrooklynLeakListener.onFinish attempting to terminate all extant
ManagementContexts: name=Surefire test; includedGroups=[]; excludedGroups=[Integration, Acceptance,
Live, WIP]; suiteName=Surefire suite; outDir=F:\hudson\hudson-slave\workspace\incubator-brooklyn-master-windows\usage\camp\target\surefire-reports\Surefire
suite: no org.apache.brooklyn.core.management.internal.LocalManagementContext available, so
skipped
SUREFIRE-859: [GC 688366K->450963K(774144K), 0.0091394 secs]
Tests run: 221, Failures: 1, Errors: 0, Skipped: 0, Time elapsed: 299.925 sec <<<
FAILURE! - in TestSuite
testRebindWithCatalogPropertiesForDeprecationAndEnablementAbsent(org.apache.brooklyn.camp.brooklyn.catalog.CatalogYamlRebindTest)
 Time elapsed: 0.209 sec  <<< FAILURE!
java.nio.file.InvalidPathException: Illegal char <:> at index 73: C:\Windows\TEMP\CatalogYamlRebindTest-SbPn\catalog\my.catalog.app.id.load:0.1.0.xLq9wGgU.tmp
	at sun.nio.fs.WindowsPathParser.normalize(WindowsPathParser.java:176)
	at sun.nio.fs.WindowsPathParser.parse(WindowsPathParser.java:147)
	at sun.nio.fs.WindowsPathParser.parse(WindowsPathParser.java:77)
	at sun.nio.fs.WindowsPath.parse(WindowsPath.java:94)
	at sun.nio.fs.WindowsFileSystem.getPath(WindowsFileSystem.java:255)
	at java.io.File.toPath(File.java:2069)
	at org.apache.brooklyn.util.io.FilePermissions.apply(FilePermissions.java:61)
	at org.apache.brooklyn.util.io.FileUtil.setFilePermissionsTo600(FileUtil.java:72)
	at org.apache.brooklyn.core.mgmt.persist.FileBasedStoreObjectAccessor.put(FileBasedStoreObjectAccessor.java:82)
	at org.apache.brooklyn.camp.brooklyn.catalog.CatalogYamlRebindTest$1.apply(CatalogYamlRebindTest.java:216)
	at org.apache.brooklyn.camp.brooklyn.catalog.CatalogYamlRebindTest$1.apply(CatalogYamlRebindTest.java:209)
	at org.apache.brooklyn.core.mgmt.rebind.RebindTestUtils.rebindAll(RebindTestUtils.java:433)
	at org.apache.brooklyn.core.mgmt.rebind.RebindTestUtils.rebind(RebindTestUtils.java:318)
	at org.apache.brooklyn.core.mgmt.rebind.RebindTestFixture.rebind(RebindTestFixture.java:258)
	at org.apache.brooklyn.camp.brooklyn.AbstractYamlRebindTest.rebind(AbstractYamlRebindTest.java:86)
	at org.apache.brooklyn.camp.brooklyn.catalog.CatalogYamlRebindTest.runRebindWithCatalogAndApp(CatalogYamlRebindTest.java:208)
	at org.apache.brooklyn.camp.brooklyn.catalog.CatalogYamlRebindTest.testRebindWithCatalogPropertiesForDeprecationAndEnablementAbsent(CatalogYamlRebindTest.java:123)


Results :

Failed tests: 
  CatalogYamlRebindTest.testRebindWithCatalogPropertiesForDeprecationAndEnablementAbsent:123->runRebindWithCatalogAndApp:208->AbstractYamlRebindTest.rebind:86->RebindTestFixture.rebind:258
ยป InvalidPath

Tests run: 221, Failures: 1, Errors: 0, Skipped: 0

[JENKINS] Recording test results
[JENKINS] Archiving disabled
[INFO]                                                                         
[INFO] ------------------------------------------------------------------------
[INFO] Skipping Brooklyn REST Server
[INFO] This project has been banned from the build due to previous failures.
[INFO] ------------------------------------------------------------------------
[INFO]                                                                         
[INFO] ------------------------------------------------------------------------
[INFO] Skipping Brooklyn REST JavaScript Web GUI
[INFO] This project has been banned from the build due to previous failures.
[INFO] ------------------------------------------------------------------------
[INFO]                                                                         
[INFO] ------------------------------------------------------------------------
[INFO] Skipping Brooklyn Launcher
[INFO] This project has been banned from the build due to previous failures.
[INFO] ------------------------------------------------------------------------
[INFO]                                                                         
[INFO] ------------------------------------------------------------------------
[INFO] Skipping Brooklyn Command Line Interface
[INFO] This project has been banned from the build due to previous failures.
[INFO] ------------------------------------------------------------------------
[INFO]                                                                         
[INFO] ------------------------------------------------------------------------
[INFO] Skipping Brooklyn All Things
[INFO] This project has been banned from the build due to previous failures.
[INFO] ------------------------------------------------------------------------
[INFO]                                                                         
[INFO] ------------------------------------------------------------------------
[INFO] Skipping Brooklyn Simple Web Cluster Example
[INFO] This project has been banned from the build due to previous failures.
[INFO] ------------------------------------------------------------------------
[INFO]                                                                         
[INFO] ------------------------------------------------------------------------
[INFO] Skipping Brooklyn Global Web Fabric Example
[INFO] This project has been banned from the build due to previous failures.
[INFO] ------------------------------------------------------------------------
[INFO]                                                                         
[INFO] ------------------------------------------------------------------------
[INFO] Skipping Brooklyn Simple Messaging Publish-Subscribe Example
[INFO] This project has been banned from the build due to previous failures.
[INFO] ------------------------------------------------------------------------
[INFO]                                                                         
[INFO] ------------------------------------------------------------------------
[INFO] Skipping Brooklyn NoSQL Cluster Examples
[INFO] This project has been banned from the build due to previous failures.
[INFO] ------------------------------------------------------------------------
[INFO]                                                                         
[INFO] ------------------------------------------------------------------------
[INFO] Skipping Brooklyn Distribution
[INFO] This project has been banned from the build due to previous failures.
[INFO] ------------------------------------------------------------------------
[INFO]                                                                         
[INFO] ------------------------------------------------------------------------
[INFO] Skipping Brooklyn QA
[INFO] This project has been banned from the build due to previous failures.
[INFO] ------------------------------------------------------------------------
[INFO]                                                                         
[INFO] ------------------------------------------------------------------------
[INFO] Skipping Brooklyn REST Client
[INFO] This project has been banned from the build due to previous failures.
[INFO] ------------------------------------------------------------------------
[INFO] ------------------------------------------------------------------------
[INFO] Reactor Summary:
[INFO] 
[INFO] Brooklyn Root ..................................... SUCCESS [13.099s]
[INFO] Brooklyn Parent Project ........................... SUCCESS [12.054s]
[INFO] Brooklyn Logback Configuration .................... SUCCESS [10.716s]
[INFO] Brooklyn Test Support Utilities ................... SUCCESS [9.100s]
[INFO] Brooklyn Logback Includable Configuration ......... SUCCESS [3.148s]
[INFO] Brooklyn Common Utilities ......................... SUCCESS [30.372s]
[INFO] Brooklyn API ...................................... SUCCESS [5.613s]
[INFO] Brooklyn Test Support ............................. SUCCESS [3.437s]
[INFO] CAMP Server Parent Project ........................ SUCCESS [0.472s]
[INFO] CAMP Base ......................................... SUCCESS [6.613s]
[INFO] Brooklyn Groovy Utilities ......................... SUCCESS [12.150s]
[INFO] Brooklyn Core ..................................... SUCCESS [4:34.979s]
[INFO] Brooklyn Policies ................................. SUCCESS [1:50.864s]
[INFO] Brooklyn Jclouds Location Targets ................. SUCCESS [1:00.027s]
[INFO] Brooklyn Secure JMXMP Agent ....................... SUCCESS [15.694s]
[INFO] Brooklyn JMX RMI Agent ............................ SUCCESS [2.953s]
[INFO] Brooklyn Software Base ............................ SUCCESS [1:28.806s]
[INFO] Brooklyn Web App Software Entities ................ SUCCESS [2:13.236s]
[INFO] Brooklyn Database Software Entities ............... SUCCESS [12.834s]
[INFO] Brooklyn NoSQL Data Store Software Entities ....... SUCCESS [40.873s]
[INFO] Brooklyn CAMP REST API ............................ FAILURE [5:17.226s]
[INFO] Brooklyn REST Server .............................. SKIPPED
[INFO] Brooklyn REST JavaScript Web GUI .................. SKIPPED
[INFO] Brooklyn Launcher ................................. SKIPPED
[INFO] Brooklyn Command Line Interface ................... SKIPPED
[INFO] Brooklyn All Things ............................... SKIPPED
[INFO] Brooklyn Simple Web Cluster Example ............... SKIPPED
[INFO] Brooklyn Global Web Fabric Example ................ SKIPPED
[INFO] Brooklyn Simple Messaging Publish-Subscribe Example  SKIPPED
[INFO] Brooklyn NoSQL Cluster Examples ................... SKIPPED
[INFO] Brooklyn Distribution ............................. SKIPPED
[INFO] Brooklyn QA ....................................... SKIPPED
[INFO] Brooklyn REST Client .............................. SKIPPED
[INFO] ------------------------------------------------------------------------
[INFO] BUILD FAILURE
[INFO] ------------------------------------------------------------------------
[INFO] Total time: 19:41.009s
[INFO] Finished at: Wed Oct 14 23:07:47 BST 2015
[INFO] Final Memory: 61M/239M
[INFO] ------------------------------------------------------------------------
[JENKINS] Archiving disabled
[JENKINS] Archiving disabled
[JENKINS] Archiving disabled
[JENKINS] Archiving disabled
[JENKINS] Archiving disabled
[JENKINS] Archiving disabled
[JENKINS] Archiving disabled
[JENKINS] Archiving disabled
[JENKINS] Archiving disabled
[JENKINS] Archiving disabled
[JENKINS] Archiving disabled
[JENKINS] Archiving disabled
[JENKINS] Archiving disabled
[JENKINS] Archiving disabled
[JENKINS] Archiving disabled
[JENKINS] Archiving disabled
[JENKINS] Archiving disabled
[JENKINS] Archiving disabled
[JENKINS] Archiving disabled
[JENKINS] Archiving disabled
[JENKINS] Archiving disabled
[JENKINS] Archiving disabled
[JENKINS] Archiving disabled
[JENKINS] Archiving disabled
[JENKINS] Archiving disabled
[JENKINS] Archiving disabled
[JENKINS] Archiving disabled
[JENKINS] Archiving disabled
[JENKINS] Archiving disabled
[JENKINS] Archiving disabled
[JENKINS] Archiving disabled
[JENKINS] Archiving disabled
[JENKINS] Archiving disabled
Waiting for Jenkins to finish collecting data
[ERROR] Failed to execute goal org.apache.maven.plugins:maven-surefire-plugin:2.18.1:test
(default-test) on project brooklyn-camp: There are test failures.
[ERROR] 
[ERROR] Please refer to F:\hudson\hudson-slave\workspace\incubator-brooklyn-master-windows\usage\camp\target\surefire-reports
for the individual test results.
[ERROR] -> [Help 1]
[ERROR] 
[ERROR] To see the full stack trace of the errors, re-run Maven with the -e switch.
[ERROR] Re-run Maven using the -X switch to enable full debug logging.
[ERROR] 
[ERROR] For more information about the errors and possible solutions, please read the following
articles:
[ERROR] [Help 1] http://cwiki.apache.org/confluence/display/MAVEN/MojoFailureException
[ERROR] 
[ERROR] After correcting the problems, you can resume the build with the command
[ERROR]   mvn <goals> -rf :brooklyn-camp
channel stopped

Mime
View raw message