brooklyn-dev mailing list archives

Site index · List index
Message view « Date » · « Thread »
Top « Date » · « Thread »
From Apache Jenkins Server <jenk...@builds.apache.org>
Subject Build failed in Jenkins: incubator-brooklyn-master-integration #242
Date Tue, 27 Oct 2015 15:37:55 GMT
See <https://builds.apache.org/job/incubator-brooklyn-master-integration/242/changes>

Changes:

[alex.heneveld] Introduce relationships between brooklyn objects

[alex.heneveld] address most review comments on relations

[alex.heneveld] remove generics on BrooklynObject internal hierarchy

[alex.heneveld] refer to RelationshipType rather than Relationship

[alex.heneveld] ensure all CatalogItem impls give no-op relations, and misc cleanup

------------------------------------------
[...truncated 3187 lines...]
Downloading: http://repo.maven.apache.org/maven2/org/codehaus/codehaus-parent/3/codehaus-parent-3.pom
Downloaded: http://repo.maven.apache.org/maven2/org/codehaus/codehaus-parent/3/codehaus-parent-3.pom
(5 KB at 573.0 KB/sec)
Downloading: http://repo.maven.apache.org/maven2/xmlpull/xmlpull/1.1.3.1/xmlpull-1.1.3.1.pom
Downloaded: http://repo.maven.apache.org/maven2/xmlpull/xmlpull/1.1.3.1/xmlpull-1.1.3.1.pom
(386 B at 47.1 KB/sec)
Downloading: http://repo.maven.apache.org/maven2/xpp3/xpp3_min/1.1.4c/xpp3_min-1.1.4c.pom
Downloaded: http://repo.maven.apache.org/maven2/xpp3/xpp3_min/1.1.4c/xpp3_min-1.1.4c.pom (2
KB at 196.5 KB/sec)
Downloading: http://repo.maven.apache.org/maven2/org/codehaus/jackson/jackson-mapper-asl/1.9.13/jackson-mapper-asl-1.9.13.pom
Downloaded: http://repo.maven.apache.org/maven2/org/codehaus/jackson/jackson-mapper-asl/1.9.13/jackson-mapper-asl-1.9.13.pom
(2 KB at 210.1 KB/sec)
Downloading: http://repo.maven.apache.org/maven2/org/codehaus/jackson/jackson-core-asl/1.9.13/jackson-core-asl-1.9.13.pom
Downloaded: http://repo.maven.apache.org/maven2/org/codehaus/jackson/jackson-core-asl/1.9.13/jackson-core-asl-1.9.13.pom
(2 KB at 178.4 KB/sec)
Downloading: http://repo.maven.apache.org/maven2/com/google/code/gson/gson/2.3/gson-2.3.pom
Downloaded: http://repo.maven.apache.org/maven2/com/google/code/gson/gson/2.3/gson-2.3.pom
(9 KB at 973.7 KB/sec)
Downloading: http://repo.maven.apache.org/maven2/org/apache/httpcomponents/httpclient/4.4.1/httpclient-4.4.1.pom
Downloaded: http://repo.maven.apache.org/maven2/org/apache/httpcomponents/httpclient/4.4.1/httpclient-4.4.1.pom
(7 KB at 780.4 KB/sec)
Downloading: http://repo.maven.apache.org/maven2/org/apache/httpcomponents/httpcomponents-client/4.4.1/httpcomponents-client-4.4.1.pom
Downloaded: http://repo.maven.apache.org/maven2/org/apache/httpcomponents/httpcomponents-client/4.4.1/httpcomponents-client-4.4.1.pom
(16 KB at 1912.5 KB/sec)
Downloading: http://repo.maven.apache.org/maven2/org/apache/httpcomponents/httpcore/4.4.1/httpcore-4.4.1.pom
Downloaded: http://repo.maven.apache.org/maven2/org/apache/httpcomponents/httpcore/4.4.1/httpcore-4.4.1.pom
(5 KB at 641.2 KB/sec)
Downloading: http://repo.maven.apache.org/maven2/org/apache/httpcomponents/httpcomponents-core/4.4.1/httpcomponents-core-4.4.1.pom
Downloaded: http://repo.maven.apache.org/maven2/org/apache/httpcomponents/httpcomponents-core/4.4.1/httpcomponents-core-4.4.1.pom
(13 KB at 1793.9 KB/sec)
Downloading: http://repo.maven.apache.org/maven2/commons-logging/commons-logging/1.2/commons-logging-1.2.pom
Downloaded: http://repo.maven.apache.org/maven2/commons-logging/commons-logging/1.2/commons-logging-1.2.pom
(19 KB at 2344.5 KB/sec)
Downloading: http://repo.maven.apache.org/maven2/commons-codec/commons-codec/1.9/commons-codec-1.9.pom
Downloaded: http://repo.maven.apache.org/maven2/commons-codec/commons-codec/1.9/commons-codec-1.9.pom
(12 KB at 1252.5 KB/sec)
Downloading: http://repo.maven.apache.org/maven2/org/apache/commons/commons-parent/32/commons-parent-32.pom
Downloaded: http://repo.maven.apache.org/maven2/org/apache/commons/commons-parent/32/commons-parent-32.pom
(52 KB at 5154.6 KB/sec)
Downloading: http://repo.maven.apache.org/maven2/org/bouncycastle/bcprov-ext-jdk15on/1.49/bcprov-ext-jdk15on-1.49.pom
Downloaded: http://repo.maven.apache.org/maven2/org/bouncycastle/bcprov-ext-jdk15on/1.49/bcprov-ext-jdk15on-1.49.pom
(2 KB at 119.9 KB/sec)
Downloading: http://repo.maven.apache.org/maven2/org/bouncycastle/bcpkix-jdk15on/1.49/bcpkix-jdk15on-1.49.pom
Downloaded: http://repo.maven.apache.org/maven2/org/bouncycastle/bcpkix-jdk15on/1.49/bcpkix-jdk15on-1.49.pom
(2 KB at 147.1 KB/sec)
Downloading: http://repo.maven.apache.org/maven2/org/reflections/reflections/0.9.9-RC1/reflections-0.9.9-RC1.pom
Downloaded: http://repo.maven.apache.org/maven2/org/reflections/reflections/0.9.9-RC1/reflections-0.9.9-RC1.pom
(4 KB at 389.8 KB/sec)
Downloading: http://repo.maven.apache.org/maven2/org/reflections/reflections-parent/0.9.9-RC1/reflections-parent-0.9.9-RC1.pom
Downloaded: http://repo.maven.apache.org/maven2/org/reflections/reflections-parent/0.9.9-RC1/reflections-parent-0.9.9-RC1.pom
(4 KB at 370.3 KB/sec)
Downloading: http://repo.maven.apache.org/maven2/org/javassist/javassist/3.16.1-GA/javassist-3.16.1-GA.pom
Downloaded: http://repo.maven.apache.org/maven2/org/javassist/javassist/3.16.1-GA/javassist-3.16.1-GA.pom
(9 KB at 1103.5 KB/sec)
Downloading: http://repo.maven.apache.org/maven2/dom4j/dom4j/1.6.1/dom4j-1.6.1.pom
Downloaded: http://repo.maven.apache.org/maven2/dom4j/dom4j/1.6.1/dom4j-1.6.1.pom (7 KB at
825.8 KB/sec)
Downloading: http://repo.maven.apache.org/maven2/org/freemarker/freemarker/2.3.22/freemarker-2.3.22.pom
Downloaded: http://repo.maven.apache.org/maven2/org/freemarker/freemarker/2.3.22/freemarker-2.3.22.pom
(2 KB at 147.9 KB/sec)
Downloading: http://repo.maven.apache.org/maven2/com/maxmind/geoip2/geoip2/0.8.1/geoip2-0.8.1.pom
Downloaded: http://repo.maven.apache.org/maven2/com/maxmind/geoip2/geoip2/0.8.1/geoip2-0.8.1.pom
(7 KB at 662.4 KB/sec)
Downloading: http://repo.maven.apache.org/maven2/com/maxmind/db/maxmind-db/0.3.4/maxmind-db-0.3.4.pom
Downloaded: http://repo.maven.apache.org/maven2/com/maxmind/db/maxmind-db/0.3.4/maxmind-db-0.3.4.pom
(5 KB at 712.6 KB/sec)
Downloading: http://repo.maven.apache.org/maven2/com/fasterxml/jackson/core/jackson-databind/2.4.2/jackson-databind-2.4.2.pom
Downloaded: http://repo.maven.apache.org/maven2/com/fasterxml/jackson/core/jackson-databind/2.4.2/jackson-databind-2.4.2.pom
(6 KB at 617.0 KB/sec)
Downloading: http://repo.maven.apache.org/maven2/com/fasterxml/jackson/jackson-parent/2.4/jackson-parent-2.4.pom
Downloaded: http://repo.maven.apache.org/maven2/com/fasterxml/jackson/jackson-parent/2.4/jackson-parent-2.4.pom
(7 KB at 775.8 KB/sec)
Downloading: http://repo.maven.apache.org/maven2/com/fasterxml/oss-parent/16/oss-parent-16.pom
Downloaded: http://repo.maven.apache.org/maven2/com/fasterxml/oss-parent/16/oss-parent-16.pom
(19 KB at 2617.7 KB/sec)
Downloading: http://repo.maven.apache.org/maven2/com/fasterxml/jackson/core/jackson-annotations/2.4.0/jackson-annotations-2.4.0.pom
Downloaded: http://repo.maven.apache.org/maven2/com/fasterxml/jackson/core/jackson-annotations/2.4.0/jackson-annotations-2.4.0.pom
(2 KB at 148.8 KB/sec)
Downloading: http://repo.maven.apache.org/maven2/com/fasterxml/jackson/core/jackson-core/2.4.2/jackson-core-2.4.2.pom
Downloaded: http://repo.maven.apache.org/maven2/com/fasterxml/jackson/core/jackson-core/2.4.2/jackson-core-2.4.2.pom
(5 KB at 588.3 KB/sec)
Downloading: http://repo.maven.apache.org/maven2/com/google/http-client/google-http-client/1.18.0-rc/google-http-client-1.18.0-rc.pom
Downloaded: http://repo.maven.apache.org/maven2/com/google/http-client/google-http-client/1.18.0-rc/google-http-client-1.18.0-rc.pom
(6 KB at 557.6 KB/sec)
Downloading: http://repo.maven.apache.org/maven2/com/google/http-client/google-http-client-parent/1.18.0-rc/google-http-client-parent-1.18.0-rc.pom
Downloaded: http://repo.maven.apache.org/maven2/com/google/http-client/google-http-client-parent/1.18.0-rc/google-http-client-parent-1.18.0-rc.pom
(23 KB at 2797.7 KB/sec)
Downloading: http://repo.maven.apache.org/maven2/mx4j/mx4j-tools/3.0.1/mx4j-tools-3.0.1.pom
Downloaded: http://repo.maven.apache.org/maven2/mx4j/mx4j-tools/3.0.1/mx4j-tools-3.0.1.pom
(155 B at 18.9 KB/sec)
Downloading: http://repo.maven.apache.org/maven2/com/google/mockwebserver/mockwebserver/20121111/mockwebserver-20121111.pom
Downloaded: http://repo.maven.apache.org/maven2/com/google/mockwebserver/mockwebserver/20121111/mockwebserver-20121111.pom
(4 KB at 367.1 KB/sec)
Downloading: http://repo.maven.apache.org/maven2/org/eclipse/jetty/jetty-webapp/8.1.17.v20150415/jetty-webapp-8.1.17.v20150415.pom
Downloaded: http://repo.maven.apache.org/maven2/org/eclipse/jetty/jetty-webapp/8.1.17.v20150415/jetty-webapp-8.1.17.v20150415.pom
(4 KB at 426.9 KB/sec)
Downloading: http://repo.maven.apache.org/maven2/org/eclipse/jetty/jetty-project/8.1.17.v20150415/jetty-project-8.1.17.v20150415.pom
Downloaded: http://repo.maven.apache.org/maven2/org/eclipse/jetty/jetty-project/8.1.17.v20150415/jetty-project-8.1.17.v20150415.pom
(28 KB at 2788.7 KB/sec)
Downloading: http://repo.maven.apache.org/maven2/org/eclipse/jetty/jetty-parent/20/jetty-parent-20.pom
Downloaded: http://repo.maven.apache.org/maven2/org/eclipse/jetty/jetty-parent/20/jetty-parent-20.pom
(21 KB at 2957.2 KB/sec)
Downloading: http://repo.maven.apache.org/maven2/org/eclipse/jetty/jetty-xml/8.1.17.v20150415/jetty-xml-8.1.17.v20150415.pom
Downloaded: http://repo.maven.apache.org/maven2/org/eclipse/jetty/jetty-xml/8.1.17.v20150415/jetty-xml-8.1.17.v20150415.pom
(2 KB at 176.7 KB/sec)
Downloading: http://repo.maven.apache.org/maven2/org/eclipse/jetty/jetty-util/8.1.17.v20150415/jetty-util-8.1.17.v20150415.pom
Downloaded: http://repo.maven.apache.org/maven2/org/eclipse/jetty/jetty-util/8.1.17.v20150415/jetty-util-8.1.17.v20150415.pom
(4 KB at 419.2 KB/sec)
Downloading: http://repo.maven.apache.org/maven2/org/eclipse/jetty/jetty-servlet/8.1.17.v20150415/jetty-servlet-8.1.17.v20150415.pom
Downloaded: http://repo.maven.apache.org/maven2/org/eclipse/jetty/jetty-servlet/8.1.17.v20150415/jetty-servlet-8.1.17.v20150415.pom
(3 KB at 332.9 KB/sec)
Downloading: http://repo.maven.apache.org/maven2/org/eclipse/jetty/jetty-security/8.1.17.v20150415/jetty-security-8.1.17.v20150415.pom
Downloaded: http://repo.maven.apache.org/maven2/org/eclipse/jetty/jetty-security/8.1.17.v20150415/jetty-security-8.1.17.v20150415.pom
(3 KB at 338.3 KB/sec)
Downloading: http://repo.maven.apache.org/maven2/org/eclipse/jetty/jetty-server/8.1.17.v20150415/jetty-server-8.1.17.v20150415.pom
Downloaded: http://repo.maven.apache.org/maven2/org/eclipse/jetty/jetty-server/8.1.17.v20150415/jetty-server-8.1.17.v20150415.pom
(4 KB at 461.4 KB/sec)
Downloading: http://repo.maven.apache.org/maven2/org/eclipse/jetty/orbit/javax.servlet/3.0.0.v201112011016/javax.servlet-3.0.0.v201112011016.pom
Downloaded: http://repo.maven.apache.org/maven2/org/eclipse/jetty/orbit/javax.servlet/3.0.0.v201112011016/javax.servlet-3.0.0.v201112011016.pom
(732 B at 89.4 KB/sec)
Downloading: http://repo.maven.apache.org/maven2/org/eclipse/jetty/orbit/jetty-orbit/1/jetty-orbit-1.pom
Downloaded: http://repo.maven.apache.org/maven2/org/eclipse/jetty/orbit/jetty-orbit/1/jetty-orbit-1.pom
(3 KB at 312.1 KB/sec)
Downloading: http://repo.maven.apache.org/maven2/org/eclipse/jetty/jetty-parent/18/jetty-parent-18.pom
Downloaded: http://repo.maven.apache.org/maven2/org/eclipse/jetty/jetty-parent/18/jetty-parent-18.pom
(17 KB at 2301.3 KB/sec)
Downloading: http://repo.maven.apache.org/maven2/org/eclipse/jetty/jetty-continuation/8.1.17.v20150415/jetty-continuation-8.1.17.v20150415.pom
Downloaded: http://repo.maven.apache.org/maven2/org/eclipse/jetty/jetty-continuation/8.1.17.v20150415/jetty-continuation-8.1.17.v20150415.pom
(3 KB at 333.9 KB/sec)
Downloading: http://repo.maven.apache.org/maven2/org/eclipse/jetty/jetty-http/8.1.17.v20150415/jetty-http-8.1.17.v20150415.pom
Downloaded: http://repo.maven.apache.org/maven2/org/eclipse/jetty/jetty-http/8.1.17.v20150415/jetty-http-8.1.17.v20150415.pom
(3 KB at 322.4 KB/sec)
Downloading: http://repo.maven.apache.org/maven2/org/eclipse/jetty/jetty-io/8.1.17.v20150415/jetty-io-8.1.17.v20150415.pom
Downloaded: http://repo.maven.apache.org/maven2/org/eclipse/jetty/jetty-io/8.1.17.v20150415/jetty-io-8.1.17.v20150415.pom
(3 KB at 232.9 KB/sec)
Downloading: http://repo.maven.apache.org/maven2/com/jayway/jsonpath/json-path/2.0.0/json-path-2.0.0.pom
Downloaded: http://repo.maven.apache.org/maven2/com/jayway/jsonpath/json-path/2.0.0/json-path-2.0.0.pom
(2 KB at 278.6 KB/sec)
Downloading: http://repo.maven.apache.org/maven2/net/minidev/json-smart/2.1.1/json-smart-2.1.1.pom
Downloaded: http://repo.maven.apache.org/maven2/net/minidev/json-smart/2.1.1/json-smart-2.1.1.pom
(3 KB at 239.5 KB/sec)
Downloading: http://repo.maven.apache.org/maven2/net/minidev/parent/2.1.0/parent-2.1.0.pom
Downloaded: http://repo.maven.apache.org/maven2/net/minidev/parent/2.1.0/parent-2.1.0.pom
(9 KB at 937.1 KB/sec)
Downloading: http://repo.maven.apache.org/maven2/net/minidev/asm/1.0.2/asm-1.0.2.pom
Downloaded: http://repo.maven.apache.org/maven2/net/minidev/asm/1.0.2/asm-1.0.2.pom (2 KB
at 218.3 KB/sec)
Downloading: http://repo.maven.apache.org/maven2/asm/asm/3.3.1/asm-3.3.1.pom
Downloaded: http://repo.maven.apache.org/maven2/asm/asm/3.3.1/asm-3.3.1.pom (266 B at 37.1
KB/sec)
Downloading: http://repo.maven.apache.org/maven2/asm/asm-parent/3.3.1/asm-parent-3.3.1.pom
Downloaded: http://repo.maven.apache.org/maven2/asm/asm-parent/3.3.1/asm-parent-3.3.1.pom
(5 KB at 604.4 KB/sec)
Downloading: http://repository.apache.org/snapshots/org/apache/brooklyn/brooklyn-rt-felix/0.9.0-SNAPSHOT/brooklyn-rt-felix-0.9.0-SNAPSHOT.jar
Downloading: http://repository.apache.org/snapshots/org/apache/brooklyn/brooklyn-rt-osgi/0.9.0-SNAPSHOT/brooklyn-rt-osgi-0.9.0-SNAPSHOT-tests.jar
Downloading: http://repo.maven.apache.org/maven2/net/schmizz/sshj/0.8.1/sshj-0.8.1.jar
Downloading: http://repo.maven.apache.org/maven2/com/thoughtworks/xstream/xstream/1.4.7/xstream-1.4.7.jar
Downloading: http://repo.maven.apache.org/maven2/xmlpull/xmlpull/1.1.3.1/xmlpull-1.1.3.1.jar
Downloading: http://repo.maven.apache.org/maven2/xpp3/xpp3_min/1.1.4c/xpp3_min-1.1.4c.jar
Downloading: http://repo.maven.apache.org/maven2/org/codehaus/jackson/jackson-mapper-asl/1.9.13/jackson-mapper-asl-1.9.13.jar
Downloaded: http://repo.maven.apache.org/maven2/net/schmizz/sshj/0.8.1/sshj-0.8.1.jar (342
KB at 14840.6 KB/sec)
Downloading: http://repo.maven.apache.org/maven2/com/google/code/gson/gson/2.3/gson-2.3.jar
Downloaded: http://repo.maven.apache.org/maven2/com/thoughtworks/xstream/xstream/1.4.7/xstream-1.4.7.jar
(520 KB at 19226.4 KB/sec)
Downloaded: http://repo.maven.apache.org/maven2/xpp3/xpp3_min/1.1.4c/xpp3_min-1.1.4c.jar (25
KB at 1015.5 KB/sec)
Downloading: http://repo.maven.apache.org/maven2/org/apache/httpcomponents/httpclient/4.4.1/httpclient-4.4.1.jar
Downloaded: http://repo.maven.apache.org/maven2/xmlpull/xmlpull/1.1.3.1/xmlpull-1.1.3.1.jar
(8 KB at 260.0 KB/sec)
Downloading: http://repo.maven.apache.org/maven2/commons-logging/commons-logging/1.2/commons-logging-1.2.jar
Downloading: http://repo.maven.apache.org/maven2/commons-codec/commons-codec/1.9/commons-codec-1.9.jar
Downloaded: http://repo.maven.apache.org/maven2/org/codehaus/jackson/jackson-mapper-asl/1.9.13/jackson-mapper-asl-1.9.13.jar
(763 KB at 19547.9 KB/sec)
Downloading: http://repo.maven.apache.org/maven2/org/bouncycastle/bcprov-ext-jdk15on/1.49/bcprov-ext-jdk15on-1.49.jar
Downloaded: http://repo.maven.apache.org/maven2/commons-codec/commons-codec/1.9/commons-codec-1.9.jar
(258 KB at 15163.4 KB/sec)
Downloading: http://repo.maven.apache.org/maven2/org/bouncycastle/bcpkix-jdk15on/1.49/bcpkix-jdk15on-1.49.jar
Downloaded: http://repo.maven.apache.org/maven2/com/google/code/gson/gson/2.3/gson-2.3.jar
(203 KB at 7769.4 KB/sec)
Downloading: http://repo.maven.apache.org/maven2/org/reflections/reflections/0.9.9-RC1/reflections-0.9.9-RC1.jar
Downloaded: http://repo.maven.apache.org/maven2/commons-logging/commons-logging/1.2/commons-logging-1.2.jar
(61 KB at 3019.0 KB/sec)
Downloading: http://repo.maven.apache.org/maven2/org/javassist/javassist/3.16.1-GA/javassist-3.16.1-GA.jar
Downloaded: http://repo.maven.apache.org/maven2/org/apache/httpcomponents/httpclient/4.4.1/httpclient-4.4.1.jar
(705 KB at 26075.3 KB/sec)
Downloading: http://repo.maven.apache.org/maven2/dom4j/dom4j/1.6.1/dom4j-1.6.1.jar
Downloaded: http://repo.maven.apache.org/maven2/org/reflections/reflections/0.9.9-RC1/reflections-0.9.9-RC1.jar
(119 KB at 10743.3 KB/sec)
Downloading: http://repo.maven.apache.org/maven2/org/freemarker/freemarker/2.3.22/freemarker-2.3.22.jar
Downloaded: http://repo.maven.apache.org/maven2/dom4j/dom4j/1.6.1/dom4j-1.6.1.jar (307 KB
at 16133.7 KB/sec)
Downloading: http://repo.maven.apache.org/maven2/org/apache/httpcomponents/httpcore/4.4.1/httpcore-4.4.1.jar
Downloaded: http://repo.maven.apache.org/maven2/org/javassist/javassist/3.16.1-GA/javassist-3.16.1-GA.jar
(644 KB at 27995.2 KB/sec)
Downloading: http://repo.maven.apache.org/maven2/org/codehaus/jackson/jackson-core-asl/1.9.13/jackson-core-asl-1.9.13.jar
Downloaded: http://repo.maven.apache.org/maven2/org/bouncycastle/bcpkix-jdk15on/1.49/bcpkix-jdk15on-1.49.jar
(615 KB at 19835.6 KB/sec)
Downloading: http://repo.maven.apache.org/maven2/com/maxmind/geoip2/geoip2/0.8.1/geoip2-0.8.1.jar
Downloaded: http://repo.maven.apache.org/maven2/com/maxmind/geoip2/geoip2/0.8.1/geoip2-0.8.1.jar
(35 KB at 3181.3 KB/sec)
Downloading: http://repo.maven.apache.org/maven2/com/maxmind/db/maxmind-db/0.3.4/maxmind-db-0.3.4.jar
Downloaded: http://repo.maven.apache.org/maven2/org/codehaus/jackson/jackson-core-asl/1.9.13/jackson-core-asl-1.9.13.jar
(227 KB at 11340.2 KB/sec)
Downloading: http://repo.maven.apache.org/maven2/com/google/http-client/google-http-client/1.18.0-rc/google-http-client-1.18.0-rc.jar
Downloaded: http://repo.maven.apache.org/maven2/org/freemarker/freemarker/2.3.22/freemarker-2.3.22.jar
(1271 KB at 33421.2 KB/sec)
Downloading: http://repo.maven.apache.org/maven2/com/fasterxml/jackson/core/jackson-databind/2.4.2/jackson-databind-2.4.2.jar
Downloaded: http://repo.maven.apache.org/maven2/com/maxmind/db/maxmind-db/0.3.4/maxmind-db-0.3.4.jar
(17 KB at 1883.0 KB/sec)
Downloading: http://repo.maven.apache.org/maven2/com/fasterxml/jackson/core/jackson-annotations/2.4.0/jackson-annotations-2.4.0.jar
Downloaded: http://repo.maven.apache.org/maven2/org/apache/httpcomponents/httpcore/4.4.1/httpcore-4.4.1.jar
(315 KB at 12103.1 KB/sec)
Downloading: http://repo.maven.apache.org/maven2/com/fasterxml/jackson/core/jackson-core/2.4.2/jackson-core-2.4.2.jar
Downloaded: http://repo.maven.apache.org/maven2/com/fasterxml/jackson/core/jackson-annotations/2.4.0/jackson-annotations-2.4.0.jar
(38 KB at 4188.9 KB/sec)
Downloading: http://repo.maven.apache.org/maven2/mx4j/mx4j-tools/3.0.1/mx4j-tools-3.0.1.jar
Downloaded: http://repo.maven.apache.org/maven2/com/google/http-client/google-http-client/1.18.0-rc/google-http-client-1.18.0-rc.jar
(265 KB at 15576.1 KB/sec)
Downloading: http://repo.maven.apache.org/maven2/com/google/mockwebserver/mockwebserver/20121111/mockwebserver-20121111.jar
Downloaded: http://repo.maven.apache.org/maven2/com/fasterxml/jackson/core/jackson-core/2.4.2/jackson-core-2.4.2.jar
(221 KB at 9566.7 KB/sec)
Downloading: http://repo.maven.apache.org/maven2/org/eclipse/jetty/jetty-webapp/8.1.17.v20150415/jetty-webapp-8.1.17.v20150415.jar
Downloaded: http://repo.maven.apache.org/maven2/com/google/mockwebserver/mockwebserver/20121111/mockwebserver-20121111.jar
(24 KB at 1541.5 KB/sec)
Downloading: http://repo.maven.apache.org/maven2/org/eclipse/jetty/jetty-xml/8.1.17.v20150415/jetty-xml-8.1.17.v20150415.jar
Downloaded: http://repo.maven.apache.org/maven2/com/fasterxml/jackson/core/jackson-databind/2.4.2/jackson-databind-2.4.2.jar
(1051 KB at 31834.7 KB/sec)
Downloading: http://repo.maven.apache.org/maven2/org/eclipse/jetty/jetty-servlet/8.1.17.v20150415/jetty-servlet-8.1.17.v20150415.jar
Downloaded: http://repo.maven.apache.org/maven2/org/eclipse/jetty/jetty-webapp/8.1.17.v20150415/jetty-webapp-8.1.17.v20150415.jar
(108 KB at 9774.8 KB/sec)
Downloading: http://repo.maven.apache.org/maven2/org/eclipse/jetty/jetty-security/8.1.17.v20150415/jetty-security-8.1.17.v20150415.jar
Downloaded: http://repo.maven.apache.org/maven2/mx4j/mx4j-tools/3.0.1/mx4j-tools-3.0.1.jar
(486 KB at 17334.6 KB/sec)
Downloading: http://repo.maven.apache.org/maven2/com/jayway/jsonpath/json-path/2.0.0/json-path-2.0.0.jar
Downloaded: http://repo.maven.apache.org/maven2/org/eclipse/jetty/jetty-xml/8.1.17.v20150415/jetty-xml-8.1.17.v20150415.jar
(39 KB at 3180.4 KB/sec)
Downloading: http://repo.maven.apache.org/maven2/net/minidev/json-smart/2.1.1/json-smart-2.1.1.jar
Downloaded: http://repo.maven.apache.org/maven2/org/eclipse/jetty/jetty-servlet/8.1.17.v20150415/jetty-servlet-8.1.17.v20150415.jar
(100 KB at 6627.0 KB/sec)
Downloading: http://repo.maven.apache.org/maven2/net/minidev/asm/1.0.2/asm-1.0.2.jar
Downloaded: http://repo.maven.apache.org/maven2/net/minidev/json-smart/2.1.1/json-smart-2.1.1.jar
(122 KB at 12199.9 KB/sec)
Downloading: http://repo.maven.apache.org/maven2/asm/asm/3.3.1/asm-3.3.1.jar
Downloaded: http://repo.maven.apache.org/maven2/com/jayway/jsonpath/json-path/2.0.0/json-path-2.0.0.jar
(134 KB at 10258.3 KB/sec)
Downloading: http://repo.maven.apache.org/maven2/org/eclipse/jetty/jetty-server/8.1.17.v20150415/jetty-server-8.1.17.v20150415.jar
Downloaded: http://repo.maven.apache.org/maven2/org/eclipse/jetty/jetty-security/8.1.17.v20150415/jetty-security-8.1.17.v20150415.jar
(88 KB at 4622.9 KB/sec)
Downloading: http://repo.maven.apache.org/maven2/org/eclipse/jetty/orbit/javax.servlet/3.0.0.v201112011016/javax.servlet-3.0.0.v201112011016.jar
Downloaded: http://repo.maven.apache.org/maven2/net/minidev/asm/1.0.2/asm-1.0.2.jar (71 KB
at 7786.1 KB/sec)
Downloading: http://repo.maven.apache.org/maven2/org/eclipse/jetty/jetty-continuation/8.1.17.v20150415/jetty-continuation-8.1.17.v20150415.jar
Downloaded: http://repo.maven.apache.org/maven2/asm/asm/3.3.1/asm-3.3.1.jar (43 KB at 4728.8
KB/sec)
Downloading: http://repo.maven.apache.org/maven2/org/eclipse/jetty/jetty-http/8.1.17.v20150415/jetty-http-8.1.17.v20150415.jar
Downloaded: http://repo.maven.apache.org/maven2/org/bouncycastle/bcprov-ext-jdk15on/1.49/bcprov-ext-jdk15on-1.49.jar
(2493 KB at 21675.0 KB/sec)
Downloading: http://repo.maven.apache.org/maven2/org/eclipse/jetty/jetty-io/8.1.17.v20150415/jetty-io-8.1.17.v20150415.jar
Downloaded: http://repo.maven.apache.org/maven2/org/eclipse/jetty/jetty-continuation/8.1.17.v20150415/jetty-continuation-8.1.17.v20150415.jar
(21 KB at 2583.4 KB/sec)
Downloading: http://repo.maven.apache.org/maven2/org/eclipse/jetty/jetty-util/8.1.17.v20150415/jetty-util-8.1.17.v20150415.jar
Downloaded: http://repo.maven.apache.org/maven2/org/eclipse/jetty/orbit/javax.servlet/3.0.0.v201112011016/javax.servlet-3.0.0.v201112011016.jar
(196 KB at 13046.0 KB/sec)
Downloading: http://repo.maven.apache.org/maven2/org/apache/httpcomponents/httpclient/4.4.1/httpclient-4.4.1-tests.jar
Downloaded: http://repo.maven.apache.org/maven2/org/eclipse/jetty/jetty-http/8.1.17.v20150415/jetty-http-8.1.17.v20150415.jar
(95 KB at 7837.6 KB/sec)
Downloaded: http://repo.maven.apache.org/maven2/org/eclipse/jetty/jetty-io/8.1.17.v20150415/jetty-io-8.1.17.v20150415.jar
(104 KB at 11505.6 KB/sec)
Downloaded: http://repo.maven.apache.org/maven2/org/eclipse/jetty/jetty-server/8.1.17.v20150415/jetty-server-8.1.17.v20150415.jar
(352 KB at 17582.7 KB/sec)
Downloaded: http://repo.maven.apache.org/maven2/org/eclipse/jetty/jetty-util/8.1.17.v20150415/jetty-util-8.1.17.v20150415.jar
(282 KB at 14792.8 KB/sec)
Downloaded: http://repo.maven.apache.org/maven2/org/apache/httpcomponents/httpclient/4.4.1/httpclient-4.4.1-tests.jar
(420 KB at 22090.8 KB/sec)
[INFO] ------------------------------------------------------------------------
[INFO] Reactor Summary:
[INFO] 
[INFO] Brooklyn Root ..................................... SUCCESS [6.947s]
[INFO] Brooklyn Parent Project ........................... SUCCESS [6.913s]
[INFO] Brooklyn Test Support Utilities ................... SUCCESS [9.310s]
[INFO] Brooklyn Logback Includable Configuration ......... SUCCESS [2.807s]
[INFO] Brooklyn Common Utilities ......................... FAILURE [52.252s]
[INFO] Brooklyn API ...................................... SUCCESS [5.198s]
[INFO] Brooklyn Test Support ............................. SUCCESS [4.448s]
[INFO] Brooklyn OSGi Utils ............................... SUCCESS [4.623s]
[INFO] Brooklyn Felix Runtime ............................ FAILURE [0.521s]
[INFO] Brooklyn Groovy Utilities ......................... SUCCESS [3.869s]
[INFO] Brooklyn Core ..................................... FAILURE [1.609s]
[INFO] ------------------------------------------------------------------------
[INFO] BUILD FAILURE
[INFO] ------------------------------------------------------------------------
[INFO] Total time: 2:31.619s
[INFO] Finished at: Tue Oct 27 15:38:17 UTC 2015
[INFO] Final Memory: 54M/247M
[INFO] ------------------------------------------------------------------------
Waiting for Jenkins to finish collecting data
[ERROR] Failed to execute goal org.apache.maven.plugins:maven-surefire-plugin:2.18.1:test
(default-test) on project brooklyn-utils-common: There are test failures.
[ERROR] 
[ERROR] Please refer to <https://builds.apache.org/job/incubator-brooklyn-master-integration/ws/utils/common/target/surefire-reports>
for the individual test results.
[ERROR] -> [Help 1]
[ERROR] Failed to execute goal on project brooklyn-rt-felix: Could not resolve dependencies
for project org.apache.brooklyn:brooklyn-rt-felix:jar:0.9.0-SNAPSHOT: Could not find artifact
org.apache.brooklyn:brooklyn-rt-osgi:jar:tests:0.9.0-SNAPSHOT in Nexus (http://repository.apache.org/snapshots)
-> [Help 2]
[ERROR] Failed to execute goal on project brooklyn-core: Could not resolve dependencies for
project org.apache.brooklyn:brooklyn-core:jar:0.9.0-SNAPSHOT: The following artifacts could
not be resolved: org.apache.brooklyn:brooklyn-rt-felix:jar:0.9.0-SNAPSHOT, org.apache.brooklyn:brooklyn-rt-osgi:jar:tests:0.9.0-SNAPSHOT:
Could not find artifact org.apache.brooklyn:brooklyn-rt-felix:jar:0.9.0-SNAPSHOT in Nexus
(http://repository.apache.org/snapshots) -> [Help 2]
[ERROR] 
[ERROR] To see the full stack trace of the errors, re-run Maven with the -e switch.
[ERROR] Re-run Maven using the -X switch to enable full debug logging.
[ERROR] 
[ERROR] For more information about the errors and possible solutions, please read the following
articles:
[ERROR] [Help 1] http://cwiki.apache.org/confluence/display/MAVEN/MojoFailureException
[ERROR] [Help 2] http://cwiki.apache.org/confluence/display/MAVEN/DependencyResolutionException
[ERROR] 
[ERROR] After correcting the problems, you can resume the build with the command
[ERROR]   mvn <goals> -rf :brooklyn-utils-common
[JENKINS] Archiving <https://builds.apache.org/job/incubator-brooklyn-master-integration/ws/core/pom.xml>
to org.apache.brooklyn/brooklyn-core/0.9.0-SNAPSHOT/brooklyn-core-0.9.0-SNAPSHOT.pom
[JENKINS] Archiving <https://builds.apache.org/job/incubator-brooklyn-master-integration/ws/utils/groovy/pom.xml>
to org.apache.brooklyn/brooklyn-utils-groovy/0.9.0-SNAPSHOT/brooklyn-utils-groovy-0.9.0-SNAPSHOT.pom
[JENKINS] Archiving <https://builds.apache.org/job/incubator-brooklyn-master-integration/ws/utils/groovy/target/brooklyn-utils-groovy-0.9.0-SNAPSHOT.jar>
to org.apache.brooklyn/brooklyn-utils-groovy/0.9.0-SNAPSHOT/brooklyn-utils-groovy-0.9.0-SNAPSHOT.jar
[JENKINS] Archiving <https://builds.apache.org/job/incubator-brooklyn-master-integration/ws/utils/groovy/target/brooklyn-utils-groovy-0.9.0-SNAPSHOT-sources.jar>
to org.apache.brooklyn/brooklyn-utils-groovy/0.9.0-SNAPSHOT/brooklyn-utils-groovy-0.9.0-SNAPSHOT-sources.jar
[JENKINS] Archiving <https://builds.apache.org/job/incubator-brooklyn-master-integration/ws/utils/common/pom.xml>
to org.apache.brooklyn/brooklyn-utils-common/0.9.0-SNAPSHOT/brooklyn-utils-common-0.9.0-SNAPSHOT.pom
No prior successful build to compare, so performing full copy of artifacts
[JENKINS] Archiving <https://builds.apache.org/job/incubator-brooklyn-master-integration/ws/usage/logback-includes/pom.xml>
to org.apache.brooklyn/brooklyn-logback-includes/0.9.0-SNAPSHOT/brooklyn-logback-includes-0.9.0-SNAPSHOT.pom
[JENKINS] Archiving <https://builds.apache.org/job/incubator-brooklyn-master-integration/ws/usage/logback-includes/target/brooklyn-logback-includes-0.9.0-SNAPSHOT.jar>
to org.apache.brooklyn/brooklyn-logback-includes/0.9.0-SNAPSHOT/brooklyn-logback-includes-0.9.0-SNAPSHOT.jar
[JENKINS] Archiving <https://builds.apache.org/job/incubator-brooklyn-master-integration/ws/usage/logback-includes/target/brooklyn-logback-includes-0.9.0-SNAPSHOT-sources.jar>
to org.apache.brooklyn/brooklyn-logback-includes/0.9.0-SNAPSHOT/brooklyn-logback-includes-0.9.0-SNAPSHOT-sources.jar
[JENKINS] Archiving <https://builds.apache.org/job/incubator-brooklyn-master-integration/ws/pom.xml>
to org.apache.brooklyn/brooklyn/0.9.0-SNAPSHOT/brooklyn-0.9.0-SNAPSHOT.pom
[JENKINS] Archiving <https://builds.apache.org/job/incubator-brooklyn-master-integration/ws/utils/test-support/pom.xml>
to org.apache.brooklyn/brooklyn-utils-test-support/0.9.0-SNAPSHOT/brooklyn-utils-test-support-0.9.0-SNAPSHOT.pom
[JENKINS] Archiving <https://builds.apache.org/job/incubator-brooklyn-master-integration/ws/utils/test-support/target/brooklyn-utils-test-support-0.9.0-SNAPSHOT.jar>
to org.apache.brooklyn/brooklyn-utils-test-support/0.9.0-SNAPSHOT/brooklyn-utils-test-support-0.9.0-SNAPSHOT.jar
[JENKINS] Archiving <https://builds.apache.org/job/incubator-brooklyn-master-integration/ws/utils/test-support/target/brooklyn-utils-test-support-0.9.0-SNAPSHOT-sources.jar>
to org.apache.brooklyn/brooklyn-utils-test-support/0.9.0-SNAPSHOT/brooklyn-utils-test-support-0.9.0-SNAPSHOT-sources.jar
[JENKINS] Archiving <https://builds.apache.org/job/incubator-brooklyn-master-integration/ws/utils/rt-osgi/pom.xml>
to org.apache.brooklyn/brooklyn-rt-osgi/0.9.0-SNAPSHOT/brooklyn-rt-osgi-0.9.0-SNAPSHOT.pom
[JENKINS] Archiving <https://builds.apache.org/job/incubator-brooklyn-master-integration/ws/utils/rt-osgi/target/brooklyn-rt-osgi-0.9.0-SNAPSHOT.jar>
to org.apache.brooklyn/brooklyn-rt-osgi/0.9.0-SNAPSHOT/brooklyn-rt-osgi-0.9.0-SNAPSHOT.jar
[JENKINS] Archiving <https://builds.apache.org/job/incubator-brooklyn-master-integration/ws/utils/rt-osgi/target/brooklyn-rt-osgi-0.9.0-SNAPSHOT-sources.jar>
to org.apache.brooklyn/brooklyn-rt-osgi/0.9.0-SNAPSHOT/brooklyn-rt-osgi-0.9.0-SNAPSHOT-sources.jar
[JENKINS] Archiving <https://builds.apache.org/job/incubator-brooklyn-master-integration/ws/usage/test-support/pom.xml>
to org.apache.brooklyn/brooklyn-test-support/0.9.0-SNAPSHOT/brooklyn-test-support-0.9.0-SNAPSHOT.pom
[JENKINS] Archiving <https://builds.apache.org/job/incubator-brooklyn-master-integration/ws/usage/test-support/target/brooklyn-test-support-0.9.0-SNAPSHOT.jar>
to org.apache.brooklyn/brooklyn-test-support/0.9.0-SNAPSHOT/brooklyn-test-support-0.9.0-SNAPSHOT.jar
[JENKINS] Archiving <https://builds.apache.org/job/incubator-brooklyn-master-integration/ws/usage/test-support/target/brooklyn-test-support-0.9.0-SNAPSHOT-sources.jar>
to org.apache.brooklyn/brooklyn-test-support/0.9.0-SNAPSHOT/brooklyn-test-support-0.9.0-SNAPSHOT-sources.jar
[JENKINS] Archiving <https://builds.apache.org/job/incubator-brooklyn-master-integration/ws/utils/rt-felix/pom.xml>
to org.apache.brooklyn/brooklyn-rt-felix/0.9.0-SNAPSHOT/brooklyn-rt-felix-0.9.0-SNAPSHOT.pom
No prior successful build to compare, so performing full copy of artifacts
[JENKINS] Archiving <https://builds.apache.org/job/incubator-brooklyn-master-integration/ws/parent/pom.xml>
to org.apache.brooklyn/brooklyn-parent/0.9.0-SNAPSHOT/brooklyn-parent-0.9.0-SNAPSHOT.pom
Compressed 81.94 KB of artifacts by 78.1% relative to #241
[JENKINS] Archiving <https://builds.apache.org/job/incubator-brooklyn-master-integration/ws/api/pom.xml>
to org.apache.brooklyn/brooklyn-api/0.9.0-SNAPSHOT/brooklyn-api-0.9.0-SNAPSHOT.pom
[JENKINS] Archiving <https://builds.apache.org/job/incubator-brooklyn-master-integration/ws/api/target/brooklyn-api-0.9.0-SNAPSHOT.jar>
to org.apache.brooklyn/brooklyn-api/0.9.0-SNAPSHOT/brooklyn-api-0.9.0-SNAPSHOT.jar
[JENKINS] Archiving <https://builds.apache.org/job/incubator-brooklyn-master-integration/ws/api/target/brooklyn-api-0.9.0-SNAPSHOT-sources.jar>
to org.apache.brooklyn/brooklyn-api/0.9.0-SNAPSHOT/brooklyn-api-0.9.0-SNAPSHOT-sources.jar
channel stopped

Mime
View raw message