brooklyn-dev mailing list archives

Site index · List index
Message view « Date » · « Thread »
Top « Date » · « Thread »
From Apache Jenkins Server <jenk...@builds.apache.org>
Subject Build failed in Jenkins: incubator-brooklyn-master-windows #308
Date Wed, 14 Oct 2015 14:24:08 GMT
See <https://builds.apache.org/job/incubator-brooklyn-master-windows/308/changes>

Changes:

[sam.corbett] Javadoc improvements

[sam.corbett] Constraints on ConfigKeys for entities

[sam.corbett] Validation of config constraints on policies and enrichers.

[sam.corbett] Config constraint improvements

[sam.corbett] ResourcePredicates.urlExists()

[sam.corbett] Website documentation on constraints

[sam.corbett] AbstractBrooklynRestResource.RestValueResolver uses timeout

[sam.corbett] Eliminate duplication between implementations of

[sam.corbett] Adds ConfigurationSupportInternal.getNonBlocking

[sam.corbett] Validate config().set(ConfigKey<T>, T) on entities, adjuncts and

[alex.heneveld] add hot backup description to docs

[github] Fixes @ApiParam values in EntityApi

[geomacy] Amend text in creating-yaml.md

------------------------------------------
[...truncated 28446 lines...]
[INFO] Deleting F:\hudson\hudson-slave\workspace\incubator-brooklyn-master-windows\storage\hazelcast
(includes = [brooklyn*.log, brooklyn*.log.*, stacktrace.log, test-output, prodDb.*], excludes
= [])
[INFO] 
[INFO] --- maven-replacer-plugin:1.4.1:replace (fix-eclipse-dot-classpath-mangling) @ brooklyn-storage-hazelcast
---
[INFO] Ignoring missing file
[INFO] Replacement run on 0 file.
[INFO] 
[INFO] --- buildnumber-maven-plugin:1.3:create (default) @ brooklyn-storage-hazelcast ---
[INFO] 
[INFO] --- maven-enforcer-plugin:1.4:enforce (brooklyn-build-req) @ brooklyn-storage-hazelcast
---
[INFO] 
[INFO] --- maven-remote-resources-plugin:1.5:process (default) @ brooklyn-storage-hazelcast
---
[INFO] 
[INFO] --- maven-resources-plugin:2.7:resources (default-resources) @ brooklyn-storage-hazelcast
---
[INFO] Using 'UTF-8' encoding to copy filtered resources.
[INFO] skip non existing resourceDirectory F:\hudson\hudson-slave\workspace\incubator-brooklyn-master-windows\storage\hazelcast\src\main\resources
[INFO] Copying 4 resources
[INFO] 
[INFO] --- maven-compiler-plugin:3.3:compile (default-compile) @ brooklyn-storage-hazelcast
---
[INFO] Changes detected - recompiling the module!
[INFO] Compiling 4 source files to F:\hudson\hudson-slave\workspace\incubator-brooklyn-master-windows\storage\hazelcast\target\classes
[INFO] 
[INFO] --- maven-checkstyle-plugin:2.13:check (verify-style) @ brooklyn-storage-hazelcast
---
[INFO] 
[INFO] 
[INFO] --- buildnumber-maven-plugin:1.3:create (default) @ brooklyn-storage-hazelcast ---
[INFO] 
[INFO] --- maven-enforcer-plugin:1.4:enforce (brooklyn-build-req) @ brooklyn-storage-hazelcast
---
[INFO] 
[INFO] --- maven-remote-resources-plugin:1.5:process (default) @ brooklyn-storage-hazelcast
---
[INFO] 
[INFO] --- maven-resources-plugin:2.7:resources (default-resources) @ brooklyn-storage-hazelcast
---
[INFO] Using 'UTF-8' encoding to copy filtered resources.
[INFO] skip non existing resourceDirectory F:\hudson\hudson-slave\workspace\incubator-brooklyn-master-windows\storage\hazelcast\src\main\resources
[INFO] Copying 4 resources
[INFO] Copying 4 resources
[INFO] 
[INFO] --- maven-compiler-plugin:3.3:compile (default-compile) @ brooklyn-storage-hazelcast
---
[INFO] Nothing to compile - all classes are up to date
[INFO] 
[INFO] --- maven-checkstyle-plugin:2.13:check (verify-style) @ brooklyn-storage-hazelcast
---
[INFO] 
[WARNING] Failed to getClass for org.apache.felix.bundleplugin.ManifestPlugin
[INFO] 
[INFO] --- maven-bundle-plugin:2.5.4:manifest (bundle-manifest) @ brooklyn-storage-hazelcast
---
[WARNING] Manifest org.apache.brooklyn:brooklyn-storage-hazelcast:jar:0.9.0-SNAPSHOT : Unused
Export-Package instructions: [brooklyn.*] 
[INFO] 
[INFO] --- maven-resources-plugin:2.7:testResources (default-testResources) @ brooklyn-storage-hazelcast
---
[INFO] Using 'UTF-8' encoding to copy filtered resources.
[INFO] skip non existing resourceDirectory F:\hudson\hudson-slave\workspace\incubator-brooklyn-master-windows\storage\hazelcast\src\test\resources
[INFO] Copying 4 resources
[INFO] 
[INFO] --- maven-compiler-plugin:3.3:testCompile (default-testCompile) @ brooklyn-storage-hazelcast
---
[INFO] Changes detected - recompiling the module!
[INFO] Compiling 1 source file to F:\hudson\hudson-slave\workspace\incubator-brooklyn-master-windows\storage\hazelcast\target\test-classes
[INFO] 
[INFO] --- maven-surefire-plugin:2.18.1:test (default-test) @ brooklyn-storage-hazelcast ---
[INFO] Surefire report directory: F:\hudson\hudson-slave\workspace\incubator-brooklyn-master-windows\storage\hazelcast\target\surefire-reports

-------------------------------------------------------
 T E S T S
-------------------------------------------------------
Running org.apache.brooklyn.storage.impl.hazelcast.HazelcastStorageTest
Configuring TestNG with: TestNG652Configurator
2015-10-14 15:24:41,271 INFO  TESTNG RUNNING: Suite: "Surefire test" containing "0" Tests
(config: null)
2015-10-14 15:24:41,277 INFO  BrooklynLeakListener.onStart attempting to terminate all extant
ManagementContexts: name=Surefire test; includedGroups=[]; excludedGroups=[Integration, Acceptance,
Live, WIP]; suiteName=Surefire suite; outDir=F:\hudson\hudson-slave\workspace\incubator-brooklyn-master-windows\storage\hazelcast\target\surefire-reports\Surefire
suite: no org.apache.brooklyn.core.management.internal.LocalManagementContext available, so
skipped
2015-10-14 15:24:41,296 INFO  TESTNG 
===============================================
    Surefire test
    Tests run: 0, Failures: 0, Skips: 0
===============================================
2015-10-14 15:24:41,296 INFO  BrooklynLeakListener.onFinish attempting to terminate all extant
ManagementContexts: name=Surefire test; includedGroups=[]; excludedGroups=[Integration, Acceptance,
Live, WIP]; suiteName=Surefire suite; outDir=F:\hudson\hudson-slave\workspace\incubator-brooklyn-master-windows\storage\hazelcast\target\surefire-reports\Surefire
suite: no org.apache.brooklyn.core.management.internal.LocalManagementContext available, so
skipped
Tests run: 0, Failures: 0, Errors: 0, Skipped: 0, Time elapsed: 0.961 sec - in org.apache.brooklyn.storage.impl.hazelcast.HazelcastStorageTest

Results :

Tests run: 0, Failures: 0, Errors: 0, Skipped: 0

[JENKINS] Recording test results
[INFO] 
[INFO] --- maven-jar-plugin:2.6:jar (default-jar) @ brooklyn-storage-hazelcast ---
[INFO] Building jar: F:\hudson\hudson-slave\workspace\incubator-brooklyn-master-windows\storage\hazelcast\target\brooklyn-storage-hazelcast-0.9.0-SNAPSHOT.jar
[INFO] 
[INFO] --- maven-site-plugin:3.4:attach-descriptor (attach-descriptor) @ brooklyn-storage-hazelcast
---
[INFO] 
[INFO] --- maven-jar-plugin:2.6:test-jar (test-jar-creation) @ brooklyn-storage-hazelcast
---
[INFO] Building jar: F:\hudson\hudson-slave\workspace\incubator-brooklyn-master-windows\storage\hazelcast\target\brooklyn-storage-hazelcast-0.9.0-SNAPSHOT-tests.jar
[INFO] 
[INFO] --- apache-rat-plugin:0.10:check (default) @ brooklyn-storage-hazelcast ---
[INFO] 51 implicit excludes (use -debug for more details).
[INFO] Exclude: sandbox/**
[INFO] Exclude: release/**
[INFO] Exclude: **/nbactions.xml
[INFO] Exclude: **/nb-configuration.xml
[INFO] Exclude: **/.git/**
[INFO] Exclude: **/.gitignore
[INFO] Exclude: **/.repository/**
[INFO] Exclude: **/.idea/**
[INFO] Exclude: **/*.iml
[INFO] Exclude: **/.classpath/**
[INFO] Exclude: **/.project
[INFO] Exclude: **/.settings/**
[INFO] Exclude: **/*.log
[INFO] Exclude: **/brooklyn*.log.*
[INFO] Exclude: **/target/**
[INFO] Exclude: ignored/**
[INFO] Exclude: LICENSE.md
[INFO] Exclude: **/src/main/license/**
[INFO] Exclude: **/src/test/license/**
[INFO] Exclude: **/MANIFEST.MF
[INFO] Exclude: **/test-output/**
[INFO] Exclude: **/*.pem.pub
[INFO] Exclude: **/*.pem
[INFO] Exclude: **/*_rsa.pub
[INFO] Exclude: **/*_rsa
[INFO] Exclude: **/*.svg
[INFO] Exclude: **/*.crt
[INFO] Exclude: **/*.csr
[INFO] Exclude: **/*.key
[INFO] Exclude: **/*.key.org
[INFO] Exclude: **/*.psd
[INFO] Exclude: **/*.json
[INFO] Exclude: **/*.plxarc
[INFO] Exclude: **/src/test/resources/org/apache/brooklyn/entity/software/base/template_with_extra_substitutions.txt
[INFO] Exclude: **/src/main/resources/banner.txt
[INFO] Exclude: **/src/test/resources/ssl/certs/localhost/info.txt
[INFO] Exclude: **/sandbox/examples/src/main/scripts/amis.txt
[INFO] Exclude: docs/**
[INFO] 6 resources included (use -debug for more details)
[INFO] Rat check: Summary of files. Unapproved: 0 unknown: 0 generated: 0 approved: 6 licence.
[INFO] 
[INFO] --- maven-source-plugin:2.4:jar-no-fork (attach-sources) @ brooklyn-storage-hazelcast
---
[INFO] Building jar: F:\hudson\hudson-slave\workspace\incubator-brooklyn-master-windows\storage\hazelcast\target\brooklyn-storage-hazelcast-0.9.0-SNAPSHOT-sources.jar
[INFO] 
[INFO] --- maven-install-plugin:2.5.2:install (default-install) @ brooklyn-storage-hazelcast
---
[INFO] Installing F:\hudson\hudson-slave\workspace\incubator-brooklyn-master-windows\storage\hazelcast\target\brooklyn-storage-hazelcast-0.9.0-SNAPSHOT.jar
to f:\hudson\hudson-slave\maven-repositories\0\org\apache\brooklyn\brooklyn-storage-hazelcast\0.9.0-SNAPSHOT\brooklyn-storage-hazelcast-0.9.0-SNAPSHOT.jar
[INFO] Installing F:\hudson\hudson-slave\workspace\incubator-brooklyn-master-windows\storage\hazelcast\pom.xml
to f:\hudson\hudson-slave\maven-repositories\0\org\apache\brooklyn\brooklyn-storage-hazelcast\0.9.0-SNAPSHOT\brooklyn-storage-hazelcast-0.9.0-SNAPSHOT.pom
[INFO] Installing F:\hudson\hudson-slave\workspace\incubator-brooklyn-master-windows\storage\hazelcast\target\brooklyn-storage-hazelcast-0.9.0-SNAPSHOT-tests.jar
to f:\hudson\hudson-slave\maven-repositories\0\org\apache\brooklyn\brooklyn-storage-hazelcast\0.9.0-SNAPSHOT\brooklyn-storage-hazelcast-0.9.0-SNAPSHOT-tests.jar
[INFO] Installing F:\hudson\hudson-slave\workspace\incubator-brooklyn-master-windows\storage\hazelcast\target\brooklyn-storage-hazelcast-0.9.0-SNAPSHOT-sources.jar
to f:\hudson\hudson-slave\maven-repositories\0\org\apache\brooklyn\brooklyn-storage-hazelcast\0.9.0-SNAPSHOT\brooklyn-storage-hazelcast-0.9.0-SNAPSHOT-sources.jar
[JENKINS] Archiving disabled
[INFO]                                                                         
[INFO] ------------------------------------------------------------------------
[INFO] Skipping Brooklyn Distribution
[INFO] This project has been banned from the build due to previous failures.
[INFO] ------------------------------------------------------------------------
[INFO]                                                                         
[INFO] ------------------------------------------------------------------------
[INFO] Skipping Brooklyn QA
[INFO] This project has been banned from the build due to previous failures.
[INFO] ------------------------------------------------------------------------
[INFO]                                                                         
[INFO] ------------------------------------------------------------------------
[INFO] Skipping Brooklyn REST Client
[INFO] This project has been banned from the build due to previous failures.
[INFO] ------------------------------------------------------------------------
[INFO] ------------------------------------------------------------------------
[INFO] Reactor Summary:
[INFO] 
[INFO] Brooklyn Root ..................................... SUCCESS [3.327s]
[INFO] Brooklyn Parent Project ........................... SUCCESS [4.177s]
[INFO] Brooklyn Test Support Utilities ................... SUCCESS [6.541s]
[INFO] Brooklyn Logback Includable Configuration ......... SUCCESS [1.870s]
[INFO] Brooklyn Common Utilities ......................... SUCCESS [24.837s]
[INFO] Brooklyn API ...................................... SUCCESS [5.499s]
[INFO] Brooklyn Test Support ............................. SUCCESS [3.676s]
[INFO] Brooklyn Groovy Utilities ......................... SUCCESS [9.989s]
[INFO] Brooklyn Core ..................................... SUCCESS [4:22.208s]
[INFO] Brooklyn Policies ................................. SUCCESS [1:56.034s]
[INFO] Brooklyn Jclouds Location Targets ................. SUCCESS [59.446s]
[INFO] Brooklyn Secure JMXMP Agent ....................... SUCCESS [18.166s]
[INFO] Brooklyn JMX RMI Agent ............................ SUCCESS [2.808s]
[INFO] Brooklyn Software Base ............................ SUCCESS [1:30.431s]
[INFO] Brooklyn Web App Software Entities ................ SUCCESS [2:15.646s]
[INFO] Brooklyn Messaging Software Entities .............. SUCCESS [20.548s]
[INFO] Brooklyn Database Software Entities ............... SUCCESS [12.632s]
[INFO] Brooklyn Monitoring Software Entities ............. SUCCESS [8.598s]
[INFO] Brooklyn OSGi Software Entities ................... SUCCESS [8.343s]
[INFO] Brooklyn NoSQL Data Store Software Entities ....... SUCCESS [31.448s]
[INFO] Brooklyn Network Software Entities ................ SUCCESS [9.433s]
[INFO] Brooklyn CAMP REST API ............................ FAILURE [4:08.533s]
[INFO] Brooklyn REST Server .............................. SKIPPED
[INFO] Brooklyn REST JavaScript Web GUI .................. SKIPPED
[INFO] Brooklyn Launcher ................................. SKIPPED
[INFO] Brooklyn Command Line Interface ................... SKIPPED
[INFO] Brooklyn All Things ............................... SKIPPED
[INFO] Brooklyn Simple Web Cluster Example ............... SKIPPED
[INFO] Brooklyn Global Web Fabric Example ................ SKIPPED
[INFO] Brooklyn Simple Messaging Publish-Subscribe Example  SKIPPED
[INFO] Brooklyn NoSQL Cluster Examples ................... SKIPPED
[INFO] Brooklyn Hazelcast Storage ........................ SUCCESS [6.872s]
[INFO] Brooklyn Distribution ............................. SKIPPED
[INFO] Brooklyn QA ....................................... SKIPPED
[INFO] Brooklyn REST Client .............................. SKIPPED
[INFO] ------------------------------------------------------------------------
[INFO] BUILD FAILURE
[INFO] ------------------------------------------------------------------------
[INFO] Total time: 18:28.949s
[INFO] Finished at: Wed Oct 14 15:24:41 BST 2015
[INFO] Final Memory: 67M/239M
[INFO] ------------------------------------------------------------------------
[JENKINS] Archiving disabled
[JENKINS] Archiving disabled
[JENKINS] Archiving disabled
[JENKINS] Archiving disabled
[JENKINS] Archiving disabled
[JENKINS] Archiving disabled
[JENKINS] Archiving disabled
[JENKINS] Archiving disabled
[JENKINS] Archiving disabled
[JENKINS] Archiving disabled
[JENKINS] Archiving disabled
[JENKINS] Archiving disabled
[JENKINS] Archiving disabled
[JENKINS] Archiving disabled
[JENKINS] Archiving disabled
[JENKINS] Archiving disabled
[JENKINS] Archiving disabled
[JENKINS] Archiving disabled
[JENKINS] Archiving disabled
[JENKINS] Archiving disabled
[JENKINS] Archiving disabled
[JENKINS] Archiving disabled
[JENKINS] Archiving disabled
[JENKINS] Archiving disabled
[JENKINS] Archiving disabled
[JENKINS] Archiving disabled
[JENKINS] Archiving disabled
[JENKINS] Archiving disabled
[JENKINS] Archiving disabled
[JENKINS] Archiving disabled
[JENKINS] Archiving disabled
[JENKINS] Archiving disabled
[JENKINS] Archiving disabled
[JENKINS] Archiving disabled
[JENKINS] Archiving disabled
Waiting for Jenkins to finish collecting data
[ERROR] Failed to execute goal org.apache.maven.plugins:maven-surefire-plugin:2.18.1:test
(default-test) on project brooklyn-camp: There are test failures.
[ERROR] 
[ERROR] Please refer to F:\hudson\hudson-slave\workspace\incubator-brooklyn-master-windows\usage\camp\target\surefire-reports
for the individual test results.
[ERROR] -> [Help 1]
[ERROR] 
[ERROR] To see the full stack trace of the errors, re-run Maven with the -e switch.
[ERROR] Re-run Maven using the -X switch to enable full debug logging.
[ERROR] 
[ERROR] For more information about the errors and possible solutions, please read the following
articles:
[ERROR] [Help 1] http://cwiki.apache.org/confluence/display/MAVEN/MojoFailureException
[ERROR] 
[ERROR] After correcting the problems, you can resume the build with the command
[ERROR]   mvn <goals> -rf :brooklyn-camp
channel stopped

Mime
View raw message