brooklyn-dev mailing list archives

Site index · List index
Message view « Date » · « Thread »
Top « Date » · « Thread »
From Apache Jenkins Server <jenk...@builds.apache.org>
Subject Build failed in Jenkins: incubator-brooklyn-master-integration #240
Date Tue, 27 Oct 2015 00:38:02 GMT
See <https://builds.apache.org/job/incubator-brooklyn-master-integration/240/changes>

Changes:

[cheepeero] [BROOKLYN-183] Skeleton for karaf container

[cheepeero] [BROOKLYN-183] Skeleton of karaf shell commands project

[cheepeero] [BROOKLYN-183] More on karaf integration

[cheepeero] [BROOKLYN-183] Add pax-exam integration tests stub project

[cheepeero] [BROOKLYN-183] Use brooklyn-itest project to check features

[cheepeero] [BROOKLYN-183] Workaround use of private package in XmlMementoSerializer

[cheepeero] [BROOKLYN-183] Allow use of OSGi framework provided by karaf

[cheepeero] [BROOKLYN-183] Move Apache Felix code into specific jar

[cheepeero] [BROOKLYN-183] Completed brooklyn-core as karaf feature

------------------------------------------
[...truncated 1994 lines...]
[INFO] Exclude: **/*.iml
[INFO] Exclude: **/.classpath/**
[INFO] Exclude: **/.project
[INFO] Exclude: **/.settings/**
[INFO] Exclude: **/*.log
[INFO] Exclude: **/brooklyn*.log.*
[INFO] Exclude: **/target/**
[INFO] Exclude: ignored/**
[INFO] Exclude: LICENSE.md
[INFO] Exclude: **/src/main/license/**
[INFO] Exclude: **/src/test/license/**
[INFO] Exclude: **/MANIFEST.MF
[INFO] Exclude: **/test-output/**
[INFO] Exclude: **/*.pem.pub
[INFO] Exclude: **/*.pem
[INFO] Exclude: **/*_rsa.pub
[INFO] Exclude: **/*_rsa
[INFO] Exclude: **/*.svg
[INFO] Exclude: **/*.crt
[INFO] Exclude: **/*.csr
[INFO] Exclude: **/*.key
[INFO] Exclude: **/*.key.org
[INFO] Exclude: **/*.psd
[INFO] Exclude: **/*.json
[INFO] Exclude: **/*.plxarc
[INFO] Exclude: **/src/test/resources/org/apache/brooklyn/entity/software/base/template_with_extra_substitutions.txt
[INFO] Exclude: **/src/main/resources/banner.txt
[INFO] Exclude: **/src/test/resources/ssl/certs/localhost/info.txt
[INFO] Exclude: **/src/main/history/dependencies.xml
[INFO] Exclude: **/sandbox/examples/src/main/scripts/amis.txt
[INFO] Exclude: docs/**
[INFO] 6 resources included (use -debug for more details)
[INFO] Rat check: Summary of files. Unapproved: 0 unknown: 0 generated: 0 approved: 6 licence.
[INFO] 
[INFO] --- maven-source-plugin:2.4:jar-no-fork (attach-sources) @ brooklyn-utils-groovy ---
[INFO] Building jar: <https://builds.apache.org/job/incubator-brooklyn-master-integration/ws/utils/groovy/target/brooklyn-utils-groovy-0.9.0-SNAPSHOT-sources.jar>
[INFO]                                                                         
[INFO] ------------------------------------------------------------------------
[INFO] Building Brooklyn Core 0.9.0-SNAPSHOT
[INFO] ------------------------------------------------------------------------
Downloading: http://repository.apache.org/snapshots/org/apache/brooklyn/brooklyn-rt-felix/0.9.0-SNAPSHOT/maven-metadata.xml
Downloading: http://repo.maven.apache.org/maven2/net/schmizz/sshj/0.8.1/sshj-0.8.1.pom
Downloaded: http://repo.maven.apache.org/maven2/net/schmizz/sshj/0.8.1/sshj-0.8.1.pom (10
KB at 1012.9 KB/sec)
Downloading: http://repo.maven.apache.org/maven2/com/thoughtworks/xstream/xstream/1.4.7/xstream-1.4.7.pom
Downloaded: http://repo.maven.apache.org/maven2/com/thoughtworks/xstream/xstream/1.4.7/xstream-1.4.7.pom
(11 KB at 1097.3 KB/sec)
Downloading: http://repo.maven.apache.org/maven2/com/thoughtworks/xstream/xstream-parent/1.4.7/xstream-parent-1.4.7.pom
Downloaded: http://repo.maven.apache.org/maven2/com/thoughtworks/xstream/xstream-parent/1.4.7/xstream-parent-1.4.7.pom
(26 KB at 3204.3 KB/sec)
Downloading: http://repo.maven.apache.org/maven2/org/codehaus/codehaus-parent/3/codehaus-parent-3.pom
Downloaded: http://repo.maven.apache.org/maven2/org/codehaus/codehaus-parent/3/codehaus-parent-3.pom
(5 KB at 501.3 KB/sec)
Downloading: http://repo.maven.apache.org/maven2/xmlpull/xmlpull/1.1.3.1/xmlpull-1.1.3.1.pom
Downloaded: http://repo.maven.apache.org/maven2/xmlpull/xmlpull/1.1.3.1/xmlpull-1.1.3.1.pom
(386 B at 41.9 KB/sec)
Downloading: http://repo.maven.apache.org/maven2/xpp3/xpp3_min/1.1.4c/xpp3_min-1.1.4c.pom
Downloaded: http://repo.maven.apache.org/maven2/xpp3/xpp3_min/1.1.4c/xpp3_min-1.1.4c.pom (2
KB at 196.5 KB/sec)
Downloading: http://repo.maven.apache.org/maven2/org/codehaus/jackson/jackson-mapper-asl/1.9.13/jackson-mapper-asl-1.9.13.pom
Downloaded: http://repo.maven.apache.org/maven2/org/codehaus/jackson/jackson-mapper-asl/1.9.13/jackson-mapper-asl-1.9.13.pom
(2 KB at 183.8 KB/sec)
Downloading: http://repo.maven.apache.org/maven2/org/codehaus/jackson/jackson-core-asl/1.9.13/jackson-core-asl-1.9.13.pom
Downloaded: http://repo.maven.apache.org/maven2/org/codehaus/jackson/jackson-core-asl/1.9.13/jackson-core-asl-1.9.13.pom
(2 KB at 178.4 KB/sec)
Downloading: http://repo.maven.apache.org/maven2/com/google/code/gson/gson/2.3/gson-2.3.pom
Downloaded: http://repo.maven.apache.org/maven2/com/google/code/gson/gson/2.3/gson-2.3.pom
(9 KB at 973.7 KB/sec)
Downloading: http://repo.maven.apache.org/maven2/org/apache/httpcomponents/httpclient/4.4.1/httpclient-4.4.1.pom
Downloaded: http://repo.maven.apache.org/maven2/org/apache/httpcomponents/httpclient/4.4.1/httpclient-4.4.1.pom
(7 KB at 780.4 KB/sec)
Downloading: http://repo.maven.apache.org/maven2/org/apache/httpcomponents/httpcomponents-client/4.4.1/httpcomponents-client-4.4.1.pom
Downloaded: http://repo.maven.apache.org/maven2/org/apache/httpcomponents/httpcomponents-client/4.4.1/httpcomponents-client-4.4.1.pom
(16 KB at 1912.5 KB/sec)
Downloading: http://repo.maven.apache.org/maven2/org/apache/httpcomponents/httpcore/4.4.1/httpcore-4.4.1.pom
Downloaded: http://repo.maven.apache.org/maven2/org/apache/httpcomponents/httpcore/4.4.1/httpcore-4.4.1.pom
(5 KB at 561.0 KB/sec)
Downloading: http://repo.maven.apache.org/maven2/org/apache/httpcomponents/httpcomponents-core/4.4.1/httpcomponents-core-4.4.1.pom
Downloaded: http://repo.maven.apache.org/maven2/org/apache/httpcomponents/httpcomponents-core/4.4.1/httpcomponents-core-4.4.1.pom
(13 KB at 1569.7 KB/sec)
Downloading: http://repo.maven.apache.org/maven2/org/bouncycastle/bcprov-ext-jdk15on/1.49/bcprov-ext-jdk15on-1.49.pom
Downloaded: http://repo.maven.apache.org/maven2/org/bouncycastle/bcprov-ext-jdk15on/1.49/bcprov-ext-jdk15on-1.49.pom
(2 KB at 134.9 KB/sec)
Downloading: http://repo.maven.apache.org/maven2/org/bouncycastle/bcpkix-jdk15on/1.49/bcpkix-jdk15on-1.49.pom
Downloaded: http://repo.maven.apache.org/maven2/org/bouncycastle/bcpkix-jdk15on/1.49/bcpkix-jdk15on-1.49.pom
(2 KB at 165.5 KB/sec)
Downloading: http://repo.maven.apache.org/maven2/org/reflections/reflections/0.9.9-RC1/reflections-0.9.9-RC1.pom
Downloaded: http://repo.maven.apache.org/maven2/org/reflections/reflections/0.9.9-RC1/reflections-0.9.9-RC1.pom
(4 KB at 438.5 KB/sec)
Downloading: http://repo.maven.apache.org/maven2/org/reflections/reflections-parent/0.9.9-RC1/reflections-parent-0.9.9-RC1.pom
Downloaded: http://repo.maven.apache.org/maven2/org/reflections/reflections-parent/0.9.9-RC1/reflections-parent-0.9.9-RC1.pom
(4 KB at 476.1 KB/sec)
Downloading: http://repo.maven.apache.org/maven2/org/javassist/javassist/3.16.1-GA/javassist-3.16.1-GA.pom
Downloaded: http://repo.maven.apache.org/maven2/org/javassist/javassist/3.16.1-GA/javassist-3.16.1-GA.pom
(9 KB at 1103.5 KB/sec)
Downloading: http://repo.maven.apache.org/maven2/dom4j/dom4j/1.6.1/dom4j-1.6.1.pom
Downloaded: http://repo.maven.apache.org/maven2/dom4j/dom4j/1.6.1/dom4j-1.6.1.pom (7 KB at
825.8 KB/sec)
Downloading: http://repo.maven.apache.org/maven2/org/freemarker/freemarker/2.3.22/freemarker-2.3.22.pom
Downloaded: http://repo.maven.apache.org/maven2/org/freemarker/freemarker/2.3.22/freemarker-2.3.22.pom
(2 KB at 184.8 KB/sec)
Downloading: http://repo.maven.apache.org/maven2/com/maxmind/geoip2/geoip2/0.8.1/geoip2-0.8.1.pom
Downloaded: http://repo.maven.apache.org/maven2/com/maxmind/geoip2/geoip2/0.8.1/geoip2-0.8.1.pom
(7 KB at 828.0 KB/sec)
Downloading: http://repo.maven.apache.org/maven2/com/maxmind/db/maxmind-db/0.3.4/maxmind-db-0.3.4.pom
Downloaded: http://repo.maven.apache.org/maven2/com/maxmind/db/maxmind-db/0.3.4/maxmind-db-0.3.4.pom
(5 KB at 498.8 KB/sec)
Downloading: http://repo.maven.apache.org/maven2/com/fasterxml/jackson/core/jackson-databind/2.4.2/jackson-databind-2.4.2.pom
Downloaded: http://repo.maven.apache.org/maven2/com/fasterxml/jackson/core/jackson-databind/2.4.2/jackson-databind-2.4.2.pom
(6 KB at 694.1 KB/sec)
Downloading: http://repo.maven.apache.org/maven2/com/fasterxml/jackson/jackson-parent/2.4/jackson-parent-2.4.pom
Downloaded: http://repo.maven.apache.org/maven2/com/fasterxml/jackson/jackson-parent/2.4/jackson-parent-2.4.pom
(7 KB at 775.8 KB/sec)
Downloading: http://repo.maven.apache.org/maven2/com/fasterxml/oss-parent/16/oss-parent-16.pom
Downloaded: http://repo.maven.apache.org/maven2/com/fasterxml/oss-parent/16/oss-parent-16.pom
(19 KB at 2617.7 KB/sec)
Downloading: http://repo.maven.apache.org/maven2/com/fasterxml/jackson/core/jackson-annotations/2.4.0/jackson-annotations-2.4.0.pom
Downloaded: http://repo.maven.apache.org/maven2/com/fasterxml/jackson/core/jackson-annotations/2.4.0/jackson-annotations-2.4.0.pom
(2 KB at 170.1 KB/sec)
Downloading: http://repo.maven.apache.org/maven2/com/fasterxml/jackson/core/jackson-core/2.4.2/jackson-core-2.4.2.pom
Downloaded: http://repo.maven.apache.org/maven2/com/fasterxml/jackson/core/jackson-core/2.4.2/jackson-core-2.4.2.pom
(5 KB at 672.3 KB/sec)
Downloading: http://repo.maven.apache.org/maven2/com/google/http-client/google-http-client/1.18.0-rc/google-http-client-1.18.0-rc.pom
Downloaded: http://repo.maven.apache.org/maven2/com/google/http-client/google-http-client/1.18.0-rc/google-http-client-1.18.0-rc.pom
(6 KB at 627.3 KB/sec)
Downloading: http://repo.maven.apache.org/maven2/com/google/http-client/google-http-client-parent/1.18.0-rc/google-http-client-parent-1.18.0-rc.pom
Downloaded: http://repo.maven.apache.org/maven2/com/google/http-client/google-http-client-parent/1.18.0-rc/google-http-client-parent-1.18.0-rc.pom
(23 KB at 2797.7 KB/sec)
Downloading: http://repo.maven.apache.org/maven2/mx4j/mx4j-tools/3.0.1/mx4j-tools-3.0.1.pom
Downloaded: http://repo.maven.apache.org/maven2/mx4j/mx4j-tools/3.0.1/mx4j-tools-3.0.1.pom
(155 B at 18.9 KB/sec)
Downloading: http://repo.maven.apache.org/maven2/com/google/mockwebserver/mockwebserver/20121111/mockwebserver-20121111.pom
Downloaded: http://repo.maven.apache.org/maven2/com/google/mockwebserver/mockwebserver/20121111/mockwebserver-20121111.pom
(4 KB at 413.0 KB/sec)
Downloading: http://repo.maven.apache.org/maven2/org/eclipse/jetty/jetty-webapp/8.1.17.v20150415/jetty-webapp-8.1.17.v20150415.pom
Downloaded: http://repo.maven.apache.org/maven2/org/eclipse/jetty/jetty-webapp/8.1.17.v20150415/jetty-webapp-8.1.17.v20150415.pom
(4 KB at 426.9 KB/sec)
Downloading: http://repo.maven.apache.org/maven2/org/eclipse/jetty/jetty-xml/8.1.17.v20150415/jetty-xml-8.1.17.v20150415.pom
Downloaded: http://repo.maven.apache.org/maven2/org/eclipse/jetty/jetty-xml/8.1.17.v20150415/jetty-xml-8.1.17.v20150415.pom
(2 KB at 242.9 KB/sec)
Downloading: http://repo.maven.apache.org/maven2/com/jayway/jsonpath/json-path/2.0.0/json-path-2.0.0.pom
Downloaded: http://repo.maven.apache.org/maven2/com/jayway/jsonpath/json-path/2.0.0/json-path-2.0.0.pom
(2 KB at 243.8 KB/sec)
Downloading: http://repo.maven.apache.org/maven2/net/minidev/json-smart/2.1.1/json-smart-2.1.1.pom
Downloaded: http://repo.maven.apache.org/maven2/net/minidev/json-smart/2.1.1/json-smart-2.1.1.pom
(3 KB at 307.9 KB/sec)
Downloading: http://repo.maven.apache.org/maven2/net/minidev/parent/2.1.0/parent-2.1.0.pom
Downloaded: http://repo.maven.apache.org/maven2/net/minidev/parent/2.1.0/parent-2.1.0.pom
(9 KB at 843.4 KB/sec)
Downloading: http://repo.maven.apache.org/maven2/net/minidev/asm/1.0.2/asm-1.0.2.pom
Downloaded: http://repo.maven.apache.org/maven2/net/minidev/asm/1.0.2/asm-1.0.2.pom (2 KB
at 249.4 KB/sec)
Downloading: http://repository.apache.org/snapshots/org/apache/brooklyn/brooklyn-rt-felix/0.9.0-SNAPSHOT/brooklyn-rt-felix-0.9.0-SNAPSHOT.jar
Downloading: http://repository.apache.org/snapshots/org/apache/brooklyn/brooklyn-rt-osgi/0.9.0-SNAPSHOT/brooklyn-rt-osgi-0.9.0-SNAPSHOT-tests.jar
Downloading: http://repo.maven.apache.org/maven2/net/schmizz/sshj/0.8.1/sshj-0.8.1.jar
Downloading: http://repo.maven.apache.org/maven2/com/thoughtworks/xstream/xstream/1.4.7/xstream-1.4.7.jar
Downloading: http://repo.maven.apache.org/maven2/xmlpull/xmlpull/1.1.3.1/xmlpull-1.1.3.1.jar
Downloading: http://repo.maven.apache.org/maven2/xpp3/xpp3_min/1.1.4c/xpp3_min-1.1.4c.jar
Downloading: http://repo.maven.apache.org/maven2/org/codehaus/jackson/jackson-mapper-asl/1.9.13/jackson-mapper-asl-1.9.13.jar
Downloaded: http://repo.maven.apache.org/maven2/xmlpull/xmlpull/1.1.3.1/xmlpull-1.1.3.1.jar
(8 KB at 390.0 KB/sec)
Downloading: http://repo.maven.apache.org/maven2/com/google/code/gson/gson/2.3/gson-2.3.jar
Downloaded: http://repo.maven.apache.org/maven2/xpp3/xpp3_min/1.1.4c/xpp3_min-1.1.4c.jar (25
KB at 1740.8 KB/sec)
Downloading: http://repo.maven.apache.org/maven2/org/apache/httpcomponents/httpclient/4.4.1/httpclient-4.4.1.jar
Downloaded: http://repo.maven.apache.org/maven2/net/schmizz/sshj/0.8.1/sshj-0.8.1.jar (342
KB at 14840.6 KB/sec)
Downloading: http://repo.maven.apache.org/maven2/org/bouncycastle/bcprov-ext-jdk15on/1.49/bcprov-ext-jdk15on-1.49.jar
Downloaded: http://repo.maven.apache.org/maven2/com/thoughtworks/xstream/xstream/1.4.7/xstream-1.4.7.jar
(520 KB at 16222.3 KB/sec)
Downloading: http://repo.maven.apache.org/maven2/org/bouncycastle/bcpkix-jdk15on/1.49/bcpkix-jdk15on-1.49.jar
Downloaded: http://repo.maven.apache.org/maven2/com/google/code/gson/gson/2.3/gson-2.3.jar
(203 KB at 13467.0 KB/sec)
Downloading: http://repo.maven.apache.org/maven2/org/reflections/reflections/0.9.9-RC1/reflections-0.9.9-RC1.jar
Downloaded: http://repo.maven.apache.org/maven2/org/apache/httpcomponents/httpclient/4.4.1/httpclient-4.4.1.jar
(705 KB at 27078.2 KB/sec)
Downloading: http://repo.maven.apache.org/maven2/org/javassist/javassist/3.16.1-GA/javassist-3.16.1-GA.jar
Downloaded: http://repo.maven.apache.org/maven2/org/codehaus/jackson/jackson-mapper-asl/1.9.13/jackson-mapper-asl-1.9.13.jar
(763 KB at 21781.9 KB/sec)
Downloading: http://repo.maven.apache.org/maven2/dom4j/dom4j/1.6.1/dom4j-1.6.1.jar
Downloaded: http://repo.maven.apache.org/maven2/org/reflections/reflections/0.9.9-RC1/reflections-0.9.9-RC1.jar
(119 KB at 7386.0 KB/sec)
Downloading: http://repo.maven.apache.org/maven2/org/freemarker/freemarker/2.3.22/freemarker-2.3.22.jar
Downloaded: http://repo.maven.apache.org/maven2/org/bouncycastle/bcpkix-jdk15on/1.49/bcpkix-jdk15on-1.49.jar
(615 KB at 17080.7 KB/sec)
Downloading: http://repo.maven.apache.org/maven2/org/apache/httpcomponents/httpcore/4.4.1/httpcore-4.4.1.jar
Downloaded: http://repo.maven.apache.org/maven2/org/javassist/javassist/3.16.1-GA/javassist-3.16.1-GA.jar
(644 KB at 27995.2 KB/sec)
Downloading: http://repo.maven.apache.org/maven2/org/codehaus/jackson/jackson-core-asl/1.9.13/jackson-core-asl-1.9.13.jar
Downloaded: http://repo.maven.apache.org/maven2/dom4j/dom4j/1.6.1/dom4j-1.6.1.jar (307 KB
at 12772.5 KB/sec)
Downloading: http://repo.maven.apache.org/maven2/com/maxmind/geoip2/geoip2/0.8.1/geoip2-0.8.1.jar
Downloaded: http://repo.maven.apache.org/maven2/org/apache/httpcomponents/httpcore/4.4.1/httpcore-4.4.1.jar
(315 KB at 20978.8 KB/sec)
Downloading: http://repo.maven.apache.org/maven2/com/maxmind/db/maxmind-db/0.3.4/maxmind-db-0.3.4.jar
Downloaded: http://repo.maven.apache.org/maven2/com/maxmind/geoip2/geoip2/0.8.1/geoip2-0.8.1.jar
(35 KB at 2187.1 KB/sec)
Downloading: http://repo.maven.apache.org/maven2/com/google/http-client/google-http-client/1.18.0-rc/google-http-client-1.18.0-rc.jar
Downloaded: http://repo.maven.apache.org/maven2/org/freemarker/freemarker/2.3.22/freemarker-2.3.22.jar
(1271 KB at 28863.8 KB/sec)
Downloaded: http://repo.maven.apache.org/maven2/com/maxmind/db/maxmind-db/0.3.4/maxmind-db-0.3.4.jar
(17 KB at 1540.7 KB/sec)
Downloading: http://repo.maven.apache.org/maven2/com/fasterxml/jackson/core/jackson-databind/2.4.2/jackson-databind-2.4.2.jar
Downloading: http://repo.maven.apache.org/maven2/com/fasterxml/jackson/core/jackson-annotations/2.4.0/jackson-annotations-2.4.0.jar
Downloaded: http://repo.maven.apache.org/maven2/org/codehaus/jackson/jackson-core-asl/1.9.13/jackson-core-asl-1.9.13.jar
(227 KB at 7820.9 KB/sec)
Downloading: http://repo.maven.apache.org/maven2/com/fasterxml/jackson/core/jackson-core/2.4.2/jackson-core-2.4.2.jar
Downloaded: http://repo.maven.apache.org/maven2/com/google/http-client/google-http-client/1.18.0-rc/google-http-client-1.18.0-rc.jar
(265 KB at 17652.9 KB/sec)
Downloading: http://repo.maven.apache.org/maven2/mx4j/mx4j-tools/3.0.1/mx4j-tools-3.0.1.jar
Downloaded: http://repo.maven.apache.org/maven2/com/fasterxml/jackson/core/jackson-core/2.4.2/jackson-core-2.4.2.jar
(221 KB at 15716.8 KB/sec)
Downloading: http://repo.maven.apache.org/maven2/com/google/mockwebserver/mockwebserver/20121111/mockwebserver-20121111.jar
Downloaded: http://repo.maven.apache.org/maven2/com/fasterxml/jackson/core/jackson-annotations/2.4.0/jackson-annotations-2.4.0.jar
(38 KB at 1885.0 KB/sec)
Downloading: http://repo.maven.apache.org/maven2/org/eclipse/jetty/jetty-webapp/8.1.17.v20150415/jetty-webapp-8.1.17.v20150415.jar
Downloaded: http://repo.maven.apache.org/maven2/com/google/mockwebserver/mockwebserver/20121111/mockwebserver-20121111.jar
(24 KB at 1541.5 KB/sec)
Downloading: http://repo.maven.apache.org/maven2/org/eclipse/jetty/jetty-xml/8.1.17.v20150415/jetty-xml-8.1.17.v20150415.jar
Downloaded: http://repo.maven.apache.org/maven2/org/eclipse/jetty/jetty-webapp/8.1.17.v20150415/jetty-webapp-8.1.17.v20150415.jar
(108 KB at 8271.0 KB/sec)
Downloading: http://repo.maven.apache.org/maven2/com/jayway/jsonpath/json-path/2.0.0/json-path-2.0.0.jar
Downloaded: http://repo.maven.apache.org/maven2/org/bouncycastle/bcprov-ext-jdk15on/1.49/bcprov-ext-jdk15on-1.49.jar
(2493 KB at 22255.6 KB/sec)
Downloading: http://repo.maven.apache.org/maven2/net/minidev/json-smart/2.1.1/json-smart-2.1.1.jar
Downloaded: http://repo.maven.apache.org/maven2/mx4j/mx4j-tools/3.0.1/mx4j-tools-3.0.1.jar
(486 KB at 15167.8 KB/sec)
Downloading: http://repo.maven.apache.org/maven2/net/minidev/asm/1.0.2/asm-1.0.2.jar
Downloaded: http://repo.maven.apache.org/maven2/org/eclipse/jetty/jetty-xml/8.1.17.v20150415/jetty-xml-8.1.17.v20150415.jar
(39 KB at 4240.6 KB/sec)
Downloading: http://repo.maven.apache.org/maven2/org/eclipse/jetty/orbit/javax.servlet/3.0.0.v201112011016/javax.servlet-3.0.0.v201112011016.jar
Downloaded: http://repo.maven.apache.org/maven2/com/jayway/jsonpath/json-path/2.0.0/json-path-2.0.0.jar
(134 KB at 8890.6 KB/sec)
Downloading: http://repo.maven.apache.org/maven2/org/apache/httpcomponents/httpclient/4.4.1/httpclient-4.4.1-tests.jar
Downloaded: http://repo.maven.apache.org/maven2/net/minidev/asm/1.0.2/asm-1.0.2.jar (71 KB
at 6370.5 KB/sec)
Downloaded: http://repo.maven.apache.org/maven2/net/minidev/json-smart/2.1.1/json-smart-2.1.1.jar
(122 KB at 9384.5 KB/sec)
Downloaded: http://repo.maven.apache.org/maven2/org/eclipse/jetty/orbit/javax.servlet/3.0.0.v201112011016/javax.servlet-3.0.0.v201112011016.jar
(196 KB at 15053.1 KB/sec)
Downloaded: http://repo.maven.apache.org/maven2/com/fasterxml/jackson/core/jackson-databind/2.4.2/jackson-databind-2.4.2.jar
(1051 KB at 14007.3 KB/sec)
Downloaded: http://repo.maven.apache.org/maven2/org/apache/httpcomponents/httpclient/4.4.1/httpclient-4.4.1-tests.jar
(420 KB at 13990.9 KB/sec)
[INFO] ------------------------------------------------------------------------
[INFO] Reactor Summary:
[INFO] 
[INFO] Brooklyn Root ..................................... SUCCESS [4.299s]
[INFO] Brooklyn Parent Project ........................... SUCCESS [6.985s]
[INFO] Brooklyn Test Support Utilities ................... SUCCESS [9.357s]
[INFO] Brooklyn Logback Includable Configuration ......... SUCCESS [2.733s]
[INFO] Brooklyn Common Utilities ......................... FAILURE [49.942s]
[INFO] Brooklyn API ...................................... SUCCESS [6.675s]
[INFO] Brooklyn Test Support ............................. SUCCESS [3.448s]
[INFO] Brooklyn OSGi Utils ............................... SUCCESS [5.376s]
[INFO] Brooklyn Felix Runtime ............................ FAILURE [0.946s]
[INFO] Brooklyn Groovy Utilities ......................... SUCCESS [3.306s]
[INFO] Brooklyn Core ..................................... FAILURE [1.559s]
[INFO] ------------------------------------------------------------------------
[INFO] BUILD FAILURE
[INFO] ------------------------------------------------------------------------
[INFO] Total time: 2:24.555s
[INFO] Finished at: Tue Oct 27 00:38:41 UTC 2015
[INFO] Final Memory: 54M/246M
[INFO] ------------------------------------------------------------------------
Waiting for Jenkins to finish collecting data
[ERROR] Failed to execute goal org.apache.maven.plugins:maven-surefire-plugin:2.18.1:test
(default-test) on project brooklyn-utils-common: There are test failures.
[ERROR] 
[ERROR] Please refer to <https://builds.apache.org/job/incubator-brooklyn-master-integration/ws/utils/common/target/surefire-reports>
for the individual test results.
[ERROR] -> [Help 1]
[ERROR] Failed to execute goal on project brooklyn-rt-felix: Could not resolve dependencies
for project org.apache.brooklyn:brooklyn-rt-felix:jar:0.9.0-SNAPSHOT: Could not find artifact
org.apache.brooklyn:brooklyn-rt-osgi:jar:tests:0.9.0-SNAPSHOT in Nexus (http://repository.apache.org/snapshots)
-> [Help 2]
[ERROR] Failed to execute goal on project brooklyn-core: Could not resolve dependencies for
project org.apache.brooklyn:brooklyn-core:jar:0.9.0-SNAPSHOT: The following artifacts could
not be resolved: org.apache.brooklyn:brooklyn-rt-felix:jar:0.9.0-SNAPSHOT, org.apache.brooklyn:brooklyn-rt-osgi:jar:tests:0.9.0-SNAPSHOT:
Could not find artifact org.apache.brooklyn:brooklyn-rt-felix:jar:0.9.0-SNAPSHOT in Nexus
(http://repository.apache.org/snapshots) -> [Help 2]
[ERROR] 
[ERROR] To see the full stack trace of the errors, re-run Maven with the -e switch.
[ERROR] Re-run Maven using the -X switch to enable full debug logging.
[ERROR] 
[ERROR] For more information about the errors and possible solutions, please read the following
articles:
[ERROR] [Help 1] http://cwiki.apache.org/confluence/display/MAVEN/MojoFailureException
[ERROR] [Help 2] http://cwiki.apache.org/confluence/display/MAVEN/DependencyResolutionException
[ERROR] 
[ERROR] After correcting the problems, you can resume the build with the command
[ERROR]   mvn <goals> -rf :brooklyn-utils-common
[JENKINS] Archiving <https://builds.apache.org/job/incubator-brooklyn-master-integration/ws/core/pom.xml>
to org.apache.brooklyn/brooklyn-core/0.9.0-SNAPSHOT/brooklyn-core-0.9.0-SNAPSHOT.pom
[JENKINS] Archiving <https://builds.apache.org/job/incubator-brooklyn-master-integration/ws/utils/groovy/pom.xml>
to org.apache.brooklyn/brooklyn-utils-groovy/0.9.0-SNAPSHOT/brooklyn-utils-groovy-0.9.0-SNAPSHOT.pom
[JENKINS] Archiving <https://builds.apache.org/job/incubator-brooklyn-master-integration/ws/utils/groovy/target/brooklyn-utils-groovy-0.9.0-SNAPSHOT.jar>
to org.apache.brooklyn/brooklyn-utils-groovy/0.9.0-SNAPSHOT/brooklyn-utils-groovy-0.9.0-SNAPSHOT.jar
[JENKINS] Archiving <https://builds.apache.org/job/incubator-brooklyn-master-integration/ws/utils/groovy/target/brooklyn-utils-groovy-0.9.0-SNAPSHOT-sources.jar>
to org.apache.brooklyn/brooklyn-utils-groovy/0.9.0-SNAPSHOT/brooklyn-utils-groovy-0.9.0-SNAPSHOT-sources.jar
No artifacts from incubator-brooklyn-master-integration » Brooklyn Groovy Utilities #239
to compare, so performing full copy of artifacts
[JENKINS] Archiving <https://builds.apache.org/job/incubator-brooklyn-master-integration/ws/utils/common/pom.xml>
to org.apache.brooklyn/brooklyn-utils-common/0.9.0-SNAPSHOT/brooklyn-utils-common-0.9.0-SNAPSHOT.pom
No prior successful build to compare, so performing full copy of artifacts
[JENKINS] Archiving <https://builds.apache.org/job/incubator-brooklyn-master-integration/ws/usage/logback-includes/pom.xml>
to org.apache.brooklyn/brooklyn-logback-includes/0.9.0-SNAPSHOT/brooklyn-logback-includes-0.9.0-SNAPSHOT.pom
[JENKINS] Archiving <https://builds.apache.org/job/incubator-brooklyn-master-integration/ws/usage/logback-includes/target/brooklyn-logback-includes-0.9.0-SNAPSHOT.jar>
to org.apache.brooklyn/brooklyn-logback-includes/0.9.0-SNAPSHOT/brooklyn-logback-includes-0.9.0-SNAPSHOT.jar
[JENKINS] Archiving <https://builds.apache.org/job/incubator-brooklyn-master-integration/ws/usage/logback-includes/target/brooklyn-logback-includes-0.9.0-SNAPSHOT-sources.jar>
to org.apache.brooklyn/brooklyn-logback-includes/0.9.0-SNAPSHOT/brooklyn-logback-includes-0.9.0-SNAPSHOT-sources.jar
No artifacts from incubator-brooklyn-master-integration » Brooklyn Logback Includable Configuration
#239 to compare, so performing full copy of artifacts
[JENKINS] Archiving <https://builds.apache.org/job/incubator-brooklyn-master-integration/ws/pom.xml>
to org.apache.brooklyn/brooklyn/0.9.0-SNAPSHOT/brooklyn-0.9.0-SNAPSHOT.pom
No artifacts from incubator-brooklyn-master-integration » Brooklyn Root #239 to compare,
so performing full copy of artifacts
[JENKINS] Archiving <https://builds.apache.org/job/incubator-brooklyn-master-integration/ws/utils/test-support/pom.xml>
to org.apache.brooklyn/brooklyn-utils-test-support/0.9.0-SNAPSHOT/brooklyn-utils-test-support-0.9.0-SNAPSHOT.pom
[JENKINS] Archiving <https://builds.apache.org/job/incubator-brooklyn-master-integration/ws/utils/test-support/target/brooklyn-utils-test-support-0.9.0-SNAPSHOT.jar>
to org.apache.brooklyn/brooklyn-utils-test-support/0.9.0-SNAPSHOT/brooklyn-utils-test-support-0.9.0-SNAPSHOT.jar
[JENKINS] Archiving <https://builds.apache.org/job/incubator-brooklyn-master-integration/ws/utils/test-support/target/brooklyn-utils-test-support-0.9.0-SNAPSHOT-sources.jar>
to org.apache.brooklyn/brooklyn-utils-test-support/0.9.0-SNAPSHOT/brooklyn-utils-test-support-0.9.0-SNAPSHOT-sources.jar
No artifacts from incubator-brooklyn-master-integration » Brooklyn Test Support Utilities
#239 to compare, so performing full copy of artifacts
[JENKINS] Archiving <https://builds.apache.org/job/incubator-brooklyn-master-integration/ws/utils/rt-osgi/pom.xml>
to org.apache.brooklyn/brooklyn-rt-osgi/0.9.0-SNAPSHOT/brooklyn-rt-osgi-0.9.0-SNAPSHOT.pom
[JENKINS] Archiving <https://builds.apache.org/job/incubator-brooklyn-master-integration/ws/utils/rt-osgi/target/brooklyn-rt-osgi-0.9.0-SNAPSHOT.jar>
to org.apache.brooklyn/brooklyn-rt-osgi/0.9.0-SNAPSHOT/brooklyn-rt-osgi-0.9.0-SNAPSHOT.jar
[JENKINS] Archiving <https://builds.apache.org/job/incubator-brooklyn-master-integration/ws/utils/rt-osgi/target/brooklyn-rt-osgi-0.9.0-SNAPSHOT-sources.jar>
to org.apache.brooklyn/brooklyn-rt-osgi/0.9.0-SNAPSHOT/brooklyn-rt-osgi-0.9.0-SNAPSHOT-sources.jar
No prior successful build to compare, so performing full copy of artifacts
[JENKINS] Archiving <https://builds.apache.org/job/incubator-brooklyn-master-integration/ws/usage/test-support/pom.xml>
to org.apache.brooklyn/brooklyn-test-support/0.9.0-SNAPSHOT/brooklyn-test-support-0.9.0-SNAPSHOT.pom
[JENKINS] Archiving <https://builds.apache.org/job/incubator-brooklyn-master-integration/ws/usage/test-support/target/brooklyn-test-support-0.9.0-SNAPSHOT.jar>
to org.apache.brooklyn/brooklyn-test-support/0.9.0-SNAPSHOT/brooklyn-test-support-0.9.0-SNAPSHOT.jar
[JENKINS] Archiving <https://builds.apache.org/job/incubator-brooklyn-master-integration/ws/usage/test-support/target/brooklyn-test-support-0.9.0-SNAPSHOT-sources.jar>
to org.apache.brooklyn/brooklyn-test-support/0.9.0-SNAPSHOT/brooklyn-test-support-0.9.0-SNAPSHOT-sources.jar
No artifacts from incubator-brooklyn-master-integration » Brooklyn Test Support #239 to compare,
so performing full copy of artifacts
[JENKINS] Archiving <https://builds.apache.org/job/incubator-brooklyn-master-integration/ws/utils/rt-felix/pom.xml>
to org.apache.brooklyn/brooklyn-rt-felix/0.9.0-SNAPSHOT/brooklyn-rt-felix-0.9.0-SNAPSHOT.pom
No prior successful build to compare, so performing full copy of artifacts
[JENKINS] Archiving <https://builds.apache.org/job/incubator-brooklyn-master-integration/ws/parent/pom.xml>
to org.apache.brooklyn/brooklyn-parent/0.9.0-SNAPSHOT/brooklyn-parent-0.9.0-SNAPSHOT.pom
No artifacts from incubator-brooklyn-master-integration » Brooklyn Parent Project #239 to
compare, so performing full copy of artifacts
[JENKINS] Archiving <https://builds.apache.org/job/incubator-brooklyn-master-integration/ws/api/pom.xml>
to org.apache.brooklyn/brooklyn-api/0.9.0-SNAPSHOT/brooklyn-api-0.9.0-SNAPSHOT.pom
[JENKINS] Archiving <https://builds.apache.org/job/incubator-brooklyn-master-integration/ws/api/target/brooklyn-api-0.9.0-SNAPSHOT.jar>
to org.apache.brooklyn/brooklyn-api/0.9.0-SNAPSHOT/brooklyn-api-0.9.0-SNAPSHOT.jar
[JENKINS] Archiving <https://builds.apache.org/job/incubator-brooklyn-master-integration/ws/api/target/brooklyn-api-0.9.0-SNAPSHOT-sources.jar>
to org.apache.brooklyn/brooklyn-api/0.9.0-SNAPSHOT/brooklyn-api-0.9.0-SNAPSHOT-sources.jar
No artifacts from incubator-brooklyn-master-integration » Brooklyn API #239 to compare, so
performing full copy of artifacts
channel stopped

Mime
View raw message