brooklyn-dev mailing list archives

Site index · List index
Message view « Date » · « Thread »
Top « Date » · « Thread »
From Apache Jenkins Server <jenk...@builds.apache.org>
Subject Build failed in Jenkins: incubator-brooklyn-master-windows #299
Date Mon, 05 Oct 2015 20:25:33 GMT
See <https://builds.apache.org/job/incubator-brooklyn-master-windows/299/changes>

Changes:

[valentin.aitken] MS SQL blueprint - improve installation script

[morganbwright] renamed image files and updated sql-app landing page

------------------------------------------
[...truncated 16256 lines...]
2015-10-05 19:40:34,439 INFO  BrooklynLeakListener.onFinish attempting to terminate all extant
ManagementContexts: name=Surefire test; includedGroups=[]; excludedGroups=[Integration, Acceptance,
Live, WIP]; suiteName=Surefire suite; outDir=F:\hudson\hudson-slave\workspace\incubator-brooklyn-master-windows\core\target\surefire-reports\Surefire
suite: no org.apache.brooklyn.core.management.internal.LocalManagementContext available, so
skipped
SUREFIRE-859: [GC 496867K->257849K(775488K), 0.2046500 secs]
SUREFIRE-859: [GC 498297K->257970K(775808K), 0.0960840 secs]
Tests run: 1493, Failures: 2, Errors: 0, Skipped: 1, Time elapsed: 1,084.749 sec <<<
FAILURE! - in TestSuite
concurrentResizesToSameNumberCreatesCorrectNumberOfNodes(org.apache.brooklyn.entity.group.DynamicClusterTest)
 Time elapsed: 1.963 sec  <<< FAILURE!
java.lang.AssertionError: expected [true] but found [false]
	at org.testng.Assert.fail(Assert.java:94)
	at org.testng.Assert.failNotEquals(Assert.java:494)
	at org.testng.Assert.assertTrue(Assert.java:42)
	at org.testng.Assert.assertTrue(Assert.java:52)
	at org.apache.brooklyn.entity.group.DynamicClusterTest.concurrentResizesToSameNumberCreatesCorrectNumberOfNodes(DynamicClusterTest.java:378)

testTransitionsThroughLifecycles(org.apache.brooklyn.entity.stock.BasicStartableTest)  Time
elapsed: 0.442 sec  <<< FAILURE!
java.lang.AssertionError: Expected=[starting, running, stopping, stopped], actual=[starting,
running, stopping]: Expected iterator returned more elements than the actual iterator.
	at org.testng.Assert.fail(Assert.java:94)
	at org.testng.Assert.assertEquals(Assert.java:606)
	at org.testng.Assert.assertEquals(Assert.java:643)
	at org.apache.brooklyn.entity.stock.BasicStartableTest.testTransitionsThroughLifecycles(BasicStartableTest.java:169)

2015-10-05 19:40:40,895 INFO  Brooklyn shutdown: stopping entities [TestEntityImpl{id=hdjEphcN},
TestEntityImpl{id=udXZtQ13}, BlockingEntityImpl{id=dCZ5KYrp}]

Results :

Failed tests: 
  DynamicClusterTest.concurrentResizesToSameNumberCreatesCorrectNumberOfNodes:378 expected
[true] but found [false]
  BasicStartableTest.testTransitionsThroughLifecycles:169 Expected=[starting, running, stopping,
stopped], actual=[starting, running, stopping]: Expected iterator returned more elements than
the actual iterator.

Tests run: 1493, Failures: 2, Errors: 0, Skipped: 1

[JENKINS] Recording test results
[JENKINS] Archiving disabled
[INFO]                                                                         
[INFO] ------------------------------------------------------------------------
[INFO] Skipping Brooklyn Policies
[INFO] This project has been banned from the build due to previous failures.
[INFO] ------------------------------------------------------------------------
[INFO]                                                                         
[INFO] ------------------------------------------------------------------------
[INFO] Skipping Brooklyn Jclouds Location Targets
[INFO] This project has been banned from the build due to previous failures.
[INFO] ------------------------------------------------------------------------
[INFO]                                                                         
[INFO] ------------------------------------------------------------------------
[INFO] Skipping Brooklyn Secure JMXMP Agent
[INFO] This project has been banned from the build due to previous failures.
[INFO] ------------------------------------------------------------------------
[INFO]                                                                         
[INFO] ------------------------------------------------------------------------
[INFO] Skipping Brooklyn Software Base
[INFO] This project has been banned from the build due to previous failures.
[INFO] ------------------------------------------------------------------------
[INFO]                                                                         
[INFO] ------------------------------------------------------------------------
[INFO] Skipping Brooklyn Web App Software Entities
[INFO] This project has been banned from the build due to previous failures.
[INFO] ------------------------------------------------------------------------
[INFO]                                                                         
[INFO] ------------------------------------------------------------------------
[INFO] Skipping Brooklyn Messaging Software Entities
[INFO] This project has been banned from the build due to previous failures.
[INFO] ------------------------------------------------------------------------
[INFO]                                                                         
[INFO] ------------------------------------------------------------------------
[INFO] Skipping Brooklyn Database Software Entities
[INFO] This project has been banned from the build due to previous failures.
[INFO] ------------------------------------------------------------------------
[INFO]                                                                         
[INFO] ------------------------------------------------------------------------
[INFO] Skipping Brooklyn Monitoring Software Entities
[INFO] This project has been banned from the build due to previous failures.
[INFO] ------------------------------------------------------------------------
[INFO]                                                                         
[INFO] ------------------------------------------------------------------------
[INFO] Skipping Brooklyn OSGi Software Entities
[INFO] This project has been banned from the build due to previous failures.
[INFO] ------------------------------------------------------------------------
[INFO]                                                                         
[INFO] ------------------------------------------------------------------------
[INFO] Skipping Brooklyn NoSQL Data Store Software Entities
[INFO] This project has been banned from the build due to previous failures.
[INFO] ------------------------------------------------------------------------
[INFO]                                                                         
[INFO] ------------------------------------------------------------------------
[INFO] Skipping Brooklyn Network Software Entities
[INFO] This project has been banned from the build due to previous failures.
[INFO] ------------------------------------------------------------------------
[INFO]                                                                         
[INFO] ------------------------------------------------------------------------
[INFO] Skipping Brooklyn CAMP REST API
[INFO] This project has been banned from the build due to previous failures.
[INFO] ------------------------------------------------------------------------
[INFO]                                                                         
[INFO] ------------------------------------------------------------------------
[INFO] Skipping Brooklyn REST Server
[INFO] This project has been banned from the build due to previous failures.
[INFO] ------------------------------------------------------------------------
[INFO]                                                                         
[INFO] ------------------------------------------------------------------------
[INFO] Skipping Brooklyn REST JavaScript Web GUI
[INFO] This project has been banned from the build due to previous failures.
[INFO] ------------------------------------------------------------------------
[INFO]                                                                         
[INFO] ------------------------------------------------------------------------
[INFO] Skipping Brooklyn Launcher
[INFO] This project has been banned from the build due to previous failures.
[INFO] ------------------------------------------------------------------------
[INFO]                                                                         
[INFO] ------------------------------------------------------------------------
[INFO] Skipping Brooklyn Command Line Interface
[INFO] This project has been banned from the build due to previous failures.
[INFO] ------------------------------------------------------------------------
[INFO]                                                                         
[INFO] ------------------------------------------------------------------------
[INFO] Skipping Brooklyn All Things
[INFO] This project has been banned from the build due to previous failures.
[INFO] ------------------------------------------------------------------------
[INFO]                                                                         
[INFO] ------------------------------------------------------------------------
[INFO] Skipping Brooklyn Simple Web Cluster Example
[INFO] This project has been banned from the build due to previous failures.
[INFO] ------------------------------------------------------------------------
[INFO]                                                                         
[INFO] ------------------------------------------------------------------------
[INFO] Skipping Brooklyn Global Web Fabric Example
[INFO] This project has been banned from the build due to previous failures.
[INFO] ------------------------------------------------------------------------
[INFO]                                                                         
[INFO] ------------------------------------------------------------------------
[INFO] Skipping Brooklyn Simple Messaging Publish-Subscribe Example
[INFO] This project has been banned from the build due to previous failures.
[INFO] ------------------------------------------------------------------------
[INFO]                                                                         
[INFO] ------------------------------------------------------------------------
[INFO] Skipping Brooklyn NoSQL Cluster Examples
[INFO] This project has been banned from the build due to previous failures.
[INFO] ------------------------------------------------------------------------
[INFO]                                                                         
[INFO] ------------------------------------------------------------------------
[INFO] Skipping Brooklyn Hazelcast Storage
[INFO] This project has been banned from the build due to previous failures.
[INFO] ------------------------------------------------------------------------
[INFO]                                                                         
[INFO] ------------------------------------------------------------------------
[INFO] Skipping Brooklyn Distribution
[INFO] This project has been banned from the build due to previous failures.
[INFO] ------------------------------------------------------------------------
[INFO]                                                                         
[INFO] ------------------------------------------------------------------------
[INFO] Skipping Brooklyn QA
[INFO] This project has been banned from the build due to previous failures.
[INFO] ------------------------------------------------------------------------
[INFO]                                                                         
[INFO] ------------------------------------------------------------------------
[INFO] Skipping Brooklyn REST Client
[INFO] This project has been banned from the build due to previous failures.
[INFO] ------------------------------------------------------------------------
[INFO] ------------------------------------------------------------------------
[INFO] Reactor Summary:
[INFO] 
[INFO] Brooklyn Root ..................................... SUCCESS [6.753s]
[INFO] Brooklyn Parent Project ........................... SUCCESS [23.270s]
[INFO] Brooklyn Test Support Utilities ................... SUCCESS [20.360s]
[INFO] Brooklyn Logback Includable Configuration ......... SUCCESS [5.174s]
[INFO] Brooklyn Common Utilities ......................... SUCCESS [3:12.065s]
[INFO] Brooklyn API ...................................... SUCCESS [10.933s]
[INFO] Brooklyn Test Support ............................. SUCCESS [6.622s]
[INFO] Brooklyn Groovy Utilities ......................... SUCCESS [45.044s]
[INFO] Brooklyn Core ..................................... FAILURE [20:48.008s]
[INFO] Brooklyn Policies ................................. SKIPPED
[INFO] Brooklyn Jclouds Location Targets ................. SKIPPED
[INFO] Brooklyn Secure JMXMP Agent ....................... SKIPPED
[INFO] Brooklyn Software Base ............................ SKIPPED
[INFO] Brooklyn Web App Software Entities ................ SKIPPED
[INFO] Brooklyn Messaging Software Entities .............. SKIPPED
[INFO] Brooklyn Database Software Entities ............... SKIPPED
[INFO] Brooklyn Monitoring Software Entities ............. SKIPPED
[INFO] Brooklyn OSGi Software Entities ................... SKIPPED
[INFO] Brooklyn NoSQL Data Store Software Entities ....... SKIPPED
[INFO] Brooklyn Network Software Entities ................ SKIPPED
[INFO] Brooklyn CAMP REST API ............................ SKIPPED
[INFO] Brooklyn REST Server .............................. SKIPPED
[INFO] Brooklyn REST JavaScript Web GUI .................. SKIPPED
[INFO] Brooklyn Launcher ................................. SKIPPED
[INFO] Brooklyn Command Line Interface ................... SKIPPED
[INFO] Brooklyn All Things ............................... SKIPPED
[INFO] Brooklyn Simple Web Cluster Example ............... SKIPPED
[INFO] Brooklyn Global Web Fabric Example ................ SKIPPED
[INFO] Brooklyn Simple Messaging Publish-Subscribe Example  SKIPPED
[INFO] Brooklyn NoSQL Cluster Examples ................... SKIPPED
[INFO] Brooklyn Hazelcast Storage ........................ SKIPPED
[INFO] Brooklyn Distribution ............................. SKIPPED
[INFO] Brooklyn QA ....................................... SKIPPED
[INFO] Brooklyn REST Client .............................. SKIPPED
[INFO] ------------------------------------------------------------------------
[INFO] BUILD FAILURE
[INFO] ------------------------------------------------------------------------
[INFO] Total time: 26:13.342s
[INFO] Finished at: Mon Oct 05 19:40:42 BST 2015
[INFO] Final Memory: 54M/240M
[INFO] ------------------------------------------------------------------------
[JENKINS] Archiving disabled
[JENKINS] Archiving disabled
[JENKINS] Archiving disabled
[JENKINS] Archiving disabled
[JENKINS] Archiving disabled
[JENKINS] Archiving disabled
[JENKINS] Archiving disabled
[JENKINS] Archiving disabled
[JENKINS] Archiving disabled
[JENKINS] Archiving disabled
[JENKINS] Archiving disabled
[JENKINS] Archiving disabled
[JENKINS] Archiving disabled
[JENKINS] Archiving disabled
[JENKINS] Archiving disabled
[JENKINS] Archiving disabled
[JENKINS] Archiving disabled
[JENKINS] Archiving disabled
[JENKINS] Archiving disabled
[JENKINS] Archiving disabled
[JENKINS] Archiving disabled
[JENKINS] Archiving disabled
[JENKINS] Archiving disabled
[JENKINS] Archiving disabled
[JENKINS] Archiving disabled
[JENKINS] Archiving disabled
[JENKINS] Archiving disabled
[JENKINS] Archiving disabled
[JENKINS] Archiving disabled
[JENKINS] Archiving disabled
[JENKINS] Archiving disabled
[JENKINS] Archiving disabled
[JENKINS] Archiving disabled
[JENKINS] Archiving disabled
Waiting for Jenkins to finish collecting data
[ERROR] Failed to execute goal org.apache.maven.plugins:maven-surefire-plugin:2.18.1:test
(default-test) on project brooklyn-core: There are test failures.
[ERROR] 
[ERROR] Please refer to F:\hudson\hudson-slave\workspace\incubator-brooklyn-master-windows\core\target\surefire-reports
for the individual test results.
[ERROR] -> [Help 1]
[ERROR] 
[ERROR] To see the full stack trace of the errors, re-run Maven with the -e switch.
[ERROR] Re-run Maven using the -X switch to enable full debug logging.
[ERROR] 
[ERROR] For more information about the errors and possible solutions, please read the following
articles:
[ERROR] [Help 1] http://cwiki.apache.org/confluence/display/MAVEN/MojoFailureException
[ERROR] 
[ERROR] After correcting the problems, you can resume the build with the command
[ERROR]   mvn <goals> -rf :brooklyn-core
channel stopped

Mime
View raw message