brooklyn-dev mailing list archives

Site index · List index
Message view « Date » · « Thread »
Top « Date » · « Thread »
From Apache Jenkins Server <jenk...@builds.apache.org>
Subject Build failed in Jenkins: incubator-brooklyn-master-windows #320
Date Tue, 20 Oct 2015 10:12:45 GMT
See <https://builds.apache.org/job/incubator-brooklyn-master-windows/320/changes>

Changes:

[valentin.aitken] Windows scripting documentation updates - $ErrorActionPreference -

------------------------------------------
[...truncated 30518 lines...]
2015-10-20 11:12:55,667 INFO  TESTNG PASSED CONFIGURATION: "Surefire test" - @BeforeMethod
org.apache.brooklyn.camp.brooklyn.catalog.CatalogYamlVersioningTest.setUp() finished in 709
ms
2015-10-20 11:12:55,667 INFO  TESTNG INVOKING: "Surefire test" - org.apache.brooklyn.camp.brooklyn.catalog.CatalogYamlVersioningTest.testUnversionedReference()
2015-10-20 11:12:55,782 INFO  CAMP created 'BasicApplicationImpl{id=VJ1W3n3U}'
2015-10-20 11:12:55,784 INFO  Test - created org.apache.brooklyn.camp.spi.Assembly@2e3eb980[id=VJ1W3n3U;
type=Assembly]
2015-10-20 11:12:55,784 INFO  App - BasicApplicationImpl{id=VJ1W3n3U}
2015-10-20 11:12:55,794 INFO  Started application BasicApplicationImpl{id=VJ1W3n3U}
2015-10-20 11:12:55,797 INFO  TESTNG PASSED: "Surefire test" - org.apache.brooklyn.camp.brooklyn.catalog.CatalogYamlVersioningTest.testUnversionedReference()
finished in 130 ms
2015-10-20 11:12:55,797 INFO  TESTNG INVOKING CONFIGURATION: "Surefire test" - @AfterMethod
org.apache.brooklyn.camp.brooklyn.AbstractYamlTest.tearDown()
2015-10-20 11:12:55,801 INFO  Stopping application BasicApplicationImpl{id=VJ1W3n3U}
2015-10-20 11:12:55,804 INFO  Stopped application BasicApplicationImpl{id=VJ1W3n3U}
2015-10-20 11:12:56,273 INFO  TESTNG PASSED CONFIGURATION: "Surefire test" - @AfterMethod
org.apache.brooklyn.camp.brooklyn.AbstractYamlTest.tearDown() finished in 476 ms
2015-10-20 11:12:56,274 INFO  TESTNG INVOKING CONFIGURATION: "Surefire test" - @BeforeMethod
org.apache.brooklyn.camp.brooklyn.catalog.CatalogYamlVersioningTest.setUp()
SUREFIRE-859: [GC 706114K->485123K(763968K), 0.0107382 secs]
2015-10-20 11:12:57,073 INFO  TESTNG PASSED CONFIGURATION: "Surefire test" - @BeforeMethod
org.apache.brooklyn.camp.brooklyn.catalog.CatalogYamlVersioningTest.setUp() finished in 799
ms
2015-10-20 11:12:57,073 INFO  TESTNG INVOKING: "Surefire test" - org.apache.brooklyn.camp.brooklyn.catalog.CatalogYamlVersioningTest.testVersionedReference()
SUREFIRE-859: [GC 703875K->487633K(767232K), 0.0130341 secs]
2015-10-20 11:12:57,197 INFO  CAMP created 'BasicApplicationImpl{id=nqBCRF29}'
2015-10-20 11:12:57,197 INFO  Test - created org.apache.brooklyn.camp.spi.Assembly@3469b157[id=nqBCRF29;
type=Assembly]
2015-10-20 11:12:57,198 INFO  App - BasicApplicationImpl{id=nqBCRF29}
2015-10-20 11:12:57,216 INFO  Started application BasicApplicationImpl{id=nqBCRF29}
2015-10-20 11:12:57,217 INFO  TESTNG PASSED: "Surefire test" - org.apache.brooklyn.camp.brooklyn.catalog.CatalogYamlVersioningTest.testVersionedReference()
finished in 144 ms
2015-10-20 11:12:57,217 INFO  TESTNG INVOKING CONFIGURATION: "Surefire test" - @AfterMethod
org.apache.brooklyn.camp.brooklyn.AbstractYamlTest.tearDown()
2015-10-20 11:12:57,219 INFO  Stopping application BasicApplicationImpl{id=nqBCRF29}
2015-10-20 11:12:57,221 INFO  Stopped application BasicApplicationImpl{id=nqBCRF29}
2015-10-20 11:12:57,504 INFO  TESTNG PASSED CONFIGURATION: "Surefire test" - @AfterMethod
org.apache.brooklyn.camp.brooklyn.AbstractYamlTest.tearDown() finished in 287 ms
2015-10-20 11:12:57,504 INFO  TESTNG INVOKING CONFIGURATION: "Surefire test" - @BeforeMethod
org.apache.brooklyn.camp.brooklyn.catalog.CatalogYamlVersioningTest.setUp()
SUREFIRE-859: [GC 710417K->491339K(766272K), 0.0159878 secs]
2015-10-20 11:12:58,226 INFO  TESTNG PASSED CONFIGURATION: "Surefire test" - @BeforeMethod
org.apache.brooklyn.camp.brooklyn.catalog.CatalogYamlVersioningTest.setUp() finished in 722
ms
2015-10-20 11:12:58,226 INFO  TESTNG INVOKING: "Surefire test" - org.apache.brooklyn.camp.brooklyn.catalog.CatalogYamlVersioningTest.testVersionedReferenceJustAddedExplicitVersion()
2015-10-20 11:12:58,335 INFO  CAMP created 'BasicApplicationImpl{id=xxIEFvJp}'
2015-10-20 11:12:58,336 INFO  Test - created org.apache.brooklyn.camp.spi.Assembly@1d1ad368[id=xxIEFvJp;
type=Assembly]
2015-10-20 11:12:58,336 INFO  App - BasicApplicationImpl{id=xxIEFvJp}
2015-10-20 11:12:58,353 INFO  Started application BasicApplicationImpl{id=xxIEFvJp}
2015-10-20 11:12:58,353 INFO  TESTNG PASSED: "Surefire test" - org.apache.brooklyn.camp.brooklyn.catalog.CatalogYamlVersioningTest.testVersionedReferenceJustAddedExplicitVersion()
finished in 127 ms
2015-10-20 11:12:58,354 INFO  TESTNG INVOKING CONFIGURATION: "Surefire test" - @AfterMethod
org.apache.brooklyn.camp.brooklyn.AbstractYamlTest.tearDown()
2015-10-20 11:12:58,355 INFO  Stopping application BasicApplicationImpl{id=xxIEFvJp}
2015-10-20 11:12:58,357 INFO  Stopped application BasicApplicationImpl{id=xxIEFvJp}
2015-10-20 11:12:58,718 INFO  TESTNG PASSED CONFIGURATION: "Surefire test" - @AfterMethod
org.apache.brooklyn.camp.brooklyn.AbstractYamlTest.tearDown() finished in 364 ms
2015-10-20 11:12:58,719 INFO  TESTNG INVOKING CONFIGURATION: "Surefire test" - @BeforeMethod
org.apache.brooklyn.camp.brooklyn.catalog.CatalogYamlVersioningTest.setUp()
SUREFIRE-859: [GC 714123K->490542K(769152K), 0.0106905 secs]
2015-10-20 11:12:59,395 INFO  TESTNG PASSED CONFIGURATION: "Surefire test" - @BeforeMethod
org.apache.brooklyn.camp.brooklyn.catalog.CatalogYamlVersioningTest.setUp() finished in 677
ms
2015-10-20 11:12:59,395 INFO  TESTNG INVOKING: "Surefire test" - org.apache.brooklyn.camp.brooklyn.catalog.CatalogYamlVersioningTest.testVersionedReferenceJustAddedImplicitVersionSyntax()
2015-10-20 11:12:59,493 INFO  CAMP created 'BasicApplicationImpl{id=BwbTL1nx}'
2015-10-20 11:12:59,494 INFO  Test - created org.apache.brooklyn.camp.spi.Assembly@81b4a99[id=BwbTL1nx;
type=Assembly]
2015-10-20 11:12:59,494 INFO  App - BasicApplicationImpl{id=BwbTL1nx}
2015-10-20 11:12:59,505 INFO  Started application BasicApplicationImpl{id=BwbTL1nx}
2015-10-20 11:12:59,506 INFO  TESTNG PASSED: "Surefire test" - org.apache.brooklyn.camp.brooklyn.catalog.CatalogYamlVersioningTest.testVersionedReferenceJustAddedImplicitVersionSyntax()
finished in 111 ms
2015-10-20 11:12:59,506 INFO  TESTNG INVOKING CONFIGURATION: "Surefire test" - @AfterMethod
org.apache.brooklyn.camp.brooklyn.AbstractYamlTest.tearDown()
2015-10-20 11:12:59,508 INFO  Stopping application BasicApplicationImpl{id=BwbTL1nx}
2015-10-20 11:12:59,510 INFO  Stopped application BasicApplicationImpl{id=BwbTL1nx}
2015-10-20 11:12:59,909 INFO  TESTNG PASSED CONFIGURATION: "Surefire test" - @AfterMethod
org.apache.brooklyn.camp.brooklyn.AbstractYamlTest.tearDown() finished in 403 ms
2015-10-20 11:12:59,910 INFO  TESTNG INVOKING CONFIGURATION: "Surefire test" - @BeforeMethod
org.apache.brooklyn.camp.brooklyn.AbstractYamlTest.setUp()
SUREFIRE-859: [GC 717294K->488797K(768320K), 0.0132419 secs]
SUREFIRE-859: [GC 715549K->493409K(770560K), 0.0120300 secs]
2015-10-20 11:13:00,638 INFO  TESTNG PASSED CONFIGURATION: "Surefire test" - @BeforeMethod
org.apache.brooklyn.camp.brooklyn.AbstractYamlTest.setUp() finished in 729 ms
2015-10-20 11:13:00,638 INFO  TESTNG INVOKING: "Surefire test" - org.apache.brooklyn.camp.brooklyn.spi.creation.service.ServiceTypeResolverTest.testAddCatalogItemVerySimple()
2015-10-20 11:13:00,648 INFO  TESTNG PASSED: "Surefire test" - org.apache.brooklyn.camp.brooklyn.spi.creation.service.ServiceTypeResolverTest.testAddCatalogItemVerySimple()
finished in 10 ms
2015-10-20 11:13:00,649 INFO  TESTNG INVOKING CONFIGURATION: "Surefire test" - @AfterMethod
org.apache.brooklyn.camp.brooklyn.AbstractYamlTest.tearDown()
2015-10-20 11:13:00,985 INFO  TESTNG PASSED CONFIGURATION: "Surefire test" - @AfterMethod
org.apache.brooklyn.camp.brooklyn.AbstractYamlTest.tearDown() finished in 336 ms
2015-10-20 11:13:01,040 INFO  TESTNG 
===============================================
    Surefire test
    Tests run: 227, Failures: 1, Skips: 0
===============================================
2015-10-20 11:13:01,041 INFO  BrooklynLeakListener.onFinish attempting to terminate all extant
ManagementContexts: name=Surefire test; includedGroups=[]; excludedGroups=[Integration, Acceptance,
Live, WIP]; suiteName=Surefire suite; outDir=F:\hudson\hudson-slave\workspace\incubator-brooklyn-master-windows\usage\camp\target\surefire-reports\Surefire
suite: no org.apache.brooklyn.core.management.internal.LocalManagementContext available, so
skipped
Tests run: 227, Failures: 1, Errors: 0, Skipped: 0, Time elapsed: 261.651 sec <<<
FAILURE! - in TestSuite
testRebindWithCatalogPropertiesForDeprecationAndEnablementAbsent(org.apache.brooklyn.camp.brooklyn.catalog.CatalogYamlRebindTest)
 Time elapsed: 0.227 sec  <<< FAILURE!
java.nio.file.InvalidPathException: Illegal char <:> at index 73: C:\Windows\TEMP\CatalogYamlRebindTest-jV4j\catalog\my.catalog.app.id.load:0.1.0.tTXEg6Ch.tmp
	at sun.nio.fs.WindowsPathParser.normalize(WindowsPathParser.java:176)
	at sun.nio.fs.WindowsPathParser.parse(WindowsPathParser.java:147)
	at sun.nio.fs.WindowsPathParser.parse(WindowsPathParser.java:77)
	at sun.nio.fs.WindowsPath.parse(WindowsPath.java:94)
	at sun.nio.fs.WindowsFileSystem.getPath(WindowsFileSystem.java:255)
	at java.io.File.toPath(File.java:2069)
	at org.apache.brooklyn.util.io.FilePermissions.apply(FilePermissions.java:61)
	at org.apache.brooklyn.util.io.FileUtil.setFilePermissionsTo600(FileUtil.java:72)
	at org.apache.brooklyn.core.mgmt.persist.FileBasedStoreObjectAccessor.put(FileBasedStoreObjectAccessor.java:82)
	at org.apache.brooklyn.camp.brooklyn.catalog.CatalogYamlRebindTest$1.apply(CatalogYamlRebindTest.java:216)
	at org.apache.brooklyn.camp.brooklyn.catalog.CatalogYamlRebindTest$1.apply(CatalogYamlRebindTest.java:209)
	at org.apache.brooklyn.core.mgmt.rebind.RebindTestUtils.rebindAll(RebindTestUtils.java:433)
	at org.apache.brooklyn.core.mgmt.rebind.RebindTestUtils.rebind(RebindTestUtils.java:318)
	at org.apache.brooklyn.core.mgmt.rebind.RebindTestFixture.rebind(RebindTestFixture.java:258)
	at org.apache.brooklyn.camp.brooklyn.AbstractYamlRebindTest.rebind(AbstractYamlRebindTest.java:86)
	at org.apache.brooklyn.camp.brooklyn.catalog.CatalogYamlRebindTest.runRebindWithCatalogAndApp(CatalogYamlRebindTest.java:208)
	at org.apache.brooklyn.camp.brooklyn.catalog.CatalogYamlRebindTest.testRebindWithCatalogPropertiesForDeprecationAndEnablementAbsent(CatalogYamlRebindTest.java:123)


Results :

Failed tests: 
  CatalogYamlRebindTest.testRebindWithCatalogPropertiesForDeprecationAndEnablementAbsent:123->runRebindWithCatalogAndApp:208->AbstractYamlRebindTest.rebind:86->RebindTestFixture.rebind:258
ยป InvalidPath

Tests run: 227, Failures: 1, Errors: 0, Skipped: 0

[JENKINS] Recording test results
[JENKINS] Archiving disabled
[INFO]                                                                         
[INFO] ------------------------------------------------------------------------
[INFO] Skipping Brooklyn REST Server
[INFO] This project has been banned from the build due to previous failures.
[INFO] ------------------------------------------------------------------------
[INFO]                                                                         
[INFO] ------------------------------------------------------------------------
[INFO] Skipping Brooklyn REST JavaScript Web GUI
[INFO] This project has been banned from the build due to previous failures.
[INFO] ------------------------------------------------------------------------
[INFO]                                                                         
[INFO] ------------------------------------------------------------------------
[INFO] Skipping Brooklyn Launcher
[INFO] This project has been banned from the build due to previous failures.
[INFO] ------------------------------------------------------------------------
[INFO]                                                                         
[INFO] ------------------------------------------------------------------------
[INFO] Skipping Brooklyn Command Line Interface
[INFO] This project has been banned from the build due to previous failures.
[INFO] ------------------------------------------------------------------------
[INFO]                                                                         
[INFO] ------------------------------------------------------------------------
[INFO] Skipping Brooklyn All Things
[INFO] This project has been banned from the build due to previous failures.
[INFO] ------------------------------------------------------------------------
[INFO]                                                                         
[INFO] ------------------------------------------------------------------------
[INFO] Skipping Brooklyn Simple Web Cluster Example
[INFO] This project has been banned from the build due to previous failures.
[INFO] ------------------------------------------------------------------------
[INFO]                                                                         
[INFO] ------------------------------------------------------------------------
[INFO] Skipping Brooklyn Global Web Fabric Example
[INFO] This project has been banned from the build due to previous failures.
[INFO] ------------------------------------------------------------------------
[INFO]                                                                         
[INFO] ------------------------------------------------------------------------
[INFO] Skipping Brooklyn Simple Messaging Publish-Subscribe Example
[INFO] This project has been banned from the build due to previous failures.
[INFO] ------------------------------------------------------------------------
[INFO]                                                                         
[INFO] ------------------------------------------------------------------------
[INFO] Skipping Brooklyn NoSQL Cluster Examples
[INFO] This project has been banned from the build due to previous failures.
[INFO] ------------------------------------------------------------------------
[INFO]                                                                         
[INFO] ------------------------------------------------------------------------
[INFO] Skipping Brooklyn Distribution
[INFO] This project has been banned from the build due to previous failures.
[INFO] ------------------------------------------------------------------------
[INFO]                                                                         
[INFO] ------------------------------------------------------------------------
[INFO] Skipping Brooklyn QA
[INFO] This project has been banned from the build due to previous failures.
[INFO] ------------------------------------------------------------------------
[INFO]                                                                         
[INFO] ------------------------------------------------------------------------
[INFO] Skipping Brooklyn REST Client
[INFO] This project has been banned from the build due to previous failures.
[INFO] ------------------------------------------------------------------------
[INFO] ------------------------------------------------------------------------
[INFO] Reactor Summary:
[INFO] 
[INFO] Brooklyn Root ..................................... SUCCESS [11.346s]
[INFO] Brooklyn Parent Project ........................... SUCCESS [20.927s]
[INFO] Brooklyn Logback Configuration .................... SUCCESS [12.611s]
[INFO] Brooklyn Test Support Utilities ................... SUCCESS [6.877s]
[INFO] Brooklyn Logback Includable Configuration ......... SUCCESS [3.073s]
[INFO] Brooklyn Common Utilities ......................... SUCCESS [44.143s]
[INFO] Brooklyn API ...................................... SUCCESS [21.620s]
[INFO] Brooklyn Test Support ............................. SUCCESS [8.592s]
[INFO] CAMP Server Parent Project ........................ SUCCESS [2.346s]
[INFO] CAMP Base ......................................... SUCCESS [15.617s]
[INFO] Brooklyn Groovy Utilities ......................... SUCCESS [23.803s]
[INFO] Brooklyn Core ..................................... SUCCESS [7:05.903s]
[INFO] Brooklyn Policies ................................. SUCCESS [1:47.621s]
[INFO] Brooklyn WinRM Software Entities .................. SUCCESS [14.705s]
[INFO] Brooklyn Jclouds Location Targets ................. SUCCESS [58.666s]
[INFO] Brooklyn Secure JMXMP Agent ....................... SUCCESS [13.687s]
[INFO] Brooklyn JMX RMI Agent ............................ SUCCESS [2.853s]
[INFO] Brooklyn Software Base ............................ SUCCESS [1:30.362s]
[INFO] Brooklyn Web App Software Entities ................ SUCCESS [2:17.528s]
[INFO] Brooklyn Database Software Entities ............... SUCCESS [16.391s]
[INFO] Brooklyn NoSQL Data Store Software Entities ....... SUCCESS [45.155s]
[INFO] Brooklyn CAMP REST API ............................ FAILURE [4:40.212s]
[INFO] Brooklyn REST Server .............................. SKIPPED
[INFO] Brooklyn REST JavaScript Web GUI .................. SKIPPED
[INFO] Brooklyn Launcher ................................. SKIPPED
[INFO] Brooklyn Command Line Interface ................... SKIPPED
[INFO] Brooklyn All Things ............................... SKIPPED
[INFO] Brooklyn Simple Web Cluster Example ............... SKIPPED
[INFO] Brooklyn Global Web Fabric Example ................ SKIPPED
[INFO] Brooklyn Simple Messaging Publish-Subscribe Example  SKIPPED
[INFO] Brooklyn NoSQL Cluster Examples ................... SKIPPED
[INFO] Brooklyn Distribution ............................. SKIPPED
[INFO] Brooklyn QA ....................................... SKIPPED
[INFO] Brooklyn REST Client .............................. SKIPPED
[INFO] ------------------------------------------------------------------------
[INFO] BUILD FAILURE
[INFO] ------------------------------------------------------------------------
[INFO] Total time: 23:25.480s
[INFO] Finished at: Tue Oct 20 11:13:03 BST 2015
[INFO] Final Memory: 65M/240M
[INFO] ------------------------------------------------------------------------
[JENKINS] Archiving disabled
[JENKINS] Archiving disabled
[JENKINS] Archiving disabled
[JENKINS] Archiving disabled
[JENKINS] Archiving disabled
[JENKINS] Archiving disabled
[JENKINS] Archiving disabled
[JENKINS] Archiving disabled
[JENKINS] Archiving disabled
[JENKINS] Archiving disabled
[JENKINS] Archiving disabled
[JENKINS] Archiving disabled
[JENKINS] Archiving disabled
[JENKINS] Archiving disabled
[JENKINS] Archiving disabled
[JENKINS] Archiving disabled
[JENKINS] Archiving disabled
[JENKINS] Archiving disabled
[JENKINS] Archiving disabled
[JENKINS] Archiving disabled
[JENKINS] Archiving disabled
[JENKINS] Archiving disabled
[JENKINS] Archiving disabled
[JENKINS] Archiving disabled
[JENKINS] Archiving disabled
[JENKINS] Archiving disabled
[JENKINS] Archiving disabled
[JENKINS] Archiving disabled
[JENKINS] Archiving disabled
[JENKINS] Archiving disabled
[JENKINS] Archiving disabled
[JENKINS] Archiving disabled
[JENKINS] Archiving disabled
[JENKINS] Archiving disabled
Waiting for Jenkins to finish collecting data
[ERROR] Failed to execute goal org.apache.maven.plugins:maven-surefire-plugin:2.18.1:test
(default-test) on project brooklyn-camp: There are test failures.
[ERROR] 
[ERROR] Please refer to F:\hudson\hudson-slave\workspace\incubator-brooklyn-master-windows\usage\camp\target\surefire-reports
for the individual test results.
[ERROR] -> [Help 1]
[ERROR] 
[ERROR] To see the full stack trace of the errors, re-run Maven with the -e switch.
[ERROR] Re-run Maven using the -X switch to enable full debug logging.
[ERROR] 
[ERROR] For more information about the errors and possible solutions, please read the following
articles:
[ERROR] [Help 1] http://cwiki.apache.org/confluence/display/MAVEN/MojoFailureException
[ERROR] 
[ERROR] After correcting the problems, you can resume the build with the command
[ERROR]   mvn <goals> -rf :brooklyn-camp
channel stopped

Mime
View raw message