brooklyn-dev mailing list archives

Site index · List index
Message view « Date » · « Thread »
Top « Date » · « Thread »
From Apache Jenkins Server <jenk...@builds.apache.org>
Subject Build failed in Jenkins: incubator-brooklyn-master-windows #310
Date Wed, 14 Oct 2015 15:09:12 GMT
See <https://builds.apache.org/job/incubator-brooklyn-master-windows/310/>

------------------------------------------
[...truncated 30209 lines...]
[INFO] Configuring TestNG with: TestNG652Configurator
[INFO] 2015-10-14 16:09:29,127 INFO  TESTNG RUNNING: Suite: "Surefire test" containing "2"
Tests (config: null)
[INFO] 2015-10-14 16:09:29,150 INFO  TESTNG INVOKING CONFIGURATION: "Surefire test" - @BeforeMethod
com.acme.sample.brooklyn.sample.app.SampleUnitTest.setup()
[INFO] 2015-10-14 16:09:32,503 INFO  TESTNG PASSED CONFIGURATION: "Surefire test" - @BeforeMethod
com.acme.sample.brooklyn.sample.app.SampleUnitTest.setup() finished in 3355 ms
[INFO] 2015-10-14 16:09:32,504 INFO  TESTNG INVOKING: "Surefire test" - com.acme.sample.brooklyn.sample.app.SampleUnitTest.testSampleClusterStructure()
[INFO] 2015-10-14 16:09:34,396 INFO  app from spec is: ClusterWebServerDatabaseSample{id=cwkBDbHo}
[INFO] 2015-10-14 16:09:34,401 INFO  TESTNG PASSED: "Surefire test" - com.acme.sample.brooklyn.sample.app.SampleUnitTest.testSampleClusterStructure()
finished in 1897 ms
[INFO] 2015-10-14 16:09:34,402 INFO  TESTNG INVOKING CONFIGURATION: "Surefire test" - @AfterMethod
com.acme.sample.brooklyn.sample.app.SampleUnitTest.shutdown()
[INFO] 2015-10-14 16:09:34,818 INFO  TESTNG PASSED CONFIGURATION: "Surefire test" - @AfterMethod
com.acme.sample.brooklyn.sample.app.SampleUnitTest.shutdown() finished in 416 ms
[INFO] 2015-10-14 16:09:34,820 INFO  TESTNG INVOKING CONFIGURATION: "Surefire test" - @BeforeMethod
com.acme.sample.brooklyn.sample.app.SampleUnitTest.setup()
[INFO] 2015-10-14 16:09:36,587 INFO  TESTNG PASSED CONFIGURATION: "Surefire test" - @BeforeMethod
com.acme.sample.brooklyn.sample.app.SampleUnitTest.setup() finished in 1768 ms
[INFO] 2015-10-14 16:09:36,588 INFO  TESTNG INVOKING: "Surefire test" - com.acme.sample.brooklyn.sample.app.SampleUnitTest.testSampleSingleStructure()
[INFO] 2015-10-14 16:09:36,713 INFO  app from spec is: SingleWebServerSample{id=xinrXL5l}
[INFO] 2015-10-14 16:09:36,714 INFO  TESTNG PASSED: "Surefire test" - com.acme.sample.brooklyn.sample.app.SampleUnitTest.testSampleSingleStructure()
finished in 126 ms
[INFO] 2015-10-14 16:09:36,715 INFO  TESTNG INVOKING CONFIGURATION: "Surefire test" - @AfterMethod
com.acme.sample.brooklyn.sample.app.SampleUnitTest.shutdown()
[INFO] 2015-10-14 16:09:37,054 INFO  TESTNG PASSED CONFIGURATION: "Surefire test" - @AfterMethod
com.acme.sample.brooklyn.sample.app.SampleUnitTest.shutdown() finished in 339 ms
[INFO] 2015-10-14 16:09:37,074 INFO  TESTNG 
[INFO] ===============================================
[INFO]     Surefire test
[INFO]     Tests run: 2, Failures: 0, Skips: 0
[INFO] ===============================================
[INFO] Tests run: 2, Failures: 0, Errors: 0, Skipped: 0, Time elapsed: 9.012 sec - in TestSuite
[INFO] 
[INFO] Results :
[INFO] 
[INFO] Tests run: 2, Failures: 0, Errors: 0, Skipped: 0
[INFO] 
[INFO] [INFO] 
[INFO] [INFO] --- maven-jar-plugin:2.6:jar (default-jar) @ brooklyn-sample ---
[INFO] [INFO] Building jar: F:\hudson\hudson-slave\workspace\incubator-brooklyn-master-windows\usage\archetypes\quickstart\target\test-classes\projects\integration-test-1\project\brooklyn-sample\target\brooklyn-sample-0.1.0-SNAPSHOT.jar
[INFO] [INFO] 
[INFO] [INFO] --- maven-site-plugin:3.4:attach-descriptor (attach-descriptor) @ brooklyn-sample
---
[INFO] [INFO] 
[INFO] [INFO] --- maven-jar-plugin:2.6:test-jar (test-jar-creation) @ brooklyn-sample ---
[INFO] [INFO] Building jar: F:\hudson\hudson-slave\workspace\incubator-brooklyn-master-windows\usage\archetypes\quickstart\target\test-classes\projects\integration-test-1\project\brooklyn-sample\target\brooklyn-sample-0.1.0-SNAPSHOT-tests.jar
[INFO] [INFO] 
[INFO] [INFO] --- maven-install-plugin:2.5.2:install (default-install) @ brooklyn-sample ---
[INFO] [INFO] Installing F:\hudson\hudson-slave\workspace\incubator-brooklyn-master-windows\usage\archetypes\quickstart\target\test-classes\projects\integration-test-1\project\brooklyn-sample\target\brooklyn-sample-0.1.0-SNAPSHOT.jar
to F:\hudson\hudson-slave\maven-repositories\1\com\acme\sample\brooklyn-sample\0.1.0-SNAPSHOT\brooklyn-sample-0.1.0-SNAPSHOT.jar
[INFO] [INFO] Installing F:\hudson\hudson-slave\workspace\incubator-brooklyn-master-windows\usage\archetypes\quickstart\target\test-classes\projects\integration-test-1\project\brooklyn-sample\pom.xml
to F:\hudson\hudson-slave\maven-repositories\1\com\acme\sample\brooklyn-sample\0.1.0-SNAPSHOT\brooklyn-sample-0.1.0-SNAPSHOT.pom
[INFO] [INFO] Installing F:\hudson\hudson-slave\workspace\incubator-brooklyn-master-windows\usage\archetypes\quickstart\target\test-classes\projects\integration-test-1\project\brooklyn-sample\target\brooklyn-sample-0.1.0-SNAPSHOT-tests.jar
to F:\hudson\hudson-slave\maven-repositories\1\com\acme\sample\brooklyn-sample\0.1.0-SNAPSHOT\brooklyn-sample-0.1.0-SNAPSHOT-tests.jar
[INFO] [INFO] ------------------------------------------------------------------------
[INFO] [INFO] BUILD SUCCESS
[INFO] [INFO] ------------------------------------------------------------------------
[INFO] [INFO] Total time: 31.849s
[INFO] [INFO] Finished at: Wed Oct 14 16:09:38 BST 2015
[INFO] [INFO] Final Memory: 46M/236M
[INFO] [INFO] ------------------------------------------------------------------------
[INFO] Post-archetype-generation invoker exit code: 0
[JENKINS] Recording test results
[INFO] 
[INFO] --- apache-rat-plugin:0.10:check (default) @ brooklyn-archetype-quickstart ---
[INFO] 51 implicit excludes (use -debug for more details).
[INFO] Exclude: sandbox/**
[INFO] Exclude: release/**
[INFO] Exclude: **/nbactions.xml
[INFO] Exclude: **/nb-configuration.xml
[INFO] Exclude: **/src/main/resources/archetype-resources/**/*
[INFO] Exclude: **/src/test/resources/projects/integration-test-1/goal.txt
[INFO] Exclude: **/src/test/resources/projects/integration-test-1/reference/**/*
[INFO] Exclude: **/src/main/java/sample/**/*Sample*.java
[INFO] Exclude: **/src/main/resources/logback-custom.xml
[INFO] Exclude: **/src/brooklyn-sample/README.md
[INFO] Exclude: **/src/brooklyn-sample/pom.xml
[INFO] Exclude: **/src/brooklyn-sample/src/main/assembly/files/conf/*
[INFO] Exclude: **/src/brooklyn-sample/src/main/java/**/*.java
[INFO] Exclude: **/src/brooklyn-sample/src/main/resources/logback-custom.xml
[INFO] Exclude: **/src/brooklyn-sample/src/test/java/**/*.java
[INFO] Exclude: **/.git/**
[INFO] Exclude: **/.gitignore
[INFO] Exclude: **/.repository/**
[INFO] Exclude: **/.idea/**
[INFO] Exclude: **/*.iml
[INFO] Exclude: **/.classpath/**
[INFO] Exclude: **/.project
[INFO] Exclude: **/.settings/**
[INFO] Exclude: **/*.log
[INFO] Exclude: **/brooklyn*.log.*
[INFO] Exclude: **/target/**
[INFO] Exclude: ignored/**
[INFO] Exclude: LICENSE.md
[INFO] Exclude: **/src/main/license/**
[INFO] Exclude: **/src/test/license/**
[INFO] Exclude: **/MANIFEST.MF
[INFO] Exclude: **/test-output/**
[INFO] Exclude: **/*.pem.pub
[INFO] Exclude: **/*.pem
[INFO] Exclude: **/*_rsa.pub
[INFO] Exclude: **/*_rsa
[INFO] Exclude: **/*.svg
[INFO] Exclude: **/*.crt
[INFO] Exclude: **/*.csr
[INFO] Exclude: **/*.key
[INFO] Exclude: **/*.key.org
[INFO] Exclude: **/*.psd
[INFO] Exclude: **/*.json
[INFO] Exclude: **/*.plxarc
[INFO] Exclude: **/src/test/resources/org/apache/brooklyn/entity/software/base/template_with_extra_substitutions.txt
[INFO] Exclude: **/src/main/resources/banner.txt
[INFO] Exclude: **/src/test/resources/ssl/certs/localhost/info.txt
[INFO] Exclude: **/sandbox/examples/src/main/scripts/amis.txt
[INFO] Exclude: docs/**
[INFO] 9 resources included (use -debug for more details)
[INFO] Rat check: Summary of files. Unapproved: 0 unknown: 0 generated: 0 approved: 7 licence.
[INFO] 
[INFO] --- maven-source-plugin:2.4:jar-no-fork (attach-sources) @ brooklyn-archetype-quickstart
---
[INFO] Building jar: F:\hudson\hudson-slave\workspace\incubator-brooklyn-master-windows\usage\archetypes\quickstart\target\brooklyn-archetype-quickstart-0.9.0-SNAPSHOT-sources.jar
[INFO] 
[INFO] --- maven-install-plugin:2.5.2:install (default-install) @ brooklyn-archetype-quickstart
---
[INFO] Installing F:\hudson\hudson-slave\workspace\incubator-brooklyn-master-windows\usage\archetypes\quickstart\target\brooklyn-archetype-quickstart-0.9.0-SNAPSHOT.jar
to f:\hudson\hudson-slave\maven-repositories\1\org\apache\brooklyn\brooklyn-archetype-quickstart\0.9.0-SNAPSHOT\brooklyn-archetype-quickstart-0.9.0-SNAPSHOT.jar
[INFO] Installing F:\hudson\hudson-slave\workspace\incubator-brooklyn-master-windows\usage\archetypes\quickstart\pom.xml
to f:\hudson\hudson-slave\maven-repositories\1\org\apache\brooklyn\brooklyn-archetype-quickstart\0.9.0-SNAPSHOT\brooklyn-archetype-quickstart-0.9.0-SNAPSHOT.pom
[INFO] Installing F:\hudson\hudson-slave\workspace\incubator-brooklyn-master-windows\usage\archetypes\quickstart\target\brooklyn-archetype-quickstart-0.9.0-SNAPSHOT-tests.jar
to f:\hudson\hudson-slave\maven-repositories\1\org\apache\brooklyn\brooklyn-archetype-quickstart\0.9.0-SNAPSHOT\brooklyn-archetype-quickstart-0.9.0-SNAPSHOT-tests.jar
[INFO] Installing F:\hudson\hudson-slave\workspace\incubator-brooklyn-master-windows\usage\archetypes\quickstart\target\brooklyn-archetype-quickstart-0.9.0-SNAPSHOT-sources.jar
to f:\hudson\hudson-slave\maven-repositories\1\org\apache\brooklyn\brooklyn-archetype-quickstart\0.9.0-SNAPSHOT\brooklyn-archetype-quickstart-0.9.0-SNAPSHOT-sources.jar
[INFO] 
[INFO] --- maven-archetype-plugin:2.3:update-local-catalog (default-update-local-catalog)
@ brooklyn-archetype-quickstart ---
[JENKINS] Archiving disabled
[INFO]                                                                         
[INFO] ------------------------------------------------------------------------
[INFO] Skipping Brooklyn Distribution
[INFO] This project has been banned from the build due to previous failures.
[INFO] ------------------------------------------------------------------------
[INFO]                                                                         
[INFO] ------------------------------------------------------------------------
[INFO] Skipping Brooklyn QA
[INFO] This project has been banned from the build due to previous failures.
[INFO] ------------------------------------------------------------------------
[INFO]                                                                         
[INFO] ------------------------------------------------------------------------
[INFO] Skipping Brooklyn REST Client
[INFO] This project has been banned from the build due to previous failures.
[INFO] ------------------------------------------------------------------------
[INFO] ------------------------------------------------------------------------
[INFO] Reactor Summary:
[INFO] 
[INFO] Brooklyn Root ..................................... SUCCESS [2.137s]
[INFO] Brooklyn Parent Project ........................... SUCCESS [4.667s]
[INFO] Brooklyn Logback Configuration .................... SUCCESS [4.955s]
[INFO] Brooklyn Test Support Utilities ................... SUCCESS [3.393s]
[INFO] Brooklyn Logback Includable Configuration ......... SUCCESS [2.895s]
[INFO] Brooklyn Common Utilities ......................... SUCCESS [26.222s]
[INFO] Brooklyn API ...................................... SUCCESS [6.454s]
[INFO] Brooklyn Test Support ............................. SUCCESS [3.109s]
[INFO] Brooklyn Downstream Project Parent ................ SUCCESS [0.224s]
[INFO] CAMP Server Parent Project ........................ SUCCESS [0.396s]
[INFO] CAMP Base ......................................... SUCCESS [6.512s]
[INFO] Brooklyn REST Swagger Apidoc Utilities ............ SUCCESS [4.099s]
[INFO] CAMP Server ....................................... SUCCESS [11.426s]
[INFO] Brooklyn Groovy Utilities ......................... SUCCESS [9.787s]
[INFO] Brooklyn Core ..................................... SUCCESS [4:12.374s]
[INFO] Brooklyn Examples Aggregator Project .............. SUCCESS [0.550s]
[INFO] Brooklyn Examples Aggregator Project - Webapps .... SUCCESS [0.295s]
[INFO] hello-world-webapp Maven Webapp ................... SUCCESS [1.758s]
[INFO] hello-world-sql-webapp Maven Webapp ............... SUCCESS [2.739s]
[INFO] Brooklyn Policies ................................. SUCCESS [1:51.748s]
[INFO] Brooklyn Jclouds Location Targets ................. SUCCESS [49.594s]
[INFO] Brooklyn Secure JMXMP Agent ....................... SUCCESS [13.821s]
[INFO] Brooklyn JMX RMI Agent ............................ SUCCESS [4.495s]
[INFO] Brooklyn Software Base ............................ SUCCESS [1:32.507s]
[INFO] Brooklyn Web App Software Entities ................ SUCCESS [2:08.402s]
[INFO] Brooklyn Messaging Software Entities .............. SUCCESS [17.292s]
[INFO] Brooklyn Database Software Entities ............... SUCCESS [11.152s]
[INFO] Brooklyn Monitoring Software Entities ............. SUCCESS [7.556s]
[INFO] Brooklyn OSGi Software Entities ................... SUCCESS [9.140s]
[INFO] Brooklyn NoSQL Data Store Software Entities ....... SUCCESS [28.050s]
[INFO] Brooklyn Network Software Entities ................ SUCCESS [9.118s]
[INFO] Brooklyn REST API ................................. SUCCESS [7.503s]
[INFO] Brooklyn CAMP REST API ............................ FAILURE [4:16.125s]
[INFO] Brooklyn REST Server .............................. SKIPPED
[INFO] Brooklyn REST JavaScript Web GUI .................. SKIPPED
[INFO] Brooklyn Launcher ................................. SKIPPED
[INFO] Brooklyn Command Line Interface ................... SKIPPED
[INFO] Brooklyn All Things ............................... SKIPPED
[INFO] Brooklyn Simple Web Cluster Example ............... SKIPPED
[INFO] Brooklyn Global Web Fabric Example ................ SKIPPED
[INFO] Brooklyn Simple Messaging Publish-Subscribe Example  SKIPPED
[INFO] Brooklyn NoSQL Cluster Examples ................... SKIPPED
[INFO] Brooklyn Hazelcast Storage ........................ SUCCESS [7.547s]
[INFO] Brooklyn Quick-Start Project Archetype ............ SUCCESS [37.372s]
[INFO] Brooklyn Distribution ............................. SKIPPED
[INFO] Brooklyn QA ....................................... SKIPPED
[INFO] Brooklyn REST Client .............................. SKIPPED
[INFO] ------------------------------------------------------------------------
[INFO] BUILD FAILURE
[INFO] ------------------------------------------------------------------------
[INFO] Total time: 19:06.259s
[INFO] Finished at: Wed Oct 14 16:09:39 BST 2015
[INFO] Final Memory: 74M/242M
[INFO] ------------------------------------------------------------------------
[JENKINS] Archiving disabled
[JENKINS] Archiving disabled
[JENKINS] Archiving disabled
[JENKINS] Archiving disabled
[JENKINS] Archiving disabled
[JENKINS] Archiving disabled
[JENKINS] Archiving disabled
[JENKINS] Archiving disabled
[JENKINS] Archiving disabled
[JENKINS] Archiving disabled
[JENKINS] Archiving disabled
[JENKINS] Archiving disabled
[JENKINS] Archiving disabled
[JENKINS] Archiving disabled
[JENKINS] Archiving disabled
[JENKINS] Archiving disabled
[JENKINS] Archiving disabled
[JENKINS] Archiving disabled
[JENKINS] Archiving disabled
[JENKINS] Archiving disabled
[JENKINS] Archiving disabled
[JENKINS] Archiving disabled
[JENKINS] Archiving disabled
[JENKINS] Archiving disabled
[JENKINS] Archiving disabled
[JENKINS] Archiving disabled
[JENKINS] Archiving disabled
[JENKINS] Archiving disabled
[JENKINS] Archiving disabled
[JENKINS] Archiving disabled
[JENKINS] Archiving disabled
[JENKINS] Archiving disabled
[JENKINS] Archiving disabled
[JENKINS] Archiving disabled
[JENKINS] Archiving disabled
[JENKINS] Archiving disabled
[JENKINS] Archiving disabled
[JENKINS] Archiving disabled
[JENKINS] Archiving disabled
[JENKINS] Archiving disabled
[JENKINS] Archiving disabled
[JENKINS] Archiving disabled
[JENKINS] Archiving disabled
[JENKINS] Archiving disabled
[JENKINS] Archiving disabled
[JENKINS] Archiving disabled
[JENKINS] Archiving disabled
Waiting for Jenkins to finish collecting data
[ERROR] Failed to execute goal org.apache.maven.plugins:maven-surefire-plugin:2.18.1:test
(default-test) on project brooklyn-camp: There are test failures.
[ERROR] 
[ERROR] Please refer to F:\hudson\hudson-slave\workspace\incubator-brooklyn-master-windows\usage\camp\target\surefire-reports
for the individual test results.
[ERROR] -> [Help 1]
[ERROR] 
[ERROR] To see the full stack trace of the errors, re-run Maven with the -e switch.
[ERROR] Re-run Maven using the -X switch to enable full debug logging.
[ERROR] 
[ERROR] For more information about the errors and possible solutions, please read the following
articles:
[ERROR] [Help 1] http://cwiki.apache.org/confluence/display/MAVEN/MojoFailureException
[ERROR] 
[ERROR] After correcting the problems, you can resume the build with the command
[ERROR]   mvn <goals> -rf :brooklyn-camp
channel stopped

Mime
View raw message