brooklyn-dev mailing list archives

Site index · List index
Message view « Date » · « Thread »
Top « Date » · « Thread »
From Apache Jenkins Server <jenk...@builds.apache.org>
Subject Build failed in Jenkins: incubator-brooklyn-master-windows #318
Date Mon, 19 Oct 2015 13:38:35 GMT
See <https://builds.apache.org/job/incubator-brooklyn-master-windows/318/changes>

Changes:

[thomas.bouron] Add support for correct configkey conversion from the app wizard UI

[thomas.bouron] Add support for correct configkey conversion from the app wizard UI -

------------------------------------------
[...truncated 30372 lines...]
2015-10-19 14:39:06,846 INFO  TESTNG PASSED CONFIGURATION: "Surefire test" - @BeforeMethod
org.apache.brooklyn.camp.brooklyn.catalog.CatalogYamlVersioningTest.setUp() finished in 937
ms
2015-10-19 14:39:06,847 INFO  TESTNG INVOKING: "Surefire test" - org.apache.brooklyn.camp.brooklyn.catalog.CatalogYamlVersioningTest.testUnversionedReference()
2015-10-19 14:39:07,058 INFO  CAMP created 'BasicApplicationImpl{id=oSoUEIya}'
2015-10-19 14:39:07,058 INFO  Test - created org.apache.brooklyn.camp.spi.Assembly@35b07b7b[id=oSoUEIya;
type=Assembly]
2015-10-19 14:39:07,059 INFO  App - BasicApplicationImpl{id=oSoUEIya}
2015-10-19 14:39:07,075 INFO  Started application BasicApplicationImpl{id=oSoUEIya}
2015-10-19 14:39:07,076 INFO  TESTNG PASSED: "Surefire test" - org.apache.brooklyn.camp.brooklyn.catalog.CatalogYamlVersioningTest.testUnversionedReference()
finished in 229 ms
2015-10-19 14:39:07,076 INFO  TESTNG INVOKING CONFIGURATION: "Surefire test" - @AfterMethod
org.apache.brooklyn.camp.brooklyn.AbstractYamlTest.tearDown()
2015-10-19 14:39:07,078 INFO  Stopping application BasicApplicationImpl{id=oSoUEIya}
2015-10-19 14:39:07,080 INFO  Stopped application BasicApplicationImpl{id=oSoUEIya}
2015-10-19 14:39:07,443 INFO  TESTNG PASSED CONFIGURATION: "Surefire test" - @AfterMethod
org.apache.brooklyn.camp.brooklyn.AbstractYamlTest.tearDown() finished in 367 ms
2015-10-19 14:39:07,443 INFO  TESTNG INVOKING CONFIGURATION: "Surefire test" - @BeforeMethod
org.apache.brooklyn.camp.brooklyn.catalog.CatalogYamlVersioningTest.setUp()
SUREFIRE-859: [GC 690803K->476573K(763776K), 0.0181867 secs]
2015-10-19 14:39:08,132 INFO  TESTNG PASSED CONFIGURATION: "Surefire test" - @BeforeMethod
org.apache.brooklyn.camp.brooklyn.catalog.CatalogYamlVersioningTest.setUp() finished in 688
ms
2015-10-19 14:39:08,132 INFO  TESTNG INVOKING: "Surefire test" - org.apache.brooklyn.camp.brooklyn.catalog.CatalogYamlVersioningTest.testVersionedReference()
2015-10-19 14:39:08,243 INFO  CAMP created 'BasicApplicationImpl{id=De33C0s8}'
2015-10-19 14:39:08,244 INFO  Test - created org.apache.brooklyn.camp.spi.Assembly@66401174[id=De33C0s8;
type=Assembly]
2015-10-19 14:39:08,248 INFO  App - BasicApplicationImpl{id=De33C0s8}
2015-10-19 14:39:08,250 INFO  Started application BasicApplicationImpl{id=De33C0s8}
2015-10-19 14:39:08,250 INFO  TESTNG PASSED: "Surefire test" - org.apache.brooklyn.camp.brooklyn.catalog.CatalogYamlVersioningTest.testVersionedReference()
finished in 118 ms
2015-10-19 14:39:08,251 INFO  TESTNG INVOKING CONFIGURATION: "Surefire test" - @AfterMethod
org.apache.brooklyn.camp.brooklyn.AbstractYamlTest.tearDown()
2015-10-19 14:39:08,252 INFO  Stopping application BasicApplicationImpl{id=De33C0s8}
2015-10-19 14:39:08,253 INFO  Stopped application BasicApplicationImpl{id=De33C0s8}
2015-10-19 14:39:08,607 INFO  TESTNG PASSED CONFIGURATION: "Surefire test" - @AfterMethod
org.apache.brooklyn.camp.brooklyn.AbstractYamlTest.tearDown() finished in 356 ms
2015-10-19 14:39:08,607 INFO  TESTNG INVOKING CONFIGURATION: "Surefire test" - @BeforeMethod
org.apache.brooklyn.camp.brooklyn.catalog.CatalogYamlVersioningTest.setUp()
SUREFIRE-859: [GC 694685K->474645K(767232K), 0.0114118 secs]
SUREFIRE-859: [GC 697525K->477929K(766528K), 0.0136626 secs]
2015-10-19 14:39:09,276 INFO  TESTNG PASSED CONFIGURATION: "Surefire test" - @BeforeMethod
org.apache.brooklyn.camp.brooklyn.catalog.CatalogYamlVersioningTest.setUp() finished in 669
ms
2015-10-19 14:39:09,276 INFO  TESTNG INVOKING: "Surefire test" - org.apache.brooklyn.camp.brooklyn.catalog.CatalogYamlVersioningTest.testVersionedReferenceJustAddedExplicitVersion()
2015-10-19 14:39:09,403 INFO  CAMP created 'BasicApplicationImpl{id=TnfYNK1g}'
2015-10-19 14:39:09,404 INFO  Test - created org.apache.brooklyn.camp.spi.Assembly@2e62f019[id=TnfYNK1g;
type=Assembly]
2015-10-19 14:39:09,404 INFO  App - BasicApplicationImpl{id=TnfYNK1g}
2015-10-19 14:39:09,411 INFO  Started application BasicApplicationImpl{id=TnfYNK1g}
2015-10-19 14:39:09,412 INFO  TESTNG PASSED: "Surefire test" - org.apache.brooklyn.camp.brooklyn.catalog.CatalogYamlVersioningTest.testVersionedReferenceJustAddedExplicitVersion()
finished in 136 ms
2015-10-19 14:39:09,412 INFO  TESTNG INVOKING CONFIGURATION: "Surefire test" - @AfterMethod
org.apache.brooklyn.camp.brooklyn.AbstractYamlTest.tearDown()
2015-10-19 14:39:09,414 INFO  Stopping application BasicApplicationImpl{id=TnfYNK1g}
2015-10-19 14:39:09,417 INFO  Stopped application BasicApplicationImpl{id=TnfYNK1g}
2015-10-19 14:39:09,820 INFO  TESTNG PASSED CONFIGURATION: "Surefire test" - @AfterMethod
org.apache.brooklyn.camp.brooklyn.AbstractYamlTest.tearDown() finished in 408 ms
2015-10-19 14:39:09,821 INFO  TESTNG INVOKING CONFIGURATION: "Surefire test" - @BeforeMethod
org.apache.brooklyn.camp.brooklyn.catalog.CatalogYamlVersioningTest.setUp()
SUREFIRE-859: [GC 700969K->481463K(769536K), 0.0233756 secs]
2015-10-19 14:39:10,686 INFO  TESTNG PASSED CONFIGURATION: "Surefire test" - @BeforeMethod
org.apache.brooklyn.camp.brooklyn.catalog.CatalogYamlVersioningTest.setUp() finished in 865
ms
2015-10-19 14:39:10,686 INFO  TESTNG INVOKING: "Surefire test" - org.apache.brooklyn.camp.brooklyn.catalog.CatalogYamlVersioningTest.testVersionedReferenceJustAddedImplicitVersionSyntax()
2015-10-19 14:39:10,804 INFO  CAMP created 'BasicApplicationImpl{id=nPn9MLud}'
2015-10-19 14:39:10,804 INFO  Test - created org.apache.brooklyn.camp.spi.Assembly@97d014e[id=nPn9MLud;
type=Assembly]
2015-10-19 14:39:10,804 INFO  App - BasicApplicationImpl{id=nPn9MLud}
2015-10-19 14:39:10,812 INFO  Started application BasicApplicationImpl{id=nPn9MLud}
2015-10-19 14:39:10,813 INFO  TESTNG PASSED: "Surefire test" - org.apache.brooklyn.camp.brooklyn.catalog.CatalogYamlVersioningTest.testVersionedReferenceJustAddedImplicitVersionSyntax()
finished in 127 ms
2015-10-19 14:39:10,814 INFO  TESTNG INVOKING CONFIGURATION: "Surefire test" - @AfterMethod
org.apache.brooklyn.camp.brooklyn.AbstractYamlTest.tearDown()
2015-10-19 14:39:10,817 INFO  Stopping application BasicApplicationImpl{id=nPn9MLud}
2015-10-19 14:39:10,820 INFO  Stopped application BasicApplicationImpl{id=nPn9MLud}
2015-10-19 14:39:11,305 INFO  TESTNG PASSED CONFIGURATION: "Surefire test" - @AfterMethod
org.apache.brooklyn.camp.brooklyn.AbstractYamlTest.tearDown() finished in 491 ms
2015-10-19 14:39:11,305 INFO  TESTNG INVOKING CONFIGURATION: "Surefire test" - @BeforeMethod
org.apache.brooklyn.camp.brooklyn.AbstractYamlTest.setUp()
SUREFIRE-859: [GC 708663K->480213K(768384K), 0.0134525 secs]
2015-10-19 14:39:12,249 INFO  TESTNG PASSED CONFIGURATION: "Surefire test" - @BeforeMethod
org.apache.brooklyn.camp.brooklyn.AbstractYamlTest.setUp() finished in 944 ms
2015-10-19 14:39:12,249 INFO  TESTNG INVOKING: "Surefire test" - org.apache.brooklyn.camp.brooklyn.spi.creation.service.ServiceTypeResolverTest.testAddCatalogItemVerySimple()
2015-10-19 14:39:12,263 INFO  TESTNG PASSED: "Surefire test" - org.apache.brooklyn.camp.brooklyn.spi.creation.service.ServiceTypeResolverTest.testAddCatalogItemVerySimple()
finished in 14 ms
2015-10-19 14:39:12,263 INFO  TESTNG INVOKING CONFIGURATION: "Surefire test" - @AfterMethod
org.apache.brooklyn.camp.brooklyn.AbstractYamlTest.tearDown()
2015-10-19 14:39:12,658 INFO  TESTNG PASSED CONFIGURATION: "Surefire test" - @AfterMethod
org.apache.brooklyn.camp.brooklyn.AbstractYamlTest.tearDown() finished in 395 ms
2015-10-19 14:39:12,721 INFO  TESTNG 
===============================================
    Surefire test
    Tests run: 227, Failures: 1, Skips: 0
===============================================
2015-10-19 14:39:12,722 INFO  BrooklynLeakListener.onFinish attempting to terminate all extant
ManagementContexts: name=Surefire test; includedGroups=[]; excludedGroups=[Integration, Acceptance,
Live, WIP]; suiteName=Surefire suite; outDir=F:\hudson\hudson-slave\workspace\incubator-brooklyn-master-windows\usage\camp\target\surefire-reports\Surefire
suite: no org.apache.brooklyn.core.management.internal.LocalManagementContext available, so
skipped
SUREFIRE-859: [GC 707413K->478368K(770624K), 0.0102619 secs]
Tests run: 227, Failures: 1, Errors: 0, Skipped: 0, Time elapsed: 326.795 sec <<<
FAILURE! - in TestSuite
testRebindWithCatalogPropertiesForDeprecationAndEnablementAbsent(org.apache.brooklyn.camp.brooklyn.catalog.CatalogYamlRebindTest)
 Time elapsed: 0.263 sec  <<< FAILURE!
java.nio.file.InvalidPathException: Illegal char <:> at index 73: C:\Windows\TEMP\CatalogYamlRebindTest-Htly\catalog\my.catalog.app.id.load:0.1.0.xwA29gYW.tmp
	at sun.nio.fs.WindowsPathParser.normalize(WindowsPathParser.java:176)
	at sun.nio.fs.WindowsPathParser.parse(WindowsPathParser.java:147)
	at sun.nio.fs.WindowsPathParser.parse(WindowsPathParser.java:77)
	at sun.nio.fs.WindowsPath.parse(WindowsPath.java:94)
	at sun.nio.fs.WindowsFileSystem.getPath(WindowsFileSystem.java:255)
	at java.io.File.toPath(File.java:2069)
	at org.apache.brooklyn.util.io.FilePermissions.apply(FilePermissions.java:61)
	at org.apache.brooklyn.util.io.FileUtil.setFilePermissionsTo600(FileUtil.java:72)
	at org.apache.brooklyn.core.mgmt.persist.FileBasedStoreObjectAccessor.put(FileBasedStoreObjectAccessor.java:82)
	at org.apache.brooklyn.camp.brooklyn.catalog.CatalogYamlRebindTest$1.apply(CatalogYamlRebindTest.java:216)
	at org.apache.brooklyn.camp.brooklyn.catalog.CatalogYamlRebindTest$1.apply(CatalogYamlRebindTest.java:209)
	at org.apache.brooklyn.core.mgmt.rebind.RebindTestUtils.rebindAll(RebindTestUtils.java:433)
	at org.apache.brooklyn.core.mgmt.rebind.RebindTestUtils.rebind(RebindTestUtils.java:318)
	at org.apache.brooklyn.core.mgmt.rebind.RebindTestFixture.rebind(RebindTestFixture.java:258)
	at org.apache.brooklyn.camp.brooklyn.AbstractYamlRebindTest.rebind(AbstractYamlRebindTest.java:86)
	at org.apache.brooklyn.camp.brooklyn.catalog.CatalogYamlRebindTest.runRebindWithCatalogAndApp(CatalogYamlRebindTest.java:208)
	at org.apache.brooklyn.camp.brooklyn.catalog.CatalogYamlRebindTest.testRebindWithCatalogPropertiesForDeprecationAndEnablementAbsent(CatalogYamlRebindTest.java:123)


Results :

Failed tests: 
  CatalogYamlRebindTest.testRebindWithCatalogPropertiesForDeprecationAndEnablementAbsent:123->runRebindWithCatalogAndApp:208->AbstractYamlRebindTest.rebind:86->RebindTestFixture.rebind:258
ยป InvalidPath

Tests run: 227, Failures: 1, Errors: 0, Skipped: 0

[JENKINS] Recording test results
[JENKINS] Archiving disabled
[INFO]                                                                         
[INFO] ------------------------------------------------------------------------
[INFO] Skipping Brooklyn REST Server
[INFO] This project has been banned from the build due to previous failures.
[INFO] ------------------------------------------------------------------------
[INFO]                                                                         
[INFO] ------------------------------------------------------------------------
[INFO] Skipping Brooklyn REST JavaScript Web GUI
[INFO] This project has been banned from the build due to previous failures.
[INFO] ------------------------------------------------------------------------
[INFO]                                                                         
[INFO] ------------------------------------------------------------------------
[INFO] Skipping Brooklyn Launcher
[INFO] This project has been banned from the build due to previous failures.
[INFO] ------------------------------------------------------------------------
[INFO]                                                                         
[INFO] ------------------------------------------------------------------------
[INFO] Skipping Brooklyn Command Line Interface
[INFO] This project has been banned from the build due to previous failures.
[INFO] ------------------------------------------------------------------------
[INFO]                                                                         
[INFO] ------------------------------------------------------------------------
[INFO] Skipping Brooklyn All Things
[INFO] This project has been banned from the build due to previous failures.
[INFO] ------------------------------------------------------------------------
[INFO]                                                                         
[INFO] ------------------------------------------------------------------------
[INFO] Skipping Brooklyn Simple Web Cluster Example
[INFO] This project has been banned from the build due to previous failures.
[INFO] ------------------------------------------------------------------------
[INFO]                                                                         
[INFO] ------------------------------------------------------------------------
[INFO] Skipping Brooklyn Global Web Fabric Example
[INFO] This project has been banned from the build due to previous failures.
[INFO] ------------------------------------------------------------------------
[INFO]                                                                         
[INFO] ------------------------------------------------------------------------
[INFO] Skipping Brooklyn Simple Messaging Publish-Subscribe Example
[INFO] This project has been banned from the build due to previous failures.
[INFO] ------------------------------------------------------------------------
[INFO]                                                                         
[INFO] ------------------------------------------------------------------------
[INFO] Skipping Brooklyn NoSQL Cluster Examples
[INFO] This project has been banned from the build due to previous failures.
[INFO] ------------------------------------------------------------------------
[INFO]                                                                         
[INFO] ------------------------------------------------------------------------
[INFO] Skipping Brooklyn Distribution
[INFO] This project has been banned from the build due to previous failures.
[INFO] ------------------------------------------------------------------------
[INFO]                                                                         
[INFO] ------------------------------------------------------------------------
[INFO] Skipping Brooklyn QA
[INFO] This project has been banned from the build due to previous failures.
[INFO] ------------------------------------------------------------------------
[INFO]                                                                         
[INFO] ------------------------------------------------------------------------
[INFO] Skipping Brooklyn REST Client
[INFO] This project has been banned from the build due to previous failures.
[INFO] ------------------------------------------------------------------------
[INFO] ------------------------------------------------------------------------
[INFO] Reactor Summary:
[INFO] 
[INFO] Brooklyn Root ..................................... SUCCESS [2.257s]
[INFO] Brooklyn Parent Project ........................... SUCCESS [8.169s]
[INFO] Brooklyn Logback Configuration .................... SUCCESS [7.503s]
[INFO] Brooklyn Test Support Utilities ................... SUCCESS [4.284s]
[INFO] Brooklyn Logback Includable Configuration ......... SUCCESS [2.669s]
[INFO] Brooklyn Common Utilities ......................... SUCCESS [33.654s]
[INFO] Brooklyn API ...................................... SUCCESS [5.749s]
[INFO] Brooklyn Test Support ............................. SUCCESS [3.921s]
[INFO] CAMP Server Parent Project ........................ SUCCESS [0.553s]
[INFO] CAMP Base ......................................... SUCCESS [21.286s]
[INFO] Brooklyn Groovy Utilities ......................... SUCCESS [14.839s]
[INFO] Brooklyn Core ..................................... SUCCESS [4:59.128s]
[INFO] Brooklyn Policies ................................. SUCCESS [1:50.518s]
[INFO] Brooklyn WinRM Software Entities .................. SUCCESS [14.858s]
[INFO] Brooklyn Jclouds Location Targets ................. SUCCESS [57.320s]
[INFO] Brooklyn Secure JMXMP Agent ....................... SUCCESS [13.687s]
[INFO] Brooklyn JMX RMI Agent ............................ SUCCESS [2.964s]
[INFO] Brooklyn Software Base ............................ SUCCESS [1:36.499s]
[INFO] Brooklyn Web App Software Entities ................ SUCCESS [2:17.542s]
[INFO] Brooklyn Database Software Entities ............... SUCCESS [14.927s]
[INFO] Brooklyn NoSQL Data Store Software Entities ....... SUCCESS [46.947s]
[INFO] Brooklyn CAMP REST API ............................ FAILURE [5:45.425s]
[INFO] Brooklyn REST Server .............................. SKIPPED
[INFO] Brooklyn REST JavaScript Web GUI .................. SKIPPED
[INFO] Brooklyn Launcher ................................. SKIPPED
[INFO] Brooklyn Command Line Interface ................... SKIPPED
[INFO] Brooklyn All Things ............................... SKIPPED
[INFO] Brooklyn Simple Web Cluster Example ............... SKIPPED
[INFO] Brooklyn Global Web Fabric Example ................ SKIPPED
[INFO] Brooklyn Simple Messaging Publish-Subscribe Example  SKIPPED
[INFO] Brooklyn NoSQL Cluster Examples ................... SKIPPED
[INFO] Brooklyn Distribution ............................. SKIPPED
[INFO] Brooklyn QA ....................................... SKIPPED
[INFO] Brooklyn REST Client .............................. SKIPPED
[INFO] ------------------------------------------------------------------------
[INFO] BUILD FAILURE
[INFO] ------------------------------------------------------------------------
[INFO] Total time: 20:54.538s
[INFO] Finished at: Mon Oct 19 14:39:16 BST 2015
[INFO] Final Memory: 65M/239M
[INFO] ------------------------------------------------------------------------
[JENKINS] Archiving disabled
[JENKINS] Archiving disabled
[JENKINS] Archiving disabled
[JENKINS] Archiving disabled
[JENKINS] Archiving disabled
[JENKINS] Archiving disabled
[JENKINS] Archiving disabled
[JENKINS] Archiving disabled
[JENKINS] Archiving disabled
[JENKINS] Archiving disabled
[JENKINS] Archiving disabled
[JENKINS] Archiving disabled
[JENKINS] Archiving disabled
[JENKINS] Archiving disabled
[JENKINS] Archiving disabled
[JENKINS] Archiving disabled
[JENKINS] Archiving disabled
[JENKINS] Archiving disabled
[JENKINS] Archiving disabled
[JENKINS] Archiving disabled
[JENKINS] Archiving disabled
[JENKINS] Archiving disabled
[JENKINS] Archiving disabled
[JENKINS] Archiving disabled
[JENKINS] Archiving disabled
[JENKINS] Archiving disabled
[JENKINS] Archiving disabled
[JENKINS] Archiving disabled
[JENKINS] Archiving disabled
[JENKINS] Archiving disabled
[JENKINS] Archiving disabled
[JENKINS] Archiving disabled
[JENKINS] Archiving disabled
[JENKINS] Archiving disabled
Waiting for Jenkins to finish collecting data
[ERROR] Failed to execute goal org.apache.maven.plugins:maven-surefire-plugin:2.18.1:test
(default-test) on project brooklyn-camp: There are test failures.
[ERROR] 
[ERROR] Please refer to F:\hudson\hudson-slave\workspace\incubator-brooklyn-master-windows\usage\camp\target\surefire-reports
for the individual test results.
[ERROR] -> [Help 1]
[ERROR] 
[ERROR] To see the full stack trace of the errors, re-run Maven with the -e switch.
[ERROR] Re-run Maven using the -X switch to enable full debug logging.
[ERROR] 
[ERROR] For more information about the errors and possible solutions, please read the following
articles:
[ERROR] [Help 1] http://cwiki.apache.org/confluence/display/MAVEN/MojoFailureException
[ERROR] 
[ERROR] After correcting the problems, you can resume the build with the command
[ERROR]   mvn <goals> -rf :brooklyn-camp
channel stopped

Mime
View raw message