brooklyn-dev mailing list archives

Site index · List index
Message view « Date » · « Thread »
Top « Date » · « Thread »
From Apache Jenkins Server <jenk...@builds.apache.org>
Subject Build failed in Jenkins: incubator-brooklyn-master-windows #316
Date Mon, 19 Oct 2015 10:08:04 GMT
See <https://builds.apache.org/job/incubator-brooklyn-master-windows/316/changes>

Changes:

[mike.zaccardo] Add sequential ID number to each DynamicCluster member

[github] Get a valid execution context even if no entity is available.

[github] Trivial tidies.

[github] Support deferred suppliers within location config.

[github] Tag execution contexts (hence all submitted tasks) with the current

[github] DslExternal obtains mgmt context without requiring an in-scope entity.

[github] Enable passing unit test.

------------------------------------------
[...truncated 30255 lines...]
2015-10-19 11:08:29,451 INFO  TESTNG PASSED CONFIGURATION: "Surefire test" - @BeforeMethod
org.apache.brooklyn.camp.brooklyn.catalog.CatalogYamlVersioningTest.setUp() finished in 1271
ms
2015-10-19 11:08:29,452 INFO  TESTNG INVOKING: "Surefire test" - org.apache.brooklyn.camp.brooklyn.catalog.CatalogYamlVersioningTest.testUnversionedReference()
2015-10-19 11:08:29,588 INFO  CAMP created 'BasicApplicationImpl{id=mwQEKhba}'
2015-10-19 11:08:29,589 INFO  Test - created org.apache.brooklyn.camp.spi.Assembly@9d5de1c[id=mwQEKhba;
type=Assembly]
2015-10-19 11:08:29,589 INFO  App - BasicApplicationImpl{id=mwQEKhba}
2015-10-19 11:08:29,609 INFO  Started application BasicApplicationImpl{id=mwQEKhba}
2015-10-19 11:08:29,610 INFO  TESTNG PASSED: "Surefire test" - org.apache.brooklyn.camp.brooklyn.catalog.CatalogYamlVersioningTest.testUnversionedReference()
finished in 158 ms
2015-10-19 11:08:29,611 INFO  TESTNG INVOKING CONFIGURATION: "Surefire test" - @AfterMethod
org.apache.brooklyn.camp.brooklyn.AbstractYamlTest.tearDown()
2015-10-19 11:08:29,613 INFO  Stopping application BasicApplicationImpl{id=mwQEKhba}
2015-10-19 11:08:29,615 INFO  Stopped application BasicApplicationImpl{id=mwQEKhba}
2015-10-19 11:08:30,119 INFO  TESTNG PASSED CONFIGURATION: "Surefire test" - @AfterMethod
org.apache.brooklyn.camp.brooklyn.AbstractYamlTest.tearDown() finished in 509 ms
2015-10-19 11:08:30,120 INFO  TESTNG INVOKING CONFIGURATION: "Surefire test" - @BeforeMethod
org.apache.brooklyn.camp.brooklyn.catalog.CatalogYamlVersioningTest.setUp()
SUREFIRE-859: [GC 682386K->469348K(766528K), 0.0178252 secs]
2015-10-19 11:08:30,924 INFO  TESTNG PASSED CONFIGURATION: "Surefire test" - @BeforeMethod
org.apache.brooklyn.camp.brooklyn.catalog.CatalogYamlVersioningTest.setUp() finished in 805
ms
2015-10-19 11:08:30,924 INFO  TESTNG INVOKING: "Surefire test" - org.apache.brooklyn.camp.brooklyn.catalog.CatalogYamlVersioningTest.testVersionedReference()
2015-10-19 11:08:31,050 INFO  CAMP created 'BasicApplicationImpl{id=pa7TimCy}'
2015-10-19 11:08:31,051 INFO  Test - created org.apache.brooklyn.camp.spi.Assembly@5c95d00d[id=pa7TimCy;
type=Assembly]
2015-10-19 11:08:31,051 INFO  App - BasicApplicationImpl{id=pa7TimCy}
2015-10-19 11:08:31,058 INFO  Started application BasicApplicationImpl{id=pa7TimCy}
2015-10-19 11:08:31,058 INFO  TESTNG PASSED: "Surefire test" - org.apache.brooklyn.camp.brooklyn.catalog.CatalogYamlVersioningTest.testVersionedReference()
finished in 134 ms
2015-10-19 11:08:31,059 INFO  TESTNG INVOKING CONFIGURATION: "Surefire test" - @AfterMethod
org.apache.brooklyn.camp.brooklyn.AbstractYamlTest.tearDown()
2015-10-19 11:08:31,060 INFO  Stopping application BasicApplicationImpl{id=pa7TimCy}
2015-10-19 11:08:31,062 INFO  Stopped application BasicApplicationImpl{id=pa7TimCy}
2015-10-19 11:08:31,645 INFO  TESTNG PASSED CONFIGURATION: "Surefire test" - @AfterMethod
org.apache.brooklyn.camp.brooklyn.AbstractYamlTest.tearDown() finished in 585 ms
2015-10-19 11:08:31,645 INFO  TESTNG INVOKING CONFIGURATION: "Surefire test" - @BeforeMethod
org.apache.brooklyn.camp.brooklyn.catalog.CatalogYamlVersioningTest.setUp()
SUREFIRE-859: [GC 690276K->467562K(765120K), 0.0120806 secs]
2015-10-19 11:08:32,610 INFO  TESTNG PASSED CONFIGURATION: "Surefire test" - @BeforeMethod
org.apache.brooklyn.camp.brooklyn.catalog.CatalogYamlVersioningTest.setUp() finished in 965
ms
2015-10-19 11:08:32,610 INFO  TESTNG INVOKING: "Surefire test" - org.apache.brooklyn.camp.brooklyn.catalog.CatalogYamlVersioningTest.testVersionedReferenceJustAddedExplicitVersion()
SUREFIRE-859: [GC 688490K->470382K(768320K), 0.0145485 secs]
2015-10-19 11:08:32,737 INFO  CAMP created 'BasicApplicationImpl{id=EI7IyslG}'
2015-10-19 11:08:32,738 INFO  Test - created org.apache.brooklyn.camp.spi.Assembly@2301dafa[id=EI7IyslG;
type=Assembly]
2015-10-19 11:08:32,738 INFO  App - BasicApplicationImpl{id=EI7IyslG}
2015-10-19 11:08:32,743 INFO  Started application BasicApplicationImpl{id=EI7IyslG}
2015-10-19 11:08:32,744 INFO  TESTNG PASSED: "Surefire test" - org.apache.brooklyn.camp.brooklyn.catalog.CatalogYamlVersioningTest.testVersionedReferenceJustAddedExplicitVersion()
finished in 134 ms
2015-10-19 11:08:32,744 INFO  TESTNG INVOKING CONFIGURATION: "Surefire test" - @AfterMethod
org.apache.brooklyn.camp.brooklyn.AbstractYamlTest.tearDown()
2015-10-19 11:08:32,746 INFO  Stopping application BasicApplicationImpl{id=EI7IyslG}
2015-10-19 11:08:32,749 INFO  Stopped application BasicApplicationImpl{id=EI7IyslG}
2015-10-19 11:08:33,612 INFO  TESTNG PASSED CONFIGURATION: "Surefire test" - @AfterMethod
org.apache.brooklyn.camp.brooklyn.AbstractYamlTest.tearDown() finished in 868 ms
2015-10-19 11:08:33,613 INFO  TESTNG INVOKING CONFIGURATION: "Surefire test" - @BeforeMethod
org.apache.brooklyn.camp.brooklyn.catalog.CatalogYamlVersioningTest.setUp()
SUREFIRE-859: [GC 695278K->474351K(767296K), 0.0207753 secs]
2015-10-19 11:08:34,484 INFO  TESTNG PASSED CONFIGURATION: "Surefire test" - @BeforeMethod
org.apache.brooklyn.camp.brooklyn.catalog.CatalogYamlVersioningTest.setUp() finished in 871
ms
2015-10-19 11:08:34,485 INFO  TESTNG INVOKING: "Surefire test" - org.apache.brooklyn.camp.brooklyn.catalog.CatalogYamlVersioningTest.testVersionedReferenceJustAddedImplicitVersionSyntax()
2015-10-19 11:08:34,603 INFO  CAMP created 'BasicApplicationImpl{id=k85dWKOI}'
2015-10-19 11:08:34,604 INFO  Test - created org.apache.brooklyn.camp.spi.Assembly@47dad9a1[id=k85dWKOI;
type=Assembly]
2015-10-19 11:08:34,604 INFO  App - BasicApplicationImpl{id=k85dWKOI}
2015-10-19 11:08:34,612 INFO  Started application BasicApplicationImpl{id=k85dWKOI}
2015-10-19 11:08:34,613 INFO  TESTNG PASSED: "Surefire test" - org.apache.brooklyn.camp.brooklyn.catalog.CatalogYamlVersioningTest.testVersionedReferenceJustAddedImplicitVersionSyntax()
finished in 128 ms
2015-10-19 11:08:34,613 INFO  TESTNG INVOKING CONFIGURATION: "Surefire test" - @AfterMethod
org.apache.brooklyn.camp.brooklyn.AbstractYamlTest.tearDown()
2015-10-19 11:08:34,615 INFO  Stopping application BasicApplicationImpl{id=k85dWKOI}
2015-10-19 11:08:34,619 INFO  Stopped application BasicApplicationImpl{id=k85dWKOI}
2015-10-19 11:08:35,169 INFO  TESTNG PASSED CONFIGURATION: "Surefire test" - @AfterMethod
org.apache.brooklyn.camp.brooklyn.AbstractYamlTest.tearDown() finished in 556 ms
2015-10-19 11:08:35,169 INFO  TESTNG INVOKING CONFIGURATION: "Surefire test" - @BeforeMethod
org.apache.brooklyn.camp.brooklyn.AbstractYamlTest.setUp()
SUREFIRE-859: [GC 699247K->472974K(770240K), 0.0119890 secs]
2015-10-19 11:08:36,103 INFO  TESTNG PASSED CONFIGURATION: "Surefire test" - @BeforeMethod
org.apache.brooklyn.camp.brooklyn.AbstractYamlTest.setUp() finished in 934 ms
2015-10-19 11:08:36,103 INFO  TESTNG INVOKING: "Surefire test" - org.apache.brooklyn.camp.brooklyn.spi.creation.service.ServiceTypeResolverTest.testAddCatalogItemVerySimple()
2015-10-19 11:08:36,130 INFO  TESTNG PASSED: "Surefire test" - org.apache.brooklyn.camp.brooklyn.spi.creation.service.ServiceTypeResolverTest.testAddCatalogItemVerySimple()
finished in 27 ms
2015-10-19 11:08:36,131 INFO  TESTNG INVOKING CONFIGURATION: "Surefire test" - @AfterMethod
org.apache.brooklyn.camp.brooklyn.AbstractYamlTest.tearDown()
2015-10-19 11:08:36,927 INFO  TESTNG PASSED CONFIGURATION: "Surefire test" - @AfterMethod
org.apache.brooklyn.camp.brooklyn.AbstractYamlTest.tearDown() finished in 796 ms
2015-10-19 11:08:37,005 INFO  TESTNG 
===============================================
    Surefire test
    Tests run: 227, Failures: 1, Skips: 0
===============================================
2015-10-19 11:08:37,007 INFO  BrooklynLeakListener.onFinish attempting to terminate all extant
ManagementContexts: name=Surefire test; includedGroups=[]; excludedGroups=[Integration, Acceptance,
Live, WIP]; suiteName=Surefire suite; outDir=F:\hudson\hudson-slave\workspace\incubator-brooklyn-master-windows\usage\camp\target\surefire-reports\Surefire
suite: no org.apache.brooklyn.core.management.internal.LocalManagementContext available, so
skipped
SUREFIRE-859: [GC 701966K->471054K(769472K), 0.0114841 secs]
Tests run: 227, Failures: 1, Errors: 0, Skipped: 0, Time elapsed: 330.3 sec <<< FAILURE!
- in TestSuite
testRebindWithCatalogPropertiesForDeprecationAndEnablementAbsent(org.apache.brooklyn.camp.brooklyn.catalog.CatalogYamlRebindTest)
 Time elapsed: 0.242 sec  <<< FAILURE!
java.nio.file.InvalidPathException: Illegal char <:> at index 73: C:\Windows\TEMP\CatalogYamlRebindTest-cnXb\catalog\my.catalog.app.id.load:0.1.0.Kj37fDHq.tmp
	at sun.nio.fs.WindowsPathParser.normalize(WindowsPathParser.java:176)
	at sun.nio.fs.WindowsPathParser.parse(WindowsPathParser.java:147)
	at sun.nio.fs.WindowsPathParser.parse(WindowsPathParser.java:77)
	at sun.nio.fs.WindowsPath.parse(WindowsPath.java:94)
	at sun.nio.fs.WindowsFileSystem.getPath(WindowsFileSystem.java:255)
	at java.io.File.toPath(File.java:2069)
	at org.apache.brooklyn.util.io.FilePermissions.apply(FilePermissions.java:61)
	at org.apache.brooklyn.util.io.FileUtil.setFilePermissionsTo600(FileUtil.java:72)
	at org.apache.brooklyn.core.mgmt.persist.FileBasedStoreObjectAccessor.put(FileBasedStoreObjectAccessor.java:82)
	at org.apache.brooklyn.camp.brooklyn.catalog.CatalogYamlRebindTest$1.apply(CatalogYamlRebindTest.java:216)
	at org.apache.brooklyn.camp.brooklyn.catalog.CatalogYamlRebindTest$1.apply(CatalogYamlRebindTest.java:209)
	at org.apache.brooklyn.core.mgmt.rebind.RebindTestUtils.rebindAll(RebindTestUtils.java:433)
	at org.apache.brooklyn.core.mgmt.rebind.RebindTestUtils.rebind(RebindTestUtils.java:318)
	at org.apache.brooklyn.core.mgmt.rebind.RebindTestFixture.rebind(RebindTestFixture.java:258)
	at org.apache.brooklyn.camp.brooklyn.AbstractYamlRebindTest.rebind(AbstractYamlRebindTest.java:86)
	at org.apache.brooklyn.camp.brooklyn.catalog.CatalogYamlRebindTest.runRebindWithCatalogAndApp(CatalogYamlRebindTest.java:208)
	at org.apache.brooklyn.camp.brooklyn.catalog.CatalogYamlRebindTest.testRebindWithCatalogPropertiesForDeprecationAndEnablementAbsent(CatalogYamlRebindTest.java:123)


Results :

Failed tests: 
  CatalogYamlRebindTest.testRebindWithCatalogPropertiesForDeprecationAndEnablementAbsent:123->runRebindWithCatalogAndApp:208->AbstractYamlRebindTest.rebind:86->RebindTestFixture.rebind:258
ยป InvalidPath

Tests run: 227, Failures: 1, Errors: 0, Skipped: 0

[JENKINS] Recording test results
[JENKINS] Archiving disabled
[INFO]                                                                         
[INFO] ------------------------------------------------------------------------
[INFO] Skipping Brooklyn REST Server
[INFO] This project has been banned from the build due to previous failures.
[INFO] ------------------------------------------------------------------------
[INFO]                                                                         
[INFO] ------------------------------------------------------------------------
[INFO] Skipping Brooklyn REST JavaScript Web GUI
[INFO] This project has been banned from the build due to previous failures.
[INFO] ------------------------------------------------------------------------
[INFO]                                                                         
[INFO] ------------------------------------------------------------------------
[INFO] Skipping Brooklyn Launcher
[INFO] This project has been banned from the build due to previous failures.
[INFO] ------------------------------------------------------------------------
[INFO]                                                                         
[INFO] ------------------------------------------------------------------------
[INFO] Skipping Brooklyn Command Line Interface
[INFO] This project has been banned from the build due to previous failures.
[INFO] ------------------------------------------------------------------------
[INFO]                                                                         
[INFO] ------------------------------------------------------------------------
[INFO] Skipping Brooklyn All Things
[INFO] This project has been banned from the build due to previous failures.
[INFO] ------------------------------------------------------------------------
[INFO]                                                                         
[INFO] ------------------------------------------------------------------------
[INFO] Skipping Brooklyn Simple Web Cluster Example
[INFO] This project has been banned from the build due to previous failures.
[INFO] ------------------------------------------------------------------------
[INFO]                                                                         
[INFO] ------------------------------------------------------------------------
[INFO] Skipping Brooklyn Global Web Fabric Example
[INFO] This project has been banned from the build due to previous failures.
[INFO] ------------------------------------------------------------------------
[INFO]                                                                         
[INFO] ------------------------------------------------------------------------
[INFO] Skipping Brooklyn Simple Messaging Publish-Subscribe Example
[INFO] This project has been banned from the build due to previous failures.
[INFO] ------------------------------------------------------------------------
[INFO]                                                                         
[INFO] ------------------------------------------------------------------------
[INFO] Skipping Brooklyn NoSQL Cluster Examples
[INFO] This project has been banned from the build due to previous failures.
[INFO] ------------------------------------------------------------------------
[INFO]                                                                         
[INFO] ------------------------------------------------------------------------
[INFO] Skipping Brooklyn Distribution
[INFO] This project has been banned from the build due to previous failures.
[INFO] ------------------------------------------------------------------------
[INFO]                                                                         
[INFO] ------------------------------------------------------------------------
[INFO] Skipping Brooklyn QA
[INFO] This project has been banned from the build due to previous failures.
[INFO] ------------------------------------------------------------------------
[INFO]                                                                         
[INFO] ------------------------------------------------------------------------
[INFO] Skipping Brooklyn REST Client
[INFO] This project has been banned from the build due to previous failures.
[INFO] ------------------------------------------------------------------------
[INFO] ------------------------------------------------------------------------
[INFO] Reactor Summary:
[INFO] 
[INFO] Brooklyn Root ..................................... SUCCESS [3.497s]
[INFO] Brooklyn Parent Project ........................... SUCCESS [6.572s]
[INFO] Brooklyn Logback Configuration .................... SUCCESS [6.868s]
[INFO] Brooklyn Test Support Utilities ................... SUCCESS [5.415s]
[INFO] Brooklyn Logback Includable Configuration ......... SUCCESS [2.665s]
[INFO] Brooklyn Common Utilities ......................... SUCCESS [29.810s]
[INFO] Brooklyn API ...................................... SUCCESS [7.450s]
[INFO] Brooklyn Test Support ............................. SUCCESS [4.638s]
[INFO] CAMP Server Parent Project ........................ SUCCESS [0.989s]
[INFO] CAMP Base ......................................... SUCCESS [7.931s]
[INFO] Brooklyn Groovy Utilities ......................... SUCCESS [24.777s]
[INFO] Brooklyn Core ..................................... SUCCESS [4:40.442s]
[INFO] Brooklyn Policies ................................. SUCCESS [1:47.477s]
[INFO] Brooklyn WinRM Software Entities .................. SUCCESS [14.329s]
[INFO] Brooklyn Jclouds Location Targets ................. SUCCESS [57.249s]
[INFO] Brooklyn Secure JMXMP Agent ....................... SUCCESS [13.269s]
[INFO] Brooklyn JMX RMI Agent ............................ SUCCESS [3.835s]
[INFO] Brooklyn Software Base ............................ SUCCESS [1:34.302s]
[INFO] Brooklyn Web App Software Entities ................ SUCCESS [2:19.380s]
[INFO] Brooklyn Database Software Entities ............... SUCCESS [18.181s]
[INFO] Brooklyn NoSQL Data Store Software Entities ....... SUCCESS [51.314s]
[INFO] Brooklyn CAMP REST API ............................ FAILURE [5:58.541s]
[INFO] Brooklyn REST Server .............................. SKIPPED
[INFO] Brooklyn REST JavaScript Web GUI .................. SKIPPED
[INFO] Brooklyn Launcher ................................. SKIPPED
[INFO] Brooklyn Command Line Interface ................... SKIPPED
[INFO] Brooklyn All Things ............................... SKIPPED
[INFO] Brooklyn Simple Web Cluster Example ............... SKIPPED
[INFO] Brooklyn Global Web Fabric Example ................ SKIPPED
[INFO] Brooklyn Simple Messaging Publish-Subscribe Example  SKIPPED
[INFO] Brooklyn NoSQL Cluster Examples ................... SKIPPED
[INFO] Brooklyn Distribution ............................. SKIPPED
[INFO] Brooklyn QA ....................................... SKIPPED
[INFO] Brooklyn REST Client .............................. SKIPPED
[INFO] ------------------------------------------------------------------------
[INFO] BUILD FAILURE
[INFO] ------------------------------------------------------------------------
[INFO] Total time: 20:54.999s
[INFO] Finished at: Mon Oct 19 11:08:40 BST 2015
[INFO] Final Memory: 62M/239M
[INFO] ------------------------------------------------------------------------
[JENKINS] Archiving disabled
[JENKINS] Archiving disabled
[JENKINS] Archiving disabled
[JENKINS] Archiving disabled
[JENKINS] Archiving disabled
[JENKINS] Archiving disabled
[JENKINS] Archiving disabled
[JENKINS] Archiving disabled
[JENKINS] Archiving disabled
[JENKINS] Archiving disabled
[JENKINS] Archiving disabled
[JENKINS] Archiving disabled
[JENKINS] Archiving disabled
[JENKINS] Archiving disabled
[JENKINS] Archiving disabled
[JENKINS] Archiving disabled
[JENKINS] Archiving disabled
[JENKINS] Archiving disabled
[JENKINS] Archiving disabled
[JENKINS] Archiving disabled
[JENKINS] Archiving disabled
[JENKINS] Archiving disabled
[JENKINS] Archiving disabled
[JENKINS] Archiving disabled
[JENKINS] Archiving disabled
[JENKINS] Archiving disabled
[JENKINS] Archiving disabled
[JENKINS] Archiving disabled
[JENKINS] Archiving disabled
[JENKINS] Archiving disabled
[JENKINS] Archiving disabled
[JENKINS] Archiving disabled
[JENKINS] Archiving disabled
[JENKINS] Archiving disabled
Waiting for Jenkins to finish collecting data
[ERROR] Failed to execute goal org.apache.maven.plugins:maven-surefire-plugin:2.18.1:test
(default-test) on project brooklyn-camp: There are test failures.
[ERROR] 
[ERROR] Please refer to F:\hudson\hudson-slave\workspace\incubator-brooklyn-master-windows\usage\camp\target\surefire-reports
for the individual test results.
[ERROR] -> [Help 1]
[ERROR] 
[ERROR] To see the full stack trace of the errors, re-run Maven with the -e switch.
[ERROR] Re-run Maven using the -X switch to enable full debug logging.
[ERROR] 
[ERROR] For more information about the errors and possible solutions, please read the following
articles:
[ERROR] [Help 1] http://cwiki.apache.org/confluence/display/MAVEN/MojoFailureException
[ERROR] 
[ERROR] After correcting the problems, you can resume the build with the command
[ERROR]   mvn <goals> -rf :brooklyn-camp
channel stopped

Mime
View raw message