brooklyn-dev mailing list archives

Site index · List index
Message view « Date » · « Thread »
Top « Date » · « Thread »
From Apache Jenkins Server <jenk...@builds.apache.org>
Subject Build failed in Jenkins: incubator-brooklyn-master-windows #271
Date Tue, 01 Sep 2015 16:03:42 GMT
See <https://builds.apache.org/job/incubator-brooklyn-master-windows/271/changes>

Changes:

[ivana.yovcheva] Fixed some language mistakes in 'About the code' doc page

[github] Initial types for external config suppliers, and registry of same.

[github] Bootstrap external config suppliers from brooklyn properties.

[github] Add external-config-supplier registry to management context.

[github] Brooklyn YAML supports deferred value resolution via $brooklyn:external().

[github] Added basic concrete ExternalConfigSupplier implementations.

[github] Make Brooklyn management context available to config suppliers.

[github] Tighten-up generics in concrete implementations.

[github] Switch to new Brooklyn package names.

[aled.sage] Handle class-renames in persisted state

[alex.heneveld] Builds on #872 to add renamed-class checks in a few other places classes are
loaded.

[alex.heneveld] rename non-java mentions of classes which have been moved -- in plans, comments,
and docs

[alex.heneveld] fix download links and add reference to snapshots

[alex.heneveld] styling of download page, align boxes

[alex.heneveld] improve linking from main downloads to version downloads page

[alex.heneveld] tidy up docs learnmore/catalog, showing locations instead of enrichers, and
removing old static pages

[alex.heneveld] change release notes for 080, and add migration guide

[alex.heneveld] update release notes for externalized config

------------------------------------------
[...truncated 28000 lines...]
2015-09-01 15:32:40,294 INFO  CAMP placing 'BasicApplicationImpl{id=VPIZi5tW}' under management
2015-09-01 15:32:40,295 INFO  Test - created org.apache.brooklyn.camp.spi.Assembly@6929baf1[id=VPIZi5tW;
type=Assembly]
2015-09-01 15:32:40,296 INFO  App - BasicApplicationImpl{id=VPIZi5tW}
SUREFIRE-859: [GC 401636K->204372K(753792K), 0.0085905 secs]
2015-09-01 15:32:40,311 INFO  Started application BasicApplicationImpl{id=VPIZi5tW}
2015-09-01 15:32:40,311 INFO  TESTNG PASSED: "Surefire test" - org.apache.brooklyn.camp.brooklyn.catalog.CatalogYamlVersioningTest.testVersionedReferenceJustAddedExplicitVersion()
finished in 67 ms
2015-09-01 15:32:40,312 INFO  TESTNG INVOKING CONFIGURATION: "Surefire test" - @AfterMethod
org.apache.brooklyn.camp.brooklyn.AbstractYamlTest.tearDown()
2015-09-01 15:32:40,313 INFO  Stopping application BasicApplicationImpl{id=VPIZi5tW}
2015-09-01 15:32:40,315 INFO  Stopped application BasicApplicationImpl{id=VPIZi5tW}
2015-09-01 15:32:40,549 INFO  TESTNG PASSED CONFIGURATION: "Surefire test" - @AfterMethod
org.apache.brooklyn.camp.brooklyn.AbstractYamlTest.tearDown() finished in 238 ms
2015-09-01 15:32:40,550 INFO  TESTNG INVOKING CONFIGURATION: "Surefire test" - @BeforeMethod
org.apache.brooklyn.camp.brooklyn.catalog.CatalogYamlVersioningTest.setUp()
2015-09-01 15:32:40,827 INFO  TESTNG PASSED CONFIGURATION: "Surefire test" - @BeforeMethod
org.apache.brooklyn.camp.brooklyn.catalog.CatalogYamlVersioningTest.setUp() finished in 278
ms
2015-09-01 15:32:40,827 INFO  TESTNG INVOKING: "Surefire test" - org.apache.brooklyn.camp.brooklyn.catalog.CatalogYamlVersioningTest.testVersionedReferenceJustAddedImplicitVersionSyntax()
2015-09-01 15:32:40,878 INFO  CAMP placing 'BasicApplicationImpl{id=aGVxuTJv}' under management
2015-09-01 15:32:40,880 INFO  Test - created org.apache.brooklyn.camp.spi.Assembly@12a0d0ae[id=aGVxuTJv;
type=Assembly]
2015-09-01 15:32:40,880 INFO  App - BasicApplicationImpl{id=aGVxuTJv}
2015-09-01 15:32:40,885 INFO  Started application BasicApplicationImpl{id=aGVxuTJv}
2015-09-01 15:32:40,886 INFO  TESTNG PASSED: "Surefire test" - org.apache.brooklyn.camp.brooklyn.catalog.CatalogYamlVersioningTest.testVersionedReferenceJustAddedImplicitVersionSyntax()
finished in 59 ms
2015-09-01 15:32:40,886 INFO  TESTNG INVOKING CONFIGURATION: "Surefire test" - @AfterMethod
org.apache.brooklyn.camp.brooklyn.AbstractYamlTest.tearDown()
2015-09-01 15:32:40,887 INFO  Stopping application BasicApplicationImpl{id=aGVxuTJv}
2015-09-01 15:32:40,890 INFO  Stopped application BasicApplicationImpl{id=aGVxuTJv}
2015-09-01 15:32:41,012 INFO  TESTNG PASSED CONFIGURATION: "Surefire test" - @AfterMethod
org.apache.brooklyn.camp.brooklyn.AbstractYamlTest.tearDown() finished in 126 ms
2015-09-01 15:32:41,013 INFO  TESTNG INVOKING: "Surefire test" - org.apache.brooklyn.camp.brooklyn.spi.dsl.DslParseTest.testParseFunctionChain()
2015-09-01 15:32:41,013 INFO  TESTNG PASSED: "Surefire test" - org.apache.brooklyn.camp.brooklyn.spi.dsl.DslParseTest.testParseFunctionChain()
finished in 0 ms
2015-09-01 15:32:41,013 INFO  TESTNG INVOKING: "Surefire test" - org.apache.brooklyn.camp.brooklyn.spi.dsl.DslParseTest.testParseMultiArgMultiTypeFunction()
2015-09-01 15:32:41,013 INFO  TESTNG PASSED: "Surefire test" - org.apache.brooklyn.camp.brooklyn.spi.dsl.DslParseTest.testParseMultiArgMultiTypeFunction()
finished in 0 ms
2015-09-01 15:32:41,014 INFO  TESTNG INVOKING: "Surefire test" - org.apache.brooklyn.camp.brooklyn.spi.dsl.DslParseTest.testParseNoArgFunction()
2015-09-01 15:32:41,014 INFO  TESTNG PASSED: "Surefire test" - org.apache.brooklyn.camp.brooklyn.spi.dsl.DslParseTest.testParseNoArgFunction()
finished in 0 ms
2015-09-01 15:32:41,014 INFO  TESTNG INVOKING: "Surefire test" - org.apache.brooklyn.camp.brooklyn.spi.dsl.DslParseTest.testParseOneArgFunction()
2015-09-01 15:32:41,014 INFO  TESTNG PASSED: "Surefire test" - org.apache.brooklyn.camp.brooklyn.spi.dsl.DslParseTest.testParseOneArgFunction()
finished in 0 ms
2015-09-01 15:32:41,015 INFO  TESTNG INVOKING: "Surefire test" - org.apache.brooklyn.camp.brooklyn.spi.dsl.DslParseTest.testParseString()
2015-09-01 15:32:41,015 INFO  TESTNG PASSED: "Surefire test" - org.apache.brooklyn.camp.brooklyn.spi.dsl.DslParseTest.testParseString()
finished in 0 ms
2015-09-01 15:32:41,015 INFO  TESTNG INVOKING CONFIGURATION: "Surefire test" - @BeforeMethod
org.apache.brooklyn.camp.brooklyn.test.lite.CampYamlLiteTest.setUp()
SUREFIRE-859: [GC 402388K->204768K(757632K), 0.0085461 secs]
2015-09-01 15:32:41,350 INFO  TESTNG PASSED CONFIGURATION: "Surefire test" - @BeforeMethod
org.apache.brooklyn.camp.brooklyn.test.lite.CampYamlLiteTest.setUp() finished in 335 ms
2015-09-01 15:32:41,350 INFO  TESTNG INVOKING: "Surefire test" - org.apache.brooklyn.camp.brooklyn.test.lite.CampYamlLiteTest.testAddChildrenEffector()
2015-09-01 15:32:41,509 INFO  TESTNG PASSED: "Surefire test" - org.apache.brooklyn.camp.brooklyn.test.lite.CampYamlLiteTest.testAddChildrenEffector()
finished in 159 ms
2015-09-01 15:32:41,509 INFO  TESTNG INVOKING CONFIGURATION: "Surefire test" - @AfterMethod
org.apache.brooklyn.camp.brooklyn.test.lite.CampYamlLiteTest.tearDown()
2015-09-01 15:32:41,632 INFO  TESTNG PASSED CONFIGURATION: "Surefire test" - @AfterMethod
org.apache.brooklyn.camp.brooklyn.test.lite.CampYamlLiteTest.tearDown() finished in 123 ms
2015-09-01 15:32:41,632 INFO  TESTNG INVOKING CONFIGURATION: "Surefire test" - @BeforeMethod
org.apache.brooklyn.camp.brooklyn.test.lite.CampYamlLiteTest.setUp()
2015-09-01 15:32:41,888 INFO  TESTNG PASSED CONFIGURATION: "Surefire test" - @BeforeMethod
org.apache.brooklyn.camp.brooklyn.test.lite.CampYamlLiteTest.setUp() finished in 256 ms
2015-09-01 15:32:41,889 INFO  TESTNG INVOKING: "Surefire test" - org.apache.brooklyn.camp.brooklyn.test.lite.CampYamlLiteTest.testRegisterCustomEntityWithBundleWhereEntityIsFromCoreAndIconFromBundle()
2015-09-01 15:32:41,904 INFO  TESTNG PASSED: "Surefire test" - org.apache.brooklyn.camp.brooklyn.test.lite.CampYamlLiteTest.testRegisterCustomEntityWithBundleWhereEntityIsFromCoreAndIconFromBundle()
finished in 15 ms
2015-09-01 15:32:41,905 INFO  TESTNG INVOKING CONFIGURATION: "Surefire test" - @AfterMethod
org.apache.brooklyn.camp.brooklyn.test.lite.CampYamlLiteTest.tearDown()
2015-09-01 15:32:42,049 INFO  TESTNG PASSED CONFIGURATION: "Surefire test" - @AfterMethod
org.apache.brooklyn.camp.brooklyn.test.lite.CampYamlLiteTest.tearDown() finished in 145 ms
2015-09-01 15:32:42,050 INFO  TESTNG INVOKING CONFIGURATION: "Surefire test" - @BeforeMethod
org.apache.brooklyn.camp.brooklyn.test.lite.CampYamlLiteTest.setUp()
SUREFIRE-859: [GC 407968K->204788K(756288K), 0.0107053 secs]
2015-09-01 15:32:42,499 INFO  TESTNG PASSED CONFIGURATION: "Surefire test" - @BeforeMethod
org.apache.brooklyn.camp.brooklyn.test.lite.CampYamlLiteTest.setUp() finished in 449 ms
2015-09-01 15:32:42,499 INFO  TESTNG INVOKING: "Surefire test" - org.apache.brooklyn.camp.brooklyn.test.lite.CampYamlLiteTest.testResetXmlWithCustomEntity()
2015-09-01 15:32:42,942 INFO  TESTNG PASSED: "Surefire test" - org.apache.brooklyn.camp.brooklyn.test.lite.CampYamlLiteTest.testResetXmlWithCustomEntity()
finished in 443 ms
2015-09-01 15:32:42,942 INFO  TESTNG INVOKING CONFIGURATION: "Surefire test" - @AfterMethod
org.apache.brooklyn.camp.brooklyn.test.lite.CampYamlLiteTest.tearDown()
2015-09-01 15:32:43,047 INFO  TESTNG PASSED CONFIGURATION: "Surefire test" - @AfterMethod
org.apache.brooklyn.camp.brooklyn.test.lite.CampYamlLiteTest.tearDown() finished in 105 ms
2015-09-01 15:32:43,047 INFO  TESTNG INVOKING CONFIGURATION: "Surefire test" - @BeforeMethod
org.apache.brooklyn.camp.brooklyn.test.lite.CampYamlLiteTest.setUp()
SUREFIRE-859: [GC 407988K->204919K(760192K), 0.0088846 secs]
2015-09-01 15:32:43,322 INFO  TESTNG PASSED CONFIGURATION: "Surefire test" - @BeforeMethod
org.apache.brooklyn.camp.brooklyn.test.lite.CampYamlLiteTest.setUp() finished in 275 ms
2015-09-01 15:32:43,322 INFO  TESTNG INVOKING: "Surefire test" - org.apache.brooklyn.camp.brooklyn.test.lite.CampYamlLiteTest.testYamlServiceForCatalog()
2015-09-01 15:32:43,334 INFO  TESTNG PASSED: "Surefire test" - org.apache.brooklyn.camp.brooklyn.test.lite.CampYamlLiteTest.testYamlServiceForCatalog()
finished in 12 ms
2015-09-01 15:32:43,334 INFO  TESTNG INVOKING CONFIGURATION: "Surefire test" - @AfterMethod
org.apache.brooklyn.camp.brooklyn.test.lite.CampYamlLiteTest.tearDown()
2015-09-01 15:32:43,476 INFO  TESTNG PASSED CONFIGURATION: "Surefire test" - @AfterMethod
org.apache.brooklyn.camp.brooklyn.test.lite.CampYamlLiteTest.tearDown() finished in 142 ms
2015-09-01 15:32:43,476 INFO  TESTNG INVOKING CONFIGURATION: "Surefire test" - @BeforeMethod
org.apache.brooklyn.camp.brooklyn.test.lite.CampYamlLiteTest.setUp()
2015-09-01 15:32:43,741 INFO  TESTNG PASSED CONFIGURATION: "Surefire test" - @BeforeMethod
org.apache.brooklyn.camp.brooklyn.test.lite.CampYamlLiteTest.setUp() finished in 265 ms
2015-09-01 15:32:43,741 INFO  TESTNG INVOKING: "Surefire test" - org.apache.brooklyn.camp.brooklyn.test.lite.CampYamlLiteTest.testYamlServiceMatchAndBrooklynInstantiate()
2015-09-01 15:32:43,742 INFO  AT is:
org.apache.brooklyn.camp.spi.AssemblyTemplate@2165e10[id=dnIEFrHY; type=AssemblyTemplate]
2015-09-01 15:32:43,770 INFO  TESTNG PASSED: "Surefire test" - org.apache.brooklyn.camp.brooklyn.test.lite.CampYamlLiteTest.testYamlServiceMatchAndBrooklynInstantiate()
finished in 29 ms
2015-09-01 15:32:43,771 INFO  TESTNG INVOKING CONFIGURATION: "Surefire test" - @AfterMethod
org.apache.brooklyn.camp.brooklyn.test.lite.CampYamlLiteTest.tearDown()
2015-09-01 15:32:43,902 INFO  TESTNG PASSED CONFIGURATION: "Surefire test" - @AfterMethod
org.apache.brooklyn.camp.brooklyn.test.lite.CampYamlLiteTest.tearDown() finished in 131 ms
2015-09-01 15:32:43,964 INFO  TESTNG 
===============================================
    Surefire test
    Tests run: 217, Failures: 1, Skips: 0
===============================================
2015-09-01 15:32:43,965 INFO  BrooklynLeakListener.onFinish attempting to terminate all extant
ManagementContexts: name=Surefire test; includedGroups=[]; excludedGroups=[Integration, Acceptance,
Live, WIP]; suiteName=Surefire suite; outDir=F:\hudson\hudson-slave\workspace\incubator-brooklyn-master-windows\usage\camp\target\surefire-reports\Surefire
suite: no org.apache.brooklyn.core.management.internal.LocalManagementContext available, so
skipped
SUREFIRE-859: [GC 413367K->203357K(758976K), 0.0065075 secs]
Tests run: 217, Failures: 1, Errors: 0, Skipped: 0, Time elapsed: 120.113 sec <<<
FAILURE! - in TestSuite
testRebindWithCatalogPropertiesForDeprecationAndEnablementAbsent(org.apache.brooklyn.camp.brooklyn.catalog.CatalogYamlRebindTest)
 Time elapsed: 0.223 sec  <<< FAILURE!
org.apache.brooklyn.util.exceptions.PropagatedRuntimeException: 
	at org.apache.brooklyn.core.mgmt.persist.FileBasedObjectStore.moveFile(FileBasedObjectStore.java:393)
	at org.apache.brooklyn.core.mgmt.persist.FileBasedStoreObjectAccessor.put(FileBasedStoreObjectAccessor.java:86)
	at org.apache.brooklyn.camp.brooklyn.catalog.CatalogYamlRebindTest$1.apply(CatalogYamlRebindTest.java:216)
	at org.apache.brooklyn.camp.brooklyn.catalog.CatalogYamlRebindTest$1.apply(CatalogYamlRebindTest.java:209)
	at org.apache.brooklyn.core.mgmt.rebind.RebindTestUtils.rebindAll(RebindTestUtils.java:433)
	at org.apache.brooklyn.core.mgmt.rebind.RebindTestUtils.rebind(RebindTestUtils.java:318)
	at org.apache.brooklyn.core.mgmt.rebind.RebindTestFixture.rebind(RebindTestFixture.java:254)
	at org.apache.brooklyn.camp.brooklyn.AbstractYamlRebindTest.rebind(AbstractYamlRebindTest.java:86)
	at org.apache.brooklyn.camp.brooklyn.catalog.CatalogYamlRebindTest.runRebindWithCatalogAndApp(CatalogYamlRebindTest.java:208)
	at org.apache.brooklyn.camp.brooklyn.catalog.CatalogYamlRebindTest.testRebindWithCatalogPropertiesForDeprecationAndEnablementAbsent(CatalogYamlRebindTest.java:123)


Results :

Failed tests: 
  CatalogYamlRebindTest.testRebindWithCatalogPropertiesForDeprecationAndEnablementAbsent:123->runRebindWithCatalogAndApp:208->AbstractYamlRebindTest.rebind:86->RebindTestFixture.rebind:254
ยป PropagatedRuntime

Tests run: 217, Failures: 1, Errors: 0, Skipped: 0

[JENKINS] Recording test results
[JENKINS] Archiving disabled
[INFO]                                                                         
[INFO] ------------------------------------------------------------------------
[INFO] Skipping Brooklyn REST Server
[INFO] This project has been banned from the build due to previous failures.
[INFO] ------------------------------------------------------------------------
[INFO]                                                                         
[INFO] ------------------------------------------------------------------------
[INFO] Skipping Brooklyn REST JavaScript Web GUI
[INFO] This project has been banned from the build due to previous failures.
[INFO] ------------------------------------------------------------------------
[INFO]                                                                         
[INFO] ------------------------------------------------------------------------
[INFO] Skipping Brooklyn Launcher
[INFO] This project has been banned from the build due to previous failures.
[INFO] ------------------------------------------------------------------------
[INFO]                                                                         
[INFO] ------------------------------------------------------------------------
[INFO] Skipping Brooklyn Command Line Interface
[INFO] This project has been banned from the build due to previous failures.
[INFO] ------------------------------------------------------------------------
[INFO]                                                                         
[INFO] ------------------------------------------------------------------------
[INFO] Skipping Brooklyn All Things
[INFO] This project has been banned from the build due to previous failures.
[INFO] ------------------------------------------------------------------------
[INFO]                                                                         
[INFO] ------------------------------------------------------------------------
[INFO] Skipping Brooklyn Simple Web Cluster Example
[INFO] This project has been banned from the build due to previous failures.
[INFO] ------------------------------------------------------------------------
[INFO]                                                                         
[INFO] ------------------------------------------------------------------------
[INFO] Skipping Brooklyn Global Web Fabric Example
[INFO] This project has been banned from the build due to previous failures.
[INFO] ------------------------------------------------------------------------
[INFO]                                                                         
[INFO] ------------------------------------------------------------------------
[INFO] Skipping Brooklyn Simple Messaging Publish-Subscribe Example
[INFO] This project has been banned from the build due to previous failures.
[INFO] ------------------------------------------------------------------------
[INFO]                                                                         
[INFO] ------------------------------------------------------------------------
[INFO] Skipping Brooklyn NoSQL Cluster Examples
[INFO] This project has been banned from the build due to previous failures.
[INFO] ------------------------------------------------------------------------
[INFO]                                                                         
[INFO] ------------------------------------------------------------------------
[INFO] Skipping Brooklyn Distribution
[INFO] This project has been banned from the build due to previous failures.
[INFO] ------------------------------------------------------------------------
[INFO]                                                                         
[INFO] ------------------------------------------------------------------------
[INFO] Skipping Brooklyn QA
[INFO] This project has been banned from the build due to previous failures.
[INFO] ------------------------------------------------------------------------
[INFO]                                                                         
[INFO] ------------------------------------------------------------------------
[INFO] Skipping Brooklyn REST Client
[INFO] This project has been banned from the build due to previous failures.
[INFO] ------------------------------------------------------------------------
[INFO] ------------------------------------------------------------------------
[INFO] Reactor Summary:
[INFO] 
[INFO] Brooklyn Root ..................................... SUCCESS [4.907s]
[INFO] Brooklyn Parent Project ........................... SUCCESS [6.808s]
[INFO] Brooklyn Logback Configuration .................... SUCCESS [5.363s]
[INFO] Brooklyn Test Support Utilities ................... SUCCESS [4.485s]
[INFO] Brooklyn Logback Includable Configuration ......... SUCCESS [1.830s]
[INFO] Brooklyn Common Utilities ......................... SUCCESS [30.372s]
[INFO] Brooklyn API ...................................... SUCCESS [6.473s]
[INFO] Brooklyn Test Support ............................. SUCCESS [5.307s]
[INFO] CAMP Server Parent Project ........................ SUCCESS [0.467s]
[INFO] CAMP Base ......................................... SUCCESS [7.887s]
[INFO] Brooklyn Groovy Utilities ......................... SUCCESS [9.533s]
[INFO] Brooklyn Core ..................................... SUCCESS [4:11.022s]
[INFO] Brooklyn Policies ................................. SUCCESS [1:50.246s]
[INFO] Brooklyn Jclouds Location Targets ................. SUCCESS [52.967s]
[INFO] Brooklyn Secure JMXMP Agent ....................... SUCCESS [15.117s]
[INFO] Brooklyn JMX RMI Agent ............................ SUCCESS [3.273s]
[INFO] Brooklyn Software Base ............................ SUCCESS [1:05.248s]
[INFO] Brooklyn Web App Software Entities ................ SUCCESS [2:06.083s]
[INFO] Brooklyn Database Software Entities ............... SUCCESS [11.582s]
[INFO] Brooklyn NoSQL Data Store Software Entities ....... SUCCESS [31.854s]
[INFO] Brooklyn CAMP REST API ............................ FAILURE [2:13.641s]
[INFO] Brooklyn REST Server .............................. SKIPPED
[INFO] Brooklyn REST JavaScript Web GUI .................. SKIPPED
[INFO] Brooklyn Launcher ................................. SKIPPED
[INFO] Brooklyn Command Line Interface ................... SKIPPED
[INFO] Brooklyn All Things ............................... SKIPPED
[INFO] Brooklyn Simple Web Cluster Example ............... SKIPPED
[INFO] Brooklyn Global Web Fabric Example ................ SKIPPED
[INFO] Brooklyn Simple Messaging Publish-Subscribe Example  SKIPPED
[INFO] Brooklyn NoSQL Cluster Examples ................... SKIPPED
[INFO] Brooklyn Distribution ............................. SKIPPED
[INFO] Brooklyn QA ....................................... SKIPPED
[INFO] Brooklyn REST Client .............................. SKIPPED
[INFO] ------------------------------------------------------------------------
[INFO] BUILD FAILURE
[INFO] ------------------------------------------------------------------------
[INFO] Total time: 15:04.245s
[INFO] Finished at: Tue Sep 01 15:32:45 BST 2015
[INFO] Final Memory: 62M/240M
[INFO] ------------------------------------------------------------------------
[JENKINS] Archiving disabled
[JENKINS] Archiving disabled
[JENKINS] Archiving disabled
[JENKINS] Archiving disabled
[JENKINS] Archiving disabled
[JENKINS] Archiving disabled
[JENKINS] Archiving disabled
[JENKINS] Archiving disabled
[JENKINS] Archiving disabled
[JENKINS] Archiving disabled
[JENKINS] Archiving disabled
[JENKINS] Archiving disabled
[JENKINS] Archiving disabled
[JENKINS] Archiving disabled
[JENKINS] Archiving disabled
[JENKINS] Archiving disabled
[JENKINS] Archiving disabled
[JENKINS] Archiving disabled
[JENKINS] Archiving disabled
[JENKINS] Archiving disabled
[JENKINS] Archiving disabled
[JENKINS] Archiving disabled
[JENKINS] Archiving disabled
[JENKINS] Archiving disabled
[JENKINS] Archiving disabled
[JENKINS] Archiving disabled
[JENKINS] Archiving disabled
[JENKINS] Archiving disabled
[JENKINS] Archiving disabled
[JENKINS] Archiving disabled
[JENKINS] Archiving disabled
[JENKINS] Archiving disabled
[JENKINS] Archiving disabled
Waiting for Jenkins to finish collecting data
[ERROR] Failed to execute goal org.apache.maven.plugins:maven-surefire-plugin:2.18.1:test
(default-test) on project brooklyn-camp: There are test failures.
[ERROR] 
[ERROR] Please refer to F:\hudson\hudson-slave\workspace\incubator-brooklyn-master-windows\usage\camp\target\surefire-reports
for the individual test results.
[ERROR] -> [Help 1]
[ERROR] 
[ERROR] To see the full stack trace of the errors, re-run Maven with the -e switch.
[ERROR] Re-run Maven using the -X switch to enable full debug logging.
[ERROR] 
[ERROR] For more information about the errors and possible solutions, please read the following
articles:
[ERROR] [Help 1] http://cwiki.apache.org/confluence/display/MAVEN/MojoFailureException
[ERROR] 
[ERROR] After correcting the problems, you can resume the build with the command
[ERROR]   mvn <goals> -rf :brooklyn-camp
channel stopped

Mime
View raw message