brooklyn-dev mailing list archives

Site index · List index
Message view « Date » · « Thread »
Top « Date » · « Thread »
From Apache Jenkins Server <jenk...@builds.apache.org>
Subject Build failed in Jenkins: incubator-brooklyn-master-integration #162
Date Thu, 13 Aug 2015 20:28:39 GMT
See <https://builds.apache.org/job/incubator-brooklyn-master-integration/162/changes>

Changes:

[cheepeero] brooklyn-software-osgi: add org.apache package prefix

[valentin.aitken] BrooklynLauncherRebindCatalogTest

[hadrian] [BROOKLYN-162] Rename ./api/basic; use the no split package convention

[hadrian] [BROOKLYN-162] Rename ./api/entity; use the no split package convention

[hadrian] [BROOKLYN-162] Rename ./api/event; use the no split package convention

[hadrian] [BROOKLYN-162] Rename ./api/catalog; use the no split package convention

------------------------------------------
[...truncated 38648 lines...]
  SshMachineLocationTest.testSshExecScript:188 » IllegalState Cannot establish s...
  HostGeoLookupIntegrationTest.testMaxmindLookup:75 host lookup unavailable - is the maxmind
database installed? expected object to not be null
  ResourceUtilsTest.testGetResourceViaSftp:157 » Runtime Error getting resource ...
  ResourceUtilsTest.testGetResourceViaSftpWithUsername:164 » Runtime Error getti...
  ArchiveUtilsTest.testDeployExplicitDestFile:109 » IllegalState Cannot establis...
  ArchiveUtilsTest.testDeployJarNotUnpacked:102 » IllegalState Cannot establish ...
  ArchiveUtilsTest.testDeployZipDeletingArchiveAfterUnpack:94 » IllegalState Can...
  ArchiveUtilsTest.testDeployZipWithNoOptionalArgsSupplied:86 » IllegalState Can...
  SshCliToolIntegrationTest>SshToolAbstractIntegrationTest.testAllocatePty:231 » Ssh
  SshCliToolIntegrationTest>SshToolAbstractIntegrationTest.testCopyFileToServerWithPermissions:190->SshToolAbstractIntegrationTest.assertRemoteFileContents:103->ShellToolAbstractTest.execCommands:394->ShellToolAbstractTest.execCommands:398->ShellToolAbstractTest.execCommands:402->ShellToolAbstractTest.execCommands:409
» Ssh
  SshCliToolIntegrationTest>SshToolAbstractIntegrationTest.testCopyFromServer:204 » FileNotFound
  SshCliToolIntegrationTest>SshToolAbstractIntegrationTest.testCopyToServerFromBytes:147->SshToolAbstractIntegrationTest.assertRemoteFileContents:103->ShellToolAbstractTest.execCommands:394->ShellToolAbstractTest.execCommands:398->ShellToolAbstractTest.execCommands:402->ShellToolAbstractTest.execCommands:409
» Ssh
  SshCliToolIntegrationTest>SshToolAbstractIntegrationTest.testCopyToServerFromInputStream:162->SshToolAbstractIntegrationTest.assertRemoteFileContents:103->ShellToolAbstractTest.execCommands:394->ShellToolAbstractTest.execCommands:398->ShellToolAbstractTest.execCommands:402->ShellToolAbstractTest.execCommands:409
» Ssh
  SshCliToolIntegrationTest>SshToolAbstractIntegrationTest.testCopyToServerWithPermissions:169->SshToolAbstractIntegrationTest.assertRemoteFilePermissions:112->ShellToolAbstractTest.execCommands:394->ShellToolAbstractTest.execCommands:398->ShellToolAbstractTest.execCommands:402->ShellToolAbstractTest.execCommands:409
» Ssh
  SshCliToolIntegrationTest>ShellToolAbstractTest.testExecBigCommand:271->ShellToolAbstractTest.execCommands:394->ShellToolAbstractTest.execCommands:398->ShellToolAbstractTest.execCommands:402->ShellToolAbstractTest.execCommands:409
» Ssh
  SshCliToolIntegrationTest>ShellToolAbstractTest.testExecBigConcurrentCommand:278->ShellToolAbstractTest.runExecBigConcurrentCommand:305
» Execution
  SshCliToolIntegrationTest>ShellToolAbstractTest.testExecCapturesStderr:329 » Ssh
  SshCliToolIntegrationTest>ShellToolAbstractTest.testExecChainOfCommands:244->ShellToolAbstractTest.execCommands:394->ShellToolAbstractTest.execCommands:398->ShellToolAbstractTest.execCommands:402->ShellToolAbstractTest.execCommands:409
» Ssh
  SshCliToolIntegrationTest>ShellToolAbstractTest.testExecCommandWithEnvVariables:263->ShellToolAbstractTest.execCommands:402->ShellToolAbstractTest.execCommands:409
» Ssh
  SshCliToolIntegrationTest>ShellToolAbstractTest.testExecConsecutiveCommands:104->ShellToolAbstractTest.execScript:414->ShellToolAbstractTest.execScript:418->ShellToolAbstractTest.execScript:433
» Ssh
  SshCliToolIntegrationTest.testExecReturningNonZeroExitCode:115 » Ssh exit code...
  SshCliToolIntegrationTest>ShellToolAbstractTest.testExecReturningZeroExitCode:257 »
Ssh
  SshCliToolIntegrationTest>ShellToolAbstractTest.testExecScriptAbortsOnCommandFailure:178
» Ssh
  SshCliToolIntegrationTest>ShellToolAbstractTest.testExecScriptBigChainOfCommand:168->ShellToolAbstractTest.execScript:422->ShellToolAbstractTest.execScript:426->ShellToolAbstractTest.execScript:433
» Ssh
  SshCliToolIntegrationTest>ShellToolAbstractTest.testExecScriptBigCommand:155->ShellToolAbstractTest.execScript:414->ShellToolAbstractTest.execScript:418->ShellToolAbstractTest.execScript:433
» Ssh
  SshCliToolIntegrationTest>ShellToolAbstractTest.testExecScriptCapturesStderr:318 » Ssh
  SshCliToolIntegrationTest>ShellToolAbstractTest.testExecScriptChainOfCommands:113->ShellToolAbstractTest.execScript:414->ShellToolAbstractTest.execScript:418->ShellToolAbstractTest.execScript:433
» Ssh
  SshCliToolIntegrationTest>ShellToolAbstractTest.testExecScriptCommandWithEnvVariables:132->ShellToolAbstractTest.execScript:426->ShellToolAbstractTest.execScript:433
» Ssh
  SshCliToolIntegrationTest>ShellToolAbstractTest.testExecScriptEchosDontExecuteWhenToldNoExtraOutput:387
» Ssh
  SshCliToolIntegrationTest>ShellToolAbstractTest.testExecScriptEchosExecute:374->ShellToolAbstractTest.execScript:414->ShellToolAbstractTest.execScript:418->ShellToolAbstractTest.execScript:433
» Ssh
  SshCliToolIntegrationTest>ShellToolAbstractTest.testExecScriptReturningNonZeroExitCode:120
» Ssh
  SshCliToolIntegrationTest>ShellToolAbstractTest.testExecScriptReturningZeroExitCode:126
» Ssh
  SshCliToolIntegrationTest>ShellToolAbstractTest.testExecScriptWithSleepThenBigCommand:188->ShellToolAbstractTest.execScript:414->ShellToolAbstractTest.execScript:418->ShellToolAbstractTest.execScript:433
» Ssh
  SshCliToolIntegrationTest>ShellToolAbstractTest.testExecScriptWithSleepThenExit:147->ShellToolAbstractTest.execScript:414->ShellToolAbstractTest.execScript:418->ShellToolAbstractTest.execScript:433
» Ssh
  SshCliToolIntegrationTest>SshToolAbstractIntegrationTest.testOutputAsExpected:279->ShellToolAbstractTest.execCommands:394->ShellToolAbstractTest.execCommands:398->ShellToolAbstractTest.execCommands:402->ShellToolAbstractTest.execCommands:409
» Ssh
  SshCliToolIntegrationTest>ShellToolAbstractTest.testRunAsRoot:367 » Ssh exit c...
  SshCliToolIntegrationTest>ShellToolAbstractTest.testScriptDataNotLost:139->ShellToolAbstractTest.execScript:414->ShellToolAbstractTest.execScript:418->ShellToolAbstractTest.execScript:433
» Ssh
  SshCliToolIntegrationTest>SshToolAbstractIntegrationTest.testScriptDirPropertiesIsRespected:296
» Ssh
  SshCliToolIntegrationTest>ShellToolAbstractTest.testScriptHeader:338->ShellToolAbstractTest.execScript:433
» Ssh
  SshCliToolIntegrationTest>ShellToolAbstractTest.testStdErr:352 » Ssh exit code...
  SshCliToolPerformanceTest>SshToolAbstractPerformanceTest.testConsecutiveBigStdinCommands:95->SshToolAbstractPerformanceTest.runExecManyCommands:103->SshToolAbstractPerformanceTest.runMany:113->SshToolAbstractPerformanceTest.access$100:48->SshToolAbstractPerformanceTest.execScript:129
» Ssh
  SshCliToolPerformanceTest>SshToolAbstractPerformanceTest.testConsecutiveBigStdoutCommands:89->SshToolAbstractPerformanceTest.runExecManyCommands:103->SshToolAbstractPerformanceTest.runMany:113->SshToolAbstractPerformanceTest.access$100:48->SshToolAbstractPerformanceTest.execScript:129
» Ssh
  SshCliToolPerformanceTest>SshToolAbstractPerformanceTest.testConsecutiveSmallCommands:79->SshToolAbstractPerformanceTest.runExecManyCommands:103->SshToolAbstractPerformanceTest.runMany:113->SshToolAbstractPerformanceTest.access$100:48->SshToolAbstractPerformanceTest.execScript:129
» Ssh
  SshCliToolPerformanceTest>SshToolAbstractPerformanceTest.testConsecutiveSmallCommandsWithStdouterr:84->SshToolAbstractPerformanceTest.runExecManyCommands:103->SshToolAbstractPerformanceTest.runMany:113->SshToolAbstractPerformanceTest.access$100:48->SshToolAbstractPerformanceTest.execScript:129
» Ssh
  ProcessToolIntegrationTest>ShellToolAbstractTest.testRunAsRoot:368 not running as root;
whoami is: Executed /tmp/brooklyn-20150813-185553377-XR3U.sh, result 1
 (err is 'sudo: a password is required
') expected [true] but found [false]
  SshjToolAsyncStubIntegrationTest.testPolls:123->runTest:161 » Ssh (jenkins@loc...
  SshjToolAsyncStubIntegrationTest.testPollsAndReturnsNonZeroExitCode:134->runTest:161
» Ssh
  SshjToolAsyncStubIntegrationTest.testPollsRepeatedly:151->runTest:161 » Ssh (j...
brooklyn.util.internal.ssh.sshj.SshjToolIntegrationTest.setUp(brooklyn.util.internal.ssh.sshj.SshjToolIntegrationTest)
  Run 1: SshjToolIntegrationTest>SshToolAbstractIntegrationTest.setUp:97->ShellToolAbstractTest.setUp:84->ShellToolAbstractTest.connect:99
» Ssh
  Run 2: PASS
  Run 3: PASS
  Run 4: PASS
  Run 5: PASS
  Run 6: PASS
  Run 7: PASS
  Run 8: PASS
  Run 9: PASS
  Run 10: PASS
  Run 11: PASS
  Run 12: PASS
  Run 13: PASS
  Run 14: PASS
  Run 15: PASS
  Run 16: PASS
  Run 17: PASS
  Run 18: PASS
  Run 19: PASS
  Run 20: PASS
  Run 21: PASS
  Run 22: PASS
  Run 23: PASS
  Run 24: PASS
  Run 25: PASS
  Run 26: PASS
  Run 27: PASS
  Run 28: PASS
  Run 29: PASS
  Run 30: PASS
  Run 31: PASS
  Run 32: PASS
  Run 33: PASS
  Run 34: PASS
  Run 35: PASS
  Run 36: PASS
  Run 37: PASS
  Run 38: PASS
  Run 39: PASS
  Run 40: PASS
  Run 41: PASS
  Run 42: PASS
  Run 43: PASS

  SshjToolPerformanceTest>SshToolAbstractPerformanceTest.testConsecutiveBigStdinCommands:95->SshToolAbstractPerformanceTest.runExecManyCommands:103->SshToolAbstractPerformanceTest.runMany:113->SshToolAbstractPerformanceTest.access$100:48->SshToolAbstractPerformanceTest.execScript:128
» Ssh
  SshjToolPerformanceTest>SshToolAbstractPerformanceTest.testConsecutiveBigStdoutCommands:89->SshToolAbstractPerformanceTest.runExecManyCommands:103->SshToolAbstractPerformanceTest.runMany:113->SshToolAbstractPerformanceTest.access$100:48->SshToolAbstractPerformanceTest.execScript:128
» Ssh
  SshjToolPerformanceTest>SshToolAbstractPerformanceTest.testConsecutiveConnectAndDisconnect:74->SshToolAbstractPerformanceTest.runMany:113
» Ssh
  SshjToolPerformanceTest>SshToolAbstractPerformanceTest.testConsecutiveSmallCommands:79->SshToolAbstractPerformanceTest.runExecManyCommands:103->SshToolAbstractPerformanceTest.runMany:113->SshToolAbstractPerformanceTest.access$100:48->SshToolAbstractPerformanceTest.execScript:128
» Ssh
  SshjToolPerformanceTest>SshToolAbstractPerformanceTest.testConsecutiveSmallCommandsWithStdouterr:84->SshToolAbstractPerformanceTest.runExecManyCommands:103->SshToolAbstractPerformanceTest.runMany:113->SshToolAbstractPerformanceTest.access$100:48->SshToolAbstractPerformanceTest.execScript:128
» Ssh
  BashCommandsIntegrationTest.testAlternatives:190 » Execution java.lang.Illegal...
  BashCommandsIntegrationTest.testAlternativesWhereFirstSucceeds:176 » Execution
  BashCommandsIntegrationTest.testDownloadFirstSuccessfulFile:153 » IllegalState
  BashCommandsIntegrationTest.testDownloadToStdout:166 » Execution java.lang.Ill...
  BashCommandsIntegrationTest.testPipeMultiline:257 » PropagatedRuntime 
  BashCommandsIntegrationTest.testRequireFailureExitsImmediately:248 » Execution
  BashCommandsIntegrationTest.testRequireFileHandlesFailure:223 » Execution java...
  BashCommandsIntegrationTest.testRequireFileHandlesSuccess:236 » Execution java...
  BashCommandsIntegrationTest.testRequireTestHandlesFailure:201 » Execution java...
  BashCommandsIntegrationTest.testRequireTestHandlesSuccess:213 » Execution java...
  BashCommandsIntegrationTest.testSudo:130 » IllegalState Cannot establish ssh c...
  BashCommandsIntegrationTest.testWaitForFileContentsWhenAbortingOnFail:268 » IllegalState
  BashCommandsIntegrationTest.testWaitForFileContentsWhenContentsAppearAfterStart:302 » PropagatedRuntime
  BashCommandsIntegrationTest.testWaitForFileContentsWhenNotAbortingOnFail:281 » PropagatedRuntime
  SshTasksTest.testCopyTo:120 » FileNotFound File '/tmp/SshTasksTest-KxxK/f1' do...
  SshTasksTest.testCopyToFailBadSubdirCreate:172 » FileNotFound File '/tmp/SshTa...
  SshTasksTest.testSshEchoHello:110 » PropagatedRuntime 
  SshTasksTest.testSshFetch:187 » PropagatedRuntime 
  SshTasksTest.testSshIgnoringHeaderProperty:202 mismatched output was:  expected [true] but
found [false]
  SshTasksTest.testSshWithHeaderProperty:195 mismatched output was:  expected [true] but found
[false]

Tests run: 1300, Failures: 115, Errors: 0, Skipped: 46

[JENKINS] Recording test results
[INFO] ------------------------------------------------------------------------
[INFO] Reactor Summary:
[INFO] 
[INFO] Brooklyn Root ..................................... SUCCESS [13.577s]
[INFO] Brooklyn Parent Project ........................... SUCCESS [16.893s]
[INFO] Brooklyn Test Support Utilities ................... SUCCESS [15.757s]
[INFO] Brooklyn Logback Includable Configuration ......... SUCCESS [3.454s]
[INFO] Brooklyn Common Utilities ......................... FAILURE [49.118s]
[INFO] Brooklyn API ...................................... SUCCESS [5.385s]
[INFO] Brooklyn Test Support ............................. SUCCESS [8.053s]
[INFO] CAMP Server Parent Project ........................ SUCCESS [1.284s]
[INFO] CAMP Base ......................................... SUCCESS [7.155s]
[INFO] Brooklyn Groovy Utilities ......................... SUCCESS [10.951s]
[INFO] Brooklyn Core ..................................... FAILURE [1:56:59.131s]
[INFO] ------------------------------------------------------------------------
[INFO] BUILD FAILURE
[INFO] ------------------------------------------------------------------------
[INFO] Total time: 2:00:01.050s
[INFO] Finished at: Thu Aug 13 20:28:56 UTC 2015
[INFO] Final Memory: 41M/240M
[INFO] ------------------------------------------------------------------------
Waiting for Jenkins to finish collecting data
[ERROR] Failed to execute goal org.apache.maven.plugins:maven-surefire-plugin:2.18.1:test
(default-test) on project brooklyn-utils-common: There are test failures.
[ERROR] 
[ERROR] Please refer to <https://builds.apache.org/job/incubator-brooklyn-master-integration/ws/utils/common/target/surefire-reports>
for the individual test results.
[ERROR] -> [Help 1]
[ERROR] Failed to execute goal org.apache.maven.plugins:maven-surefire-plugin:2.18.1:test
(default-test) on project brooklyn-core: There are test failures.
[ERROR] 
[ERROR] Please refer to <https://builds.apache.org/job/incubator-brooklyn-master-integration/ws/core/target/surefire-reports>
for the individual test results.
[ERROR] -> [Help 1]
[ERROR] 
[ERROR] To see the full stack trace of the errors, re-run Maven with the -e switch.
[ERROR] Re-run Maven using the -X switch to enable full debug logging.
[ERROR] 
[ERROR] For more information about the errors and possible solutions, please read the following
articles:
[ERROR] [Help 1] http://cwiki.apache.org/confluence/display/MAVEN/MojoFailureException
[ERROR] 
[ERROR] After correcting the problems, you can resume the build with the command
[ERROR]   mvn <goals> -rf :brooklyn-utils-common
[JENKINS] Archiving <https://builds.apache.org/job/incubator-brooklyn-master-integration/ws/core/pom.xml>
to org.apache.brooklyn/brooklyn-core/0.8.0-SNAPSHOT/brooklyn-core-0.8.0-SNAPSHOT.pom
Sending artifact delta relative to incubator-brooklyn-master-integration » Brooklyn Core
#2
Archived 1 artifacts
Archive block size is 32768
Received 0 blocks and 9758 bytes
Compression is 0.0%
Took 2.7 sec
[JENKINS] Archiving <https://builds.apache.org/job/incubator-brooklyn-master-integration/ws/utils/groovy/pom.xml>
to org.apache.brooklyn/brooklyn-utils-groovy/0.8.0-SNAPSHOT/brooklyn-utils-groovy-0.8.0-SNAPSHOT.pom
[JENKINS] Archiving <https://builds.apache.org/job/incubator-brooklyn-master-integration/ws/utils/groovy/target/brooklyn-utils-groovy-0.8.0-SNAPSHOT.jar>
to org.apache.brooklyn/brooklyn-utils-groovy/0.8.0-SNAPSHOT/brooklyn-utils-groovy-0.8.0-SNAPSHOT.jar
[JENKINS] Archiving <https://builds.apache.org/job/incubator-brooklyn-master-integration/ws/utils/groovy/target/brooklyn-utils-groovy-0.8.0-SNAPSHOT-sources.jar>
to org.apache.brooklyn/brooklyn-utils-groovy/0.8.0-SNAPSHOT/brooklyn-utils-groovy-0.8.0-SNAPSHOT-sources.jar
Sending artifact delta relative to incubator-brooklyn-master-integration » Brooklyn Groovy
Utilities #161
Archived 3 artifacts
Archive block size is 32768
Received 0 blocks and 88363 bytes
Compression is 0.0%
Took 0.52 sec
[JENKINS] Archiving <https://builds.apache.org/job/incubator-brooklyn-master-integration/ws/utils/common/pom.xml>
to org.apache.brooklyn/brooklyn-utils-common/0.8.0-SNAPSHOT/brooklyn-utils-common-0.8.0-SNAPSHOT.pom
No prior successful build to compare, so performing full copy of artifacts
[JENKINS] Archiving <https://builds.apache.org/job/incubator-brooklyn-master-integration/ws/usage/test-support/pom.xml>
to org.apache.brooklyn/brooklyn-test-support/0.8.0-SNAPSHOT/brooklyn-test-support-0.8.0-SNAPSHOT.pom
[JENKINS] Archiving <https://builds.apache.org/job/incubator-brooklyn-master-integration/ws/usage/test-support/target/brooklyn-test-support-0.8.0-SNAPSHOT.jar>
to org.apache.brooklyn/brooklyn-test-support/0.8.0-SNAPSHOT/brooklyn-test-support-0.8.0-SNAPSHOT.jar
[JENKINS] Archiving <https://builds.apache.org/job/incubator-brooklyn-master-integration/ws/usage/test-support/target/brooklyn-test-support-0.8.0-SNAPSHOT-sources.jar>
to org.apache.brooklyn/brooklyn-test-support/0.8.0-SNAPSHOT/brooklyn-test-support-0.8.0-SNAPSHOT-sources.jar
Sending artifact delta relative to incubator-brooklyn-master-integration » Brooklyn Test
Support #161
Archived 3 artifacts
Archive block size is 32768
Received 0 blocks and 113344 bytes
Compression is 0.0%
Took 0.24 sec
[JENKINS] Archiving <https://builds.apache.org/job/incubator-brooklyn-master-integration/ws/camp/camp-base/pom.xml>
to org.apache.brooklyn.camp/camp-base/0.8.0-SNAPSHOT/camp-base-0.8.0-SNAPSHOT.pom
[JENKINS] Archiving <https://builds.apache.org/job/incubator-brooklyn-master-integration/ws/camp/camp-base/target/camp-base-0.8.0-SNAPSHOT.jar>
to org.apache.brooklyn.camp/camp-base/0.8.0-SNAPSHOT/camp-base-0.8.0-SNAPSHOT.jar
[JENKINS] Archiving <https://builds.apache.org/job/incubator-brooklyn-master-integration/ws/camp/camp-base/target/camp-base-0.8.0-SNAPSHOT-sources.jar>
to org.apache.brooklyn.camp/camp-base/0.8.0-SNAPSHOT/camp-base-0.8.0-SNAPSHOT-sources.jar
Sending artifact delta relative to incubator-brooklyn-master-integration » CAMP Base #161
Archived 3 artifacts
Archive block size is 32768
Received 0 blocks and 131534 bytes
Compression is 0.0%
Took 0.26 sec
[JENKINS] Archiving <https://builds.apache.org/job/incubator-brooklyn-master-integration/ws/parent/pom.xml>
to org.apache.brooklyn/brooklyn-parent/0.8.0-SNAPSHOT/brooklyn-parent-0.8.0-SNAPSHOT.pom
Sending artifact delta relative to incubator-brooklyn-master-integration » Brooklyn Parent
Project #161
Archived 1 artifacts
Archive block size is 32768
Received 2 blocks and 24821 bytes
Compression is 72.5%
Took 0.16 sec
[JENKINS] Archiving <https://builds.apache.org/job/incubator-brooklyn-master-integration/ws/usage/logback-includes/pom.xml>
to org.apache.brooklyn/brooklyn-logback-includes/0.8.0-SNAPSHOT/brooklyn-logback-includes-0.8.0-SNAPSHOT.pom
[JENKINS] Archiving <https://builds.apache.org/job/incubator-brooklyn-master-integration/ws/usage/logback-includes/target/brooklyn-logback-includes-0.8.0-SNAPSHOT.jar>
to org.apache.brooklyn/brooklyn-logback-includes/0.8.0-SNAPSHOT/brooklyn-logback-includes-0.8.0-SNAPSHOT.jar
[JENKINS] Archiving <https://builds.apache.org/job/incubator-brooklyn-master-integration/ws/usage/logback-includes/target/brooklyn-logback-includes-0.8.0-SNAPSHOT-sources.jar>
to org.apache.brooklyn/brooklyn-logback-includes/0.8.0-SNAPSHOT/brooklyn-logback-includes-0.8.0-SNAPSHOT-sources.jar
Sending artifact delta relative to incubator-brooklyn-master-integration » Brooklyn Logback
Includable Configuration #161
Archived 3 artifacts
Archive block size is 32768
Received 0 blocks and 41462 bytes
Compression is 0.0%
Took 0.16 sec
[JENKINS] Archiving <https://builds.apache.org/job/incubator-brooklyn-master-integration/ws/pom.xml>
to org.apache.brooklyn/brooklyn/0.8.0-SNAPSHOT/brooklyn-0.8.0-SNAPSHOT.pom
Sending artifact delta relative to incubator-brooklyn-master-integration » Brooklyn Root
#161
Archived 1 artifacts
Archive block size is 32768
Received 0 blocks and 5415 bytes
Compression is 0.0%
Took 0.16 sec
[JENKINS] Archiving <https://builds.apache.org/job/incubator-brooklyn-master-integration/ws/utils/test-support/pom.xml>
to org.apache.brooklyn/brooklyn-utils-test-support/0.8.0-SNAPSHOT/brooklyn-utils-test-support-0.8.0-SNAPSHOT.pom
[JENKINS] Archiving <https://builds.apache.org/job/incubator-brooklyn-master-integration/ws/utils/test-support/target/brooklyn-utils-test-support-0.8.0-SNAPSHOT.jar>
to org.apache.brooklyn/brooklyn-utils-test-support/0.8.0-SNAPSHOT/brooklyn-utils-test-support-0.8.0-SNAPSHOT.jar
[JENKINS] Archiving <https://builds.apache.org/job/incubator-brooklyn-master-integration/ws/utils/test-support/target/brooklyn-utils-test-support-0.8.0-SNAPSHOT-sources.jar>
to org.apache.brooklyn/brooklyn-utils-test-support/0.8.0-SNAPSHOT/brooklyn-utils-test-support-0.8.0-SNAPSHOT-sources.jar
Sending artifact delta relative to incubator-brooklyn-master-integration » Brooklyn Test
Support Utilities #161
Archived 3 artifacts
Archive block size is 32768
Received 0 blocks and 45743 bytes
Compression is 0.0%
Took 0.16 sec
[JENKINS] Archiving <https://builds.apache.org/job/incubator-brooklyn-master-integration/ws/camp/pom.xml>
to org.apache.brooklyn.camp/camp-parent/0.8.0-SNAPSHOT/camp-parent-0.8.0-SNAPSHOT.pom
Sending artifact delta relative to incubator-brooklyn-master-integration » CAMP Server Parent
Project #161
Archived 1 artifacts
Archive block size is 32768
Received 0 blocks and 1828 bytes
Compression is 0.0%
Took 0.16 sec
[JENKINS] Archiving <https://builds.apache.org/job/incubator-brooklyn-master-integration/ws/api/pom.xml>
to org.apache.brooklyn/brooklyn-api/0.8.0-SNAPSHOT/brooklyn-api-0.8.0-SNAPSHOT.pom
[JENKINS] Archiving <https://builds.apache.org/job/incubator-brooklyn-master-integration/ws/api/target/brooklyn-api-0.8.0-SNAPSHOT.jar>
to org.apache.brooklyn/brooklyn-api/0.8.0-SNAPSHOT/brooklyn-api-0.8.0-SNAPSHOT.jar
[JENKINS] Archiving <https://builds.apache.org/job/incubator-brooklyn-master-integration/ws/api/target/brooklyn-api-0.8.0-SNAPSHOT-sources.jar>
to org.apache.brooklyn/brooklyn-api/0.8.0-SNAPSHOT/brooklyn-api-0.8.0-SNAPSHOT-sources.jar
Sending artifact delta relative to incubator-brooklyn-master-integration » Brooklyn API #161
Archived 3 artifacts
Archive block size is 32768
Received 0 blocks and 262722 bytes
Compression is 0.0%
Took 0.52 sec
channel stopped
Looks like the node went offline during the build. Check the slave log for the details.

Mime
View raw message