brooklyn-dev mailing list archives

Site index · List index
Message view « Date » · « Thread »
Top « Date » · « Thread »
From Apache Jenkins Server <jenk...@builds.apache.org>
Subject Build failed in Jenkins: incubator-brooklyn-master-windows #267
Date Wed, 26 Aug 2015 12:57:23 GMT
See <https://builds.apache.org/job/incubator-brooklyn-master-windows/267/changes>

Changes:

[aled.sage] CatalogPredicates: test + not anonymous classes

[aled.sage] Adds CatalogItem.disabled

------------------------------------------
[...truncated 20208 lines...]
[INFO] Configuring TestNG with: TestNG652Configurator
[INFO] 2015-08-26 12:26:12,783 INFO  TESTNG RUNNING: Suite: "Surefire test" containing "2"
Tests (config: null)
[INFO] 2015-08-26 12:26:12,806 INFO  TESTNG INVOKING CONFIGURATION: "Surefire test" - @BeforeMethod
com.acme.sample.brooklyn.sample.app.SampleUnitTest.setup()
[INFO] 2015-08-26 12:26:16,089 INFO  TESTNG PASSED CONFIGURATION: "Surefire test" - @BeforeMethod
com.acme.sample.brooklyn.sample.app.SampleUnitTest.setup() finished in 3285 ms
[INFO] 2015-08-26 12:26:16,090 INFO  TESTNG INVOKING: "Surefire test" - com.acme.sample.brooklyn.sample.app.SampleUnitTest.testSampleClusterStructure()
[INFO] 2015-08-26 12:26:17,914 INFO  app from spec is: ClusterWebServerDatabaseSample{id=dPeuprwQ}
[INFO] 2015-08-26 12:26:17,919 INFO  TESTNG PASSED: "Surefire test" - com.acme.sample.brooklyn.sample.app.SampleUnitTest.testSampleClusterStructure()
finished in 1829 ms
[INFO] 2015-08-26 12:26:17,920 INFO  TESTNG INVOKING CONFIGURATION: "Surefire test" - @AfterMethod
com.acme.sample.brooklyn.sample.app.SampleUnitTest.shutdown()
[INFO] 2015-08-26 12:26:18,292 INFO  TESTNG PASSED CONFIGURATION: "Surefire test" - @AfterMethod
com.acme.sample.brooklyn.sample.app.SampleUnitTest.shutdown() finished in 373 ms
[INFO] 2015-08-26 12:26:18,294 INFO  TESTNG INVOKING CONFIGURATION: "Surefire test" - @BeforeMethod
com.acme.sample.brooklyn.sample.app.SampleUnitTest.setup()
[INFO] 2015-08-26 12:26:19,688 INFO  TESTNG PASSED CONFIGURATION: "Surefire test" - @BeforeMethod
com.acme.sample.brooklyn.sample.app.SampleUnitTest.setup() finished in 1394 ms
[INFO] 2015-08-26 12:26:19,688 INFO  TESTNG INVOKING: "Surefire test" - com.acme.sample.brooklyn.sample.app.SampleUnitTest.testSampleSingleStructure()
[INFO] 2015-08-26 12:26:19,812 INFO  app from spec is: SingleWebServerSample{id=vQVKsD57}
[INFO] 2015-08-26 12:26:19,813 INFO  TESTNG PASSED: "Surefire test" - com.acme.sample.brooklyn.sample.app.SampleUnitTest.testSampleSingleStructure()
finished in 125 ms
[INFO] 2015-08-26 12:26:19,814 INFO  TESTNG INVOKING CONFIGURATION: "Surefire test" - @AfterMethod
com.acme.sample.brooklyn.sample.app.SampleUnitTest.shutdown()
[INFO] 2015-08-26 12:26:20,266 INFO  TESTNG PASSED CONFIGURATION: "Surefire test" - @AfterMethod
com.acme.sample.brooklyn.sample.app.SampleUnitTest.shutdown() finished in 452 ms
[INFO] 2015-08-26 12:26:20,289 INFO  TESTNG 
[INFO] ===============================================
[INFO]     Surefire test
[INFO]     Tests run: 2, Failures: 0, Skips: 0
[INFO] ===============================================
[INFO] Tests run: 2, Failures: 0, Errors: 0, Skipped: 0, Time elapsed: 8.47 sec - in TestSuite
[INFO] 
[INFO] Results :
[INFO] 
[INFO] Tests run: 2, Failures: 0, Errors: 0, Skipped: 0
[INFO] 
[INFO] [INFO] 
[INFO] [INFO] --- maven-jar-plugin:2.6:jar (default-jar) @ brooklyn-sample ---
[INFO] [INFO] Building jar: F:\hudson\hudson-slave\workspace\incubator-brooklyn-master-windows\usage\archetypes\quickstart\target\test-classes\projects\integration-test-1\project\brooklyn-sample\target\brooklyn-sample-0.1.0-SNAPSHOT.jar
[INFO] [INFO] 
[INFO] [INFO] --- maven-site-plugin:3.4:attach-descriptor (attach-descriptor) @ brooklyn-sample
---
[INFO] [INFO] 
[INFO] [INFO] --- maven-jar-plugin:2.6:test-jar (test-jar-creation) @ brooklyn-sample ---
[INFO] [INFO] Building jar: F:\hudson\hudson-slave\workspace\incubator-brooklyn-master-windows\usage\archetypes\quickstart\target\test-classes\projects\integration-test-1\project\brooklyn-sample\target\brooklyn-sample-0.1.0-SNAPSHOT-tests.jar
[INFO] [INFO] 
[INFO] [INFO] --- maven-install-plugin:2.5.2:install (default-install) @ brooklyn-sample ---
[INFO] [INFO] Installing F:\hudson\hudson-slave\workspace\incubator-brooklyn-master-windows\usage\archetypes\quickstart\target\test-classes\projects\integration-test-1\project\brooklyn-sample\target\brooklyn-sample-0.1.0-SNAPSHOT.jar
to F:\hudson\hudson-slave\maven-repositories\0\com\acme\sample\brooklyn-sample\0.1.0-SNAPSHOT\brooklyn-sample-0.1.0-SNAPSHOT.jar
[INFO] [INFO] Installing F:\hudson\hudson-slave\workspace\incubator-brooklyn-master-windows\usage\archetypes\quickstart\target\test-classes\projects\integration-test-1\project\brooklyn-sample\pom.xml
to F:\hudson\hudson-slave\maven-repositories\0\com\acme\sample\brooklyn-sample\0.1.0-SNAPSHOT\brooklyn-sample-0.1.0-SNAPSHOT.pom
[INFO] [INFO] Installing F:\hudson\hudson-slave\workspace\incubator-brooklyn-master-windows\usage\archetypes\quickstart\target\test-classes\projects\integration-test-1\project\brooklyn-sample\target\brooklyn-sample-0.1.0-SNAPSHOT-tests.jar
to F:\hudson\hudson-slave\maven-repositories\0\com\acme\sample\brooklyn-sample\0.1.0-SNAPSHOT\brooklyn-sample-0.1.0-SNAPSHOT-tests.jar
[INFO] [INFO] ------------------------------------------------------------------------
[INFO] [INFO] BUILD SUCCESS
[INFO] [INFO] ------------------------------------------------------------------------
[INFO] [INFO] Total time: 26.400s
[INFO] [INFO] Finished at: Wed Aug 26 12:26:21 BST 2015
[INFO] [INFO] Final Memory: 41M/237M
[INFO] [INFO] ------------------------------------------------------------------------
[INFO] Post-archetype-generation invoker exit code: 0
[JENKINS] Recording test results
[INFO] 
[INFO] --- apache-rat-plugin:0.10:check (default) @ brooklyn-archetype-quickstart ---
[INFO] 51 implicit excludes (use -debug for more details).
[INFO] Exclude: sandbox/**
[INFO] Exclude: release/**
[INFO] Exclude: **/nbactions.xml
[INFO] Exclude: **/nb-configuration.xml
[INFO] Exclude: **/src/main/resources/archetype-resources/**/*
[INFO] Exclude: **/src/test/resources/projects/integration-test-1/goal.txt
[INFO] Exclude: **/src/test/resources/projects/integration-test-1/reference/**/*
[INFO] Exclude: **/src/main/java/sample/**/*Sample*.java
[INFO] Exclude: **/src/main/resources/logback-custom.xml
[INFO] Exclude: **/src/brooklyn-sample/README.md
[INFO] Exclude: **/src/brooklyn-sample/pom.xml
[INFO] Exclude: **/src/brooklyn-sample/src/main/assembly/files/conf/*
[INFO] Exclude: **/src/brooklyn-sample/src/main/java/**/*.java
[INFO] Exclude: **/src/brooklyn-sample/src/main/resources/logback-custom.xml
[INFO] Exclude: **/src/brooklyn-sample/src/test/java/**/*.java
[INFO] Exclude: **/.git/**
[INFO] Exclude: **/.gitignore
[INFO] Exclude: **/.repository/**
[INFO] Exclude: **/.idea/**
[INFO] Exclude: **/*.iml
[INFO] Exclude: **/.classpath/**
[INFO] Exclude: **/.project
[INFO] Exclude: **/.settings/**
[INFO] Exclude: **/*.log
[INFO] Exclude: **/brooklyn*.log.*
[INFO] Exclude: **/target/**
[INFO] Exclude: ignored/**
[INFO] Exclude: LICENSE.md
[INFO] Exclude: **/src/main/license/**
[INFO] Exclude: **/src/test/license/**
[INFO] Exclude: **/MANIFEST.MF
[INFO] Exclude: **/test-output/**
[INFO] Exclude: **/*.pem.pub
[INFO] Exclude: **/*.pem
[INFO] Exclude: **/*_rsa.pub
[INFO] Exclude: **/*_rsa
[INFO] Exclude: **/*.svg
[INFO] Exclude: **/*.crt
[INFO] Exclude: **/*.csr
[INFO] Exclude: **/*.key
[INFO] Exclude: **/*.key.org
[INFO] Exclude: **/*.psd
[INFO] Exclude: **/*.json
[INFO] Exclude: **/*.plxarc
[INFO] Exclude: **/src/test/resources/org/apache/brooklyn/entity/software/base/template_with_extra_substitutions.txt
[INFO] Exclude: **/src/main/resources/banner.txt
[INFO] Exclude: **/src/test/resources/ssl/certs/localhost/info.txt
[INFO] Exclude: **/sandbox/examples/src/main/scripts/amis.txt
[INFO] Exclude: docs/**
[INFO] 9 resources included (use -debug for more details)
[INFO] Rat check: Summary of files. Unapproved: 0 unknown: 0 generated: 0 approved: 7 licence.
[INFO] 
[INFO] --- maven-source-plugin:2.4:jar-no-fork (attach-sources) @ brooklyn-archetype-quickstart
---
[INFO] Building jar: F:\hudson\hudson-slave\workspace\incubator-brooklyn-master-windows\usage\archetypes\quickstart\target\brooklyn-archetype-quickstart-0.8.0-SNAPSHOT-sources.jar
[INFO] 
[INFO] --- maven-install-plugin:2.5.2:install (default-install) @ brooklyn-archetype-quickstart
---
[INFO] Installing F:\hudson\hudson-slave\workspace\incubator-brooklyn-master-windows\usage\archetypes\quickstart\target\brooklyn-archetype-quickstart-0.8.0-SNAPSHOT.jar
to f:\hudson\hudson-slave\maven-repositories\0\org\apache\brooklyn\brooklyn-archetype-quickstart\0.8.0-SNAPSHOT\brooklyn-archetype-quickstart-0.8.0-SNAPSHOT.jar
[INFO] Installing F:\hudson\hudson-slave\workspace\incubator-brooklyn-master-windows\usage\archetypes\quickstart\pom.xml
to f:\hudson\hudson-slave\maven-repositories\0\org\apache\brooklyn\brooklyn-archetype-quickstart\0.8.0-SNAPSHOT\brooklyn-archetype-quickstart-0.8.0-SNAPSHOT.pom
[INFO] Installing F:\hudson\hudson-slave\workspace\incubator-brooklyn-master-windows\usage\archetypes\quickstart\target\brooklyn-archetype-quickstart-0.8.0-SNAPSHOT-tests.jar
to f:\hudson\hudson-slave\maven-repositories\0\org\apache\brooklyn\brooklyn-archetype-quickstart\0.8.0-SNAPSHOT\brooklyn-archetype-quickstart-0.8.0-SNAPSHOT-tests.jar
[INFO] Installing F:\hudson\hudson-slave\workspace\incubator-brooklyn-master-windows\usage\archetypes\quickstart\target\brooklyn-archetype-quickstart-0.8.0-SNAPSHOT-sources.jar
to f:\hudson\hudson-slave\maven-repositories\0\org\apache\brooklyn\brooklyn-archetype-quickstart\0.8.0-SNAPSHOT\brooklyn-archetype-quickstart-0.8.0-SNAPSHOT-sources.jar
[INFO] 
[INFO] --- maven-archetype-plugin:2.3:update-local-catalog (default-update-local-catalog)
@ brooklyn-archetype-quickstart ---
[JENKINS] Archiving disabled
[INFO]                                                                         
[INFO] ------------------------------------------------------------------------
[INFO] Skipping Brooklyn Distribution
[INFO] This project has been banned from the build due to previous failures.
[INFO] ------------------------------------------------------------------------
[INFO]                                                                         
[INFO] ------------------------------------------------------------------------
[INFO] Skipping Brooklyn QA
[INFO] This project has been banned from the build due to previous failures.
[INFO] ------------------------------------------------------------------------
[INFO]                                                                         
[INFO] ------------------------------------------------------------------------
[INFO] Skipping Brooklyn REST Client
[INFO] This project has been banned from the build due to previous failures.
[INFO] ------------------------------------------------------------------------
[INFO] ------------------------------------------------------------------------
[INFO] Reactor Summary:
[INFO] 
[INFO] Brooklyn Root ..................................... SUCCESS [4.620s]
[INFO] Brooklyn Parent Project ........................... SUCCESS [6.959s]
[INFO] Brooklyn Logback Configuration .................... SUCCESS [6.460s]
[INFO] Brooklyn Test Support Utilities ................... SUCCESS [3.771s]
[INFO] Brooklyn Logback Includable Configuration ......... SUCCESS [2.008s]
[INFO] Brooklyn Common Utilities ......................... SUCCESS [26.949s]
[INFO] Brooklyn API ...................................... SUCCESS [5.936s]
[INFO] Brooklyn Test Support ............................. SUCCESS [7.785s]
[INFO] Brooklyn Downstream Project Parent ................ SUCCESS [0.523s]
[INFO] CAMP Server Parent Project ........................ SUCCESS [0.468s]
[INFO] CAMP Base ......................................... SUCCESS [6.369s]
[INFO] Brooklyn REST Swagger Apidoc Utilities ............ SUCCESS [5.663s]
[INFO] CAMP Server ....................................... SUCCESS [10.191s]
[INFO] Brooklyn Groovy Utilities ......................... SUCCESS [9.236s]
[INFO] Brooklyn Core ..................................... SUCCESS [4:20.413s]
[INFO] Brooklyn Examples Aggregator Project .............. SUCCESS [0.333s]
[INFO] Brooklyn Examples Aggregator Project - Webapps .... SUCCESS [0.246s]
[INFO] hello-world-webapp Maven Webapp ................... SUCCESS [1.044s]
[INFO] hello-world-sql-webapp Maven Webapp ............... SUCCESS [1.979s]
[INFO] Brooklyn Policies ................................. FAILURE [2:28.958s]
[INFO] Brooklyn Jclouds Location Targets ................. SUCCESS [49.450s]
[INFO] Brooklyn Secure JMXMP Agent ....................... SUCCESS [13.139s]
[INFO] Brooklyn JMX RMI Agent ............................ SUCCESS [2.734s]
[INFO] Brooklyn Software Base ............................ SKIPPED
[INFO] Brooklyn Web App Software Entities ................ SKIPPED
[INFO] Brooklyn Messaging Software Entities .............. SKIPPED
[INFO] Brooklyn Database Software Entities ............... SKIPPED
[INFO] Brooklyn Monitoring Software Entities ............. SKIPPED
[INFO] Brooklyn OSGi Software Entities ................... SKIPPED
[INFO] Brooklyn NoSQL Data Store Software Entities ....... SKIPPED
[INFO] Brooklyn Network Software Entities ................ SKIPPED
[INFO] Brooklyn REST API ................................. SUCCESS [7.620s]
[INFO] Brooklyn CAMP REST API ............................ SKIPPED
[INFO] Brooklyn REST Server .............................. SKIPPED
[INFO] Brooklyn REST JavaScript Web GUI .................. SKIPPED
[INFO] Brooklyn Launcher ................................. SKIPPED
[INFO] Brooklyn Command Line Interface ................... SKIPPED
[INFO] Brooklyn All Things ............................... SKIPPED
[INFO] Brooklyn Simple Web Cluster Example ............... SKIPPED
[INFO] Brooklyn Global Web Fabric Example ................ SKIPPED
[INFO] Brooklyn Simple Messaging Publish-Subscribe Example  SKIPPED
[INFO] Brooklyn NoSQL Cluster Examples ................... SKIPPED
[INFO] Brooklyn Hazelcast Storage ........................ SUCCESS [6.472s]
[INFO] Brooklyn Quick-Start Project Archetype ............ SUCCESS [30.305s]
[INFO] Brooklyn Distribution ............................. SKIPPED
[INFO] Brooklyn QA ....................................... SKIPPED
[INFO] Brooklyn REST Client .............................. SKIPPED
[INFO] ------------------------------------------------------------------------
[INFO] BUILD FAILURE
[INFO] ------------------------------------------------------------------------
[INFO] Total time: 10:32.264s
[INFO] Finished at: Wed Aug 26 12:26:22 BST 2015
[INFO] Final Memory: 63M/242M
[INFO] ------------------------------------------------------------------------
[JENKINS] Archiving disabled
[JENKINS] Archiving disabled
[JENKINS] Archiving disabled
[JENKINS] Archiving disabled
[JENKINS] Archiving disabled
[JENKINS] Archiving disabled
[JENKINS] Archiving disabled
[JENKINS] Archiving disabled
[JENKINS] Archiving disabled
[JENKINS] Archiving disabled
[JENKINS] Archiving disabled
[JENKINS] Archiving disabled
[JENKINS] Archiving disabled
[JENKINS] Archiving disabled
[JENKINS] Archiving disabled
[JENKINS] Archiving disabled
[JENKINS] Archiving disabled
[JENKINS] Archiving disabled
[JENKINS] Archiving disabled
[JENKINS] Archiving disabled
[JENKINS] Archiving disabled
[JENKINS] Archiving disabled
[JENKINS] Archiving disabled
[JENKINS] Archiving disabled
[JENKINS] Archiving disabled
[JENKINS] Archiving disabled
[JENKINS] Archiving disabled
[JENKINS] Archiving disabled
[JENKINS] Archiving disabled
[JENKINS] Archiving disabled
[JENKINS] Archiving disabled
[JENKINS] Archiving disabled
[JENKINS] Archiving disabled
[JENKINS] Archiving disabled
[JENKINS] Archiving disabled
[JENKINS] Archiving disabled
[JENKINS] Archiving disabled
[JENKINS] Archiving disabled
[JENKINS] Archiving disabled
[JENKINS] Archiving disabled
[JENKINS] Archiving disabled
[JENKINS] Archiving disabled
[JENKINS] Archiving disabled
[JENKINS] Archiving disabled
[JENKINS] Archiving disabled
[JENKINS] Archiving disabled
[JENKINS] Archiving disabled
Waiting for Jenkins to finish collecting data
[ERROR] Failed to execute goal org.apache.maven.plugins:maven-surefire-plugin:2.18.1:test
(default-test) on project brooklyn-policy: There are test failures.
[ERROR] 
[ERROR] Please refer to F:\hudson\hudson-slave\workspace\incubator-brooklyn-master-windows\policy\target\surefire-reports
for the individual test results.
[ERROR] -> [Help 1]
[ERROR] 
[ERROR] To see the full stack trace of the errors, re-run Maven with the -e switch.
[ERROR] Re-run Maven using the -X switch to enable full debug logging.
[ERROR] 
[ERROR] For more information about the errors and possible solutions, please read the following
articles:
[ERROR] [Help 1] http://cwiki.apache.org/confluence/display/MAVEN/MojoFailureException
[ERROR] 
[ERROR] After correcting the problems, you can resume the build with the command
[ERROR]   mvn <goals> -rf :brooklyn-policy
channel stopped

Mime
View raw message