brooklyn-dev mailing list archives

Site index · List index
Message view « Date » · « Thread »
Top « Date » · « Thread »
From Apache Jenkins Server <jenk...@builds.apache.org>
Subject Build failed in Jenkins: incubator-brooklyn-master-windows #269
Date Mon, 31 Aug 2015 10:44:12 GMT
See <https://builds.apache.org/job/incubator-brooklyn-master-windows/269/changes>

Changes:

[yavor] Adding timestamp to the template options' name

[yavor] Username can be omitted if it is longer than the rules defined in

[yavor] - Change the radix to use MAX_RADIX value.

[yavor] Adjusting the test to take into account the new length

[github] Make SoftwareProcessImpl *much* fussier about which config it implicitly adds to
the list of required open ports.

------------------------------------------
[...truncated 27877 lines...]
2015-08-31 10:13:08,858 INFO  TESTNG INVOKING: "Surefire test" - org.apache.brooklyn.camp.brooklyn.catalog.CatalogYamlVersioningTest.testVersionedReferenceJustAddedExplicitVersion()
2015-08-31 10:13:08,903 INFO  CAMP placing 'BasicApplicationImpl{id=GHKaBtDw}' under management
2015-08-31 10:13:08,905 INFO  Test - created org.apache.brooklyn.camp.spi.Assembly@20adc71b[id=GHKaBtDw;
type=Assembly]
2015-08-31 10:13:08,905 INFO  App - BasicApplicationImpl{id=GHKaBtDw}
2015-08-31 10:13:08,910 INFO  Started application BasicApplicationImpl{id=GHKaBtDw}
2015-08-31 10:13:08,911 INFO  TESTNG PASSED: "Surefire test" - org.apache.brooklyn.camp.brooklyn.catalog.CatalogYamlVersioningTest.testVersionedReferenceJustAddedExplicitVersion()
finished in 53 ms
2015-08-31 10:13:08,911 INFO  TESTNG INVOKING CONFIGURATION: "Surefire test" - @AfterMethod
org.apache.brooklyn.camp.brooklyn.AbstractYamlTest.tearDown()
2015-08-31 10:13:08,912 INFO  Stopping application BasicApplicationImpl{id=GHKaBtDw}
2015-08-31 10:13:08,914 INFO  Stopped application BasicApplicationImpl{id=GHKaBtDw}
2015-08-31 10:13:09,039 INFO  TESTNG PASSED CONFIGURATION: "Surefire test" - @AfterMethod
org.apache.brooklyn.camp.brooklyn.AbstractYamlTest.tearDown() finished in 128 ms
2015-08-31 10:13:09,039 INFO  TESTNG INVOKING CONFIGURATION: "Surefire test" - @BeforeMethod
org.apache.brooklyn.camp.brooklyn.catalog.CatalogYamlVersioningTest.setUp()
2015-08-31 10:13:09,301 INFO  TESTNG PASSED CONFIGURATION: "Surefire test" - @BeforeMethod
org.apache.brooklyn.camp.brooklyn.catalog.CatalogYamlVersioningTest.setUp() finished in 262
ms
2015-08-31 10:13:09,301 INFO  TESTNG INVOKING: "Surefire test" - org.apache.brooklyn.camp.brooklyn.catalog.CatalogYamlVersioningTest.testVersionedReferenceJustAddedImplicitVersionSyntax()
2015-08-31 10:13:09,354 INFO  CAMP placing 'BasicApplicationImpl{id=nd0gZJiU}' under management
2015-08-31 10:13:09,356 INFO  Test - created org.apache.brooklyn.camp.spi.Assembly@26ac162d[id=nd0gZJiU;
type=Assembly]
2015-08-31 10:13:09,356 INFO  App - BasicApplicationImpl{id=nd0gZJiU}
2015-08-31 10:13:09,360 INFO  Started application BasicApplicationImpl{id=nd0gZJiU}
2015-08-31 10:13:09,361 INFO  TESTNG PASSED: "Surefire test" - org.apache.brooklyn.camp.brooklyn.catalog.CatalogYamlVersioningTest.testVersionedReferenceJustAddedImplicitVersionSyntax()
finished in 60 ms
2015-08-31 10:13:09,361 INFO  TESTNG INVOKING CONFIGURATION: "Surefire test" - @AfterMethod
org.apache.brooklyn.camp.brooklyn.AbstractYamlTest.tearDown()
2015-08-31 10:13:09,362 INFO  Stopping application BasicApplicationImpl{id=nd0gZJiU}
2015-08-31 10:13:09,364 INFO  Stopped application BasicApplicationImpl{id=nd0gZJiU}
2015-08-31 10:13:09,512 INFO  TESTNG PASSED CONFIGURATION: "Surefire test" - @AfterMethod
org.apache.brooklyn.camp.brooklyn.AbstractYamlTest.tearDown() finished in 151 ms
2015-08-31 10:13:09,512 INFO  TESTNG INVOKING: "Surefire test" - org.apache.brooklyn.camp.brooklyn.spi.dsl.DslParseTest.testParseFunctionChain()
2015-08-31 10:13:09,513 INFO  TESTNG PASSED: "Surefire test" - org.apache.brooklyn.camp.brooklyn.spi.dsl.DslParseTest.testParseFunctionChain()
finished in 1 ms
2015-08-31 10:13:09,513 INFO  TESTNG INVOKING: "Surefire test" - org.apache.brooklyn.camp.brooklyn.spi.dsl.DslParseTest.testParseMultiArgMultiTypeFunction()
2015-08-31 10:13:09,513 INFO  TESTNG PASSED: "Surefire test" - org.apache.brooklyn.camp.brooklyn.spi.dsl.DslParseTest.testParseMultiArgMultiTypeFunction()
finished in 0 ms
2015-08-31 10:13:09,513 INFO  TESTNG INVOKING: "Surefire test" - org.apache.brooklyn.camp.brooklyn.spi.dsl.DslParseTest.testParseNoArgFunction()
2015-08-31 10:13:09,514 INFO  TESTNG PASSED: "Surefire test" - org.apache.brooklyn.camp.brooklyn.spi.dsl.DslParseTest.testParseNoArgFunction()
finished in 1 ms
2015-08-31 10:13:09,514 INFO  TESTNG INVOKING: "Surefire test" - org.apache.brooklyn.camp.brooklyn.spi.dsl.DslParseTest.testParseOneArgFunction()
2015-08-31 10:13:09,514 INFO  TESTNG PASSED: "Surefire test" - org.apache.brooklyn.camp.brooklyn.spi.dsl.DslParseTest.testParseOneArgFunction()
finished in 0 ms
2015-08-31 10:13:09,514 INFO  TESTNG INVOKING: "Surefire test" - org.apache.brooklyn.camp.brooklyn.spi.dsl.DslParseTest.testParseString()
2015-08-31 10:13:09,514 INFO  TESTNG PASSED: "Surefire test" - org.apache.brooklyn.camp.brooklyn.spi.dsl.DslParseTest.testParseString()
finished in 0 ms
2015-08-31 10:13:09,515 INFO  TESTNG INVOKING CONFIGURATION: "Surefire test" - @BeforeMethod
org.apache.brooklyn.camp.brooklyn.test.lite.CampYamlLiteTest.setUp()
SUREFIRE-859: [GC 409621K->210992K(753920K), 0.0082041 secs]
2015-08-31 10:13:09,785 INFO  TESTNG PASSED CONFIGURATION: "Surefire test" - @BeforeMethod
org.apache.brooklyn.camp.brooklyn.test.lite.CampYamlLiteTest.setUp() finished in 270 ms
2015-08-31 10:13:09,785 INFO  TESTNG INVOKING: "Surefire test" - org.apache.brooklyn.camp.brooklyn.test.lite.CampYamlLiteTest.testAddChildrenEffector()
2015-08-31 10:13:09,960 INFO  TESTNG PASSED: "Surefire test" - org.apache.brooklyn.camp.brooklyn.test.lite.CampYamlLiteTest.testAddChildrenEffector()
finished in 175 ms
2015-08-31 10:13:09,960 INFO  TESTNG INVOKING CONFIGURATION: "Surefire test" - @AfterMethod
org.apache.brooklyn.camp.brooklyn.test.lite.CampYamlLiteTest.tearDown()
2015-08-31 10:13:10,104 INFO  TESTNG PASSED CONFIGURATION: "Surefire test" - @AfterMethod
org.apache.brooklyn.camp.brooklyn.test.lite.CampYamlLiteTest.tearDown() finished in 144 ms
2015-08-31 10:13:10,104 INFO  TESTNG INVOKING CONFIGURATION: "Surefire test" - @BeforeMethod
org.apache.brooklyn.camp.brooklyn.test.lite.CampYamlLiteTest.setUp()
SUREFIRE-859: [GC 409520K->212505K(758208K), 0.0095255 secs]
2015-08-31 10:13:10,373 INFO  TESTNG PASSED CONFIGURATION: "Surefire test" - @BeforeMethod
org.apache.brooklyn.camp.brooklyn.test.lite.CampYamlLiteTest.setUp() finished in 269 ms
2015-08-31 10:13:10,374 INFO  TESTNG INVOKING: "Surefire test" - org.apache.brooklyn.camp.brooklyn.test.lite.CampYamlLiteTest.testRegisterCustomEntityWithBundleWhereEntityIsFromCoreAndIconFromBundle()
2015-08-31 10:13:10,389 INFO  TESTNG PASSED: "Surefire test" - org.apache.brooklyn.camp.brooklyn.test.lite.CampYamlLiteTest.testRegisterCustomEntityWithBundleWhereEntityIsFromCoreAndIconFromBundle()
finished in 15 ms
2015-08-31 10:13:10,389 INFO  TESTNG INVOKING CONFIGURATION: "Surefire test" - @AfterMethod
org.apache.brooklyn.camp.brooklyn.test.lite.CampYamlLiteTest.tearDown()
2015-08-31 10:13:10,505 INFO  TESTNG PASSED CONFIGURATION: "Surefire test" - @AfterMethod
org.apache.brooklyn.camp.brooklyn.test.lite.CampYamlLiteTest.tearDown() finished in 116 ms
2015-08-31 10:13:10,506 INFO  TESTNG INVOKING CONFIGURATION: "Surefire test" - @BeforeMethod
org.apache.brooklyn.camp.brooklyn.test.lite.CampYamlLiteTest.setUp()
2015-08-31 10:13:10,810 INFO  TESTNG PASSED CONFIGURATION: "Surefire test" - @BeforeMethod
org.apache.brooklyn.camp.brooklyn.test.lite.CampYamlLiteTest.setUp() finished in 305 ms
2015-08-31 10:13:10,810 INFO  TESTNG INVOKING: "Surefire test" - org.apache.brooklyn.camp.brooklyn.test.lite.CampYamlLiteTest.testResetXmlWithCustomEntity()
SUREFIRE-859: [GC 416665K->214278K(756672K), 0.0117300 secs]
2015-08-31 10:13:11,341 INFO  TESTNG PASSED: "Surefire test" - org.apache.brooklyn.camp.brooklyn.test.lite.CampYamlLiteTest.testResetXmlWithCustomEntity()
finished in 531 ms
2015-08-31 10:13:11,341 INFO  TESTNG INVOKING CONFIGURATION: "Surefire test" - @AfterMethod
org.apache.brooklyn.camp.brooklyn.test.lite.CampYamlLiteTest.tearDown()
2015-08-31 10:13:11,434 INFO  TESTNG PASSED CONFIGURATION: "Surefire test" - @AfterMethod
org.apache.brooklyn.camp.brooklyn.test.lite.CampYamlLiteTest.tearDown() finished in 93 ms
2015-08-31 10:13:11,434 INFO  TESTNG INVOKING CONFIGURATION: "Surefire test" - @BeforeMethod
org.apache.brooklyn.camp.brooklyn.test.lite.CampYamlLiteTest.setUp()
2015-08-31 10:13:11,697 INFO  TESTNG PASSED CONFIGURATION: "Surefire test" - @BeforeMethod
org.apache.brooklyn.camp.brooklyn.test.lite.CampYamlLiteTest.setUp() finished in 263 ms
2015-08-31 10:13:11,697 INFO  TESTNG INVOKING: "Surefire test" - org.apache.brooklyn.camp.brooklyn.test.lite.CampYamlLiteTest.testYamlServiceForCatalog()
2015-08-31 10:13:11,708 INFO  TESTNG PASSED: "Surefire test" - org.apache.brooklyn.camp.brooklyn.test.lite.CampYamlLiteTest.testYamlServiceForCatalog()
finished in 11 ms
2015-08-31 10:13:11,708 INFO  TESTNG INVOKING CONFIGURATION: "Surefire test" - @AfterMethod
org.apache.brooklyn.camp.brooklyn.test.lite.CampYamlLiteTest.tearDown()
2015-08-31 10:13:11,838 INFO  TESTNG PASSED CONFIGURATION: "Surefire test" - @AfterMethod
org.apache.brooklyn.camp.brooklyn.test.lite.CampYamlLiteTest.tearDown() finished in 130 ms
2015-08-31 10:13:11,839 INFO  TESTNG INVOKING CONFIGURATION: "Surefire test" - @BeforeMethod
org.apache.brooklyn.camp.brooklyn.test.lite.CampYamlLiteTest.setUp()
SUREFIRE-859: [GC 418438K->214838K(761344K), 0.0169678 secs]
2015-08-31 10:13:12,128 INFO  TESTNG PASSED CONFIGURATION: "Surefire test" - @BeforeMethod
org.apache.brooklyn.camp.brooklyn.test.lite.CampYamlLiteTest.setUp() finished in 289 ms
2015-08-31 10:13:12,128 INFO  TESTNG INVOKING: "Surefire test" - org.apache.brooklyn.camp.brooklyn.test.lite.CampYamlLiteTest.testYamlServiceMatchAndBrooklynInstantiate()
2015-08-31 10:13:12,130 INFO  AT is:
org.apache.brooklyn.camp.spi.AssemblyTemplate@6d99950d[id=dPdRa17n; type=AssemblyTemplate]
2015-08-31 10:13:12,156 INFO  TESTNG PASSED: "Surefire test" - org.apache.brooklyn.camp.brooklyn.test.lite.CampYamlLiteTest.testYamlServiceMatchAndBrooklynInstantiate()
finished in 28 ms
2015-08-31 10:13:12,156 INFO  TESTNG INVOKING CONFIGURATION: "Surefire test" - @AfterMethod
org.apache.brooklyn.camp.brooklyn.test.lite.CampYamlLiteTest.tearDown()
2015-08-31 10:13:12,282 INFO  TESTNG PASSED CONFIGURATION: "Surefire test" - @AfterMethod
org.apache.brooklyn.camp.brooklyn.test.lite.CampYamlLiteTest.tearDown() finished in 126 ms
2015-08-31 10:13:12,342 INFO  TESTNG 
===============================================
    Surefire test
    Tests run: 217, Failures: 1, Skips: 0
===============================================
2015-08-31 10:13:12,342 INFO  BrooklynLeakListener.onFinish attempting to terminate all extant
ManagementContexts: name=Surefire test; includedGroups=[]; excludedGroups=[Integration, Acceptance,
Live, WIP]; suiteName=Surefire suite; outDir=F:\hudson\hudson-slave\workspace\incubator-brooklyn-master-windows\usage\camp\target\surefire-reports\Surefire
suite: no org.apache.brooklyn.core.management.internal.LocalManagementContext available, so
skipped
Tests run: 217, Failures: 1, Errors: 0, Skipped: 0, Time elapsed: 113.343 sec <<<
FAILURE! - in TestSuite
testRebindWithCatalogPropertiesForDeprecationAndEnablementAbsent(org.apache.brooklyn.camp.brooklyn.catalog.CatalogYamlRebindTest)
 Time elapsed: 0.159 sec  <<< FAILURE!
org.apache.brooklyn.util.exceptions.PropagatedRuntimeException: 
	at org.apache.brooklyn.core.mgmt.persist.FileBasedObjectStore.moveFile(FileBasedObjectStore.java:393)
	at org.apache.brooklyn.core.mgmt.persist.FileBasedStoreObjectAccessor.put(FileBasedStoreObjectAccessor.java:86)
	at org.apache.brooklyn.camp.brooklyn.catalog.CatalogYamlRebindTest$1.apply(CatalogYamlRebindTest.java:216)
	at org.apache.brooklyn.camp.brooklyn.catalog.CatalogYamlRebindTest$1.apply(CatalogYamlRebindTest.java:209)
	at org.apache.brooklyn.core.mgmt.rebind.RebindTestUtils.rebindAll(RebindTestUtils.java:433)
	at org.apache.brooklyn.core.mgmt.rebind.RebindTestUtils.rebind(RebindTestUtils.java:318)
	at org.apache.brooklyn.core.mgmt.rebind.RebindTestFixture.rebind(RebindTestFixture.java:254)
	at org.apache.brooklyn.camp.brooklyn.AbstractYamlRebindTest.rebind(AbstractYamlRebindTest.java:86)
	at org.apache.brooklyn.camp.brooklyn.catalog.CatalogYamlRebindTest.runRebindWithCatalogAndApp(CatalogYamlRebindTest.java:208)
	at org.apache.brooklyn.camp.brooklyn.catalog.CatalogYamlRebindTest.testRebindWithCatalogPropertiesForDeprecationAndEnablementAbsent(CatalogYamlRebindTest.java:123)


Results :

Failed tests: 
  CatalogYamlRebindTest.testRebindWithCatalogPropertiesForDeprecationAndEnablementAbsent:123->runRebindWithCatalogAndApp:208->AbstractYamlRebindTest.rebind:86->RebindTestFixture.rebind:254
ยป PropagatedRuntime

Tests run: 217, Failures: 1, Errors: 0, Skipped: 0

[JENKINS] Recording test results
[JENKINS] Archiving disabled
[INFO]                                                                         
[INFO] ------------------------------------------------------------------------
[INFO] Skipping Brooklyn REST Server
[INFO] This project has been banned from the build due to previous failures.
[INFO] ------------------------------------------------------------------------
[INFO]                                                                         
[INFO] ------------------------------------------------------------------------
[INFO] Skipping Brooklyn REST JavaScript Web GUI
[INFO] This project has been banned from the build due to previous failures.
[INFO] ------------------------------------------------------------------------
[INFO]                                                                         
[INFO] ------------------------------------------------------------------------
[INFO] Skipping Brooklyn Launcher
[INFO] This project has been banned from the build due to previous failures.
[INFO] ------------------------------------------------------------------------
[INFO]                                                                         
[INFO] ------------------------------------------------------------------------
[INFO] Skipping Brooklyn Command Line Interface
[INFO] This project has been banned from the build due to previous failures.
[INFO] ------------------------------------------------------------------------
[INFO]                                                                         
[INFO] ------------------------------------------------------------------------
[INFO] Skipping Brooklyn All Things
[INFO] This project has been banned from the build due to previous failures.
[INFO] ------------------------------------------------------------------------
[INFO]                                                                         
[INFO] ------------------------------------------------------------------------
[INFO] Skipping Brooklyn Simple Web Cluster Example
[INFO] This project has been banned from the build due to previous failures.
[INFO] ------------------------------------------------------------------------
[INFO]                                                                         
[INFO] ------------------------------------------------------------------------
[INFO] Skipping Brooklyn Global Web Fabric Example
[INFO] This project has been banned from the build due to previous failures.
[INFO] ------------------------------------------------------------------------
[INFO]                                                                         
[INFO] ------------------------------------------------------------------------
[INFO] Skipping Brooklyn Simple Messaging Publish-Subscribe Example
[INFO] This project has been banned from the build due to previous failures.
[INFO] ------------------------------------------------------------------------
[INFO]                                                                         
[INFO] ------------------------------------------------------------------------
[INFO] Skipping Brooklyn NoSQL Cluster Examples
[INFO] This project has been banned from the build due to previous failures.
[INFO] ------------------------------------------------------------------------
[INFO]                                                                         
[INFO] ------------------------------------------------------------------------
[INFO] Skipping Brooklyn Distribution
[INFO] This project has been banned from the build due to previous failures.
[INFO] ------------------------------------------------------------------------
[INFO]                                                                         
[INFO] ------------------------------------------------------------------------
[INFO] Skipping Brooklyn QA
[INFO] This project has been banned from the build due to previous failures.
[INFO] ------------------------------------------------------------------------
[INFO]                                                                         
[INFO] ------------------------------------------------------------------------
[INFO] Skipping Brooklyn REST Client
[INFO] This project has been banned from the build due to previous failures.
[INFO] ------------------------------------------------------------------------
[INFO] ------------------------------------------------------------------------
[INFO] Reactor Summary:
[INFO] 
[INFO] Brooklyn Root ..................................... SUCCESS [9.171s]
[INFO] Brooklyn Parent Project ........................... SUCCESS [9.572s]
[INFO] Brooklyn Logback Configuration .................... SUCCESS [6.726s]
[INFO] Brooklyn Test Support Utilities ................... SUCCESS [4.844s]
[INFO] Brooklyn Logback Includable Configuration ......... SUCCESS [1.861s]
[INFO] Brooklyn Common Utilities ......................... SUCCESS [33.933s]
[INFO] Brooklyn API ...................................... SUCCESS [5.520s]
[INFO] Brooklyn Test Support ............................. SUCCESS [8.484s]
[INFO] CAMP Server Parent Project ........................ SUCCESS [0.683s]
[INFO] CAMP Base ......................................... SUCCESS [6.633s]
[INFO] Brooklyn Groovy Utilities ......................... SUCCESS [9.552s]
[INFO] Brooklyn Core ..................................... SUCCESS [4:14.596s]
[INFO] Brooklyn Policies ................................. SUCCESS [1:44.760s]
[INFO] Brooklyn Jclouds Location Targets ................. SUCCESS [48.883s]
[INFO] Brooklyn Secure JMXMP Agent ....................... SUCCESS [13.971s]
[INFO] Brooklyn JMX RMI Agent ............................ SUCCESS [2.398s]
[INFO] Brooklyn Software Base ............................ SUCCESS [1:04.738s]
[INFO] Brooklyn Web App Software Entities ................ SUCCESS [2:03.057s]
[INFO] Brooklyn Database Software Entities ............... SUCCESS [12.884s]
[INFO] Brooklyn NoSQL Data Store Software Entities ....... SUCCESS [30.563s]
[INFO] Brooklyn CAMP REST API ............................ FAILURE [2:06.777s]
[INFO] Brooklyn REST Server .............................. SKIPPED
[INFO] Brooklyn REST JavaScript Web GUI .................. SKIPPED
[INFO] Brooklyn Launcher ................................. SKIPPED
[INFO] Brooklyn Command Line Interface ................... SKIPPED
[INFO] Brooklyn All Things ............................... SKIPPED
[INFO] Brooklyn Simple Web Cluster Example ............... SKIPPED
[INFO] Brooklyn Global Web Fabric Example ................ SKIPPED
[INFO] Brooklyn Simple Messaging Publish-Subscribe Example  SKIPPED
[INFO] Brooklyn NoSQL Cluster Examples ................... SKIPPED
[INFO] Brooklyn Distribution ............................. SKIPPED
[INFO] Brooklyn QA ....................................... SKIPPED
[INFO] Brooklyn REST Client .............................. SKIPPED
[INFO] ------------------------------------------------------------------------
[INFO] BUILD FAILURE
[INFO] ------------------------------------------------------------------------
[INFO] Total time: 15:46.814s
[INFO] Finished at: Mon Aug 31 10:13:13 BST 2015
[INFO] Final Memory: 63M/241M
[INFO] ------------------------------------------------------------------------
[JENKINS] Archiving disabled
[JENKINS] Archiving disabled
[JENKINS] Archiving disabled
[JENKINS] Archiving disabled
[JENKINS] Archiving disabled
[JENKINS] Archiving disabled
[JENKINS] Archiving disabled
[JENKINS] Archiving disabled
[JENKINS] Archiving disabled
[JENKINS] Archiving disabled
[JENKINS] Archiving disabled
[JENKINS] Archiving disabled
[JENKINS] Archiving disabled
[JENKINS] Archiving disabled
[JENKINS] Archiving disabled
[JENKINS] Archiving disabled
[JENKINS] Archiving disabled
[JENKINS] Archiving disabled
[JENKINS] Archiving disabled
[JENKINS] Archiving disabled
[JENKINS] Archiving disabled
[JENKINS] Archiving disabled
[JENKINS] Archiving disabled
[JENKINS] Archiving disabled
[JENKINS] Archiving disabled
[JENKINS] Archiving disabled
[JENKINS] Archiving disabled
[JENKINS] Archiving disabled
[JENKINS] Archiving disabled
[JENKINS] Archiving disabled
[JENKINS] Archiving disabled
[JENKINS] Archiving disabled
[JENKINS] Archiving disabled
Waiting for Jenkins to finish collecting data
[ERROR] Failed to execute goal org.apache.maven.plugins:maven-surefire-plugin:2.18.1:test
(default-test) on project brooklyn-camp: There are test failures.
[ERROR] 
[ERROR] Please refer to F:\hudson\hudson-slave\workspace\incubator-brooklyn-master-windows\usage\camp\target\surefire-reports
for the individual test results.
[ERROR] -> [Help 1]
[ERROR] 
[ERROR] To see the full stack trace of the errors, re-run Maven with the -e switch.
[ERROR] Re-run Maven using the -X switch to enable full debug logging.
[ERROR] 
[ERROR] For more information about the errors and possible solutions, please read the following
articles:
[ERROR] [Help 1] http://cwiki.apache.org/confluence/display/MAVEN/MojoFailureException
[ERROR] 
[ERROR] After correcting the problems, you can resume the build with the command
[ERROR]   mvn <goals> -rf :brooklyn-camp
channel stopped

Mime
View raw message