brooklyn-dev mailing list archives

Site index · List index
Message view « Date » · « Thread »
Top « Date » · « Thread »
From Apache Jenkins Server <jenk...@builds.apache.org>
Subject Build failed in Jenkins: incubator-brooklyn-master-integration #167
Date Wed, 19 Aug 2015 04:04:43 GMT
See <https://builds.apache.org/job/incubator-brooklyn-master-integration/167/changes>

Changes:

[hadrian] [BROOKLYN-162] Refactor package in ./core/util

[hadrian] [BROOKLYN-162] Refactor package in ./core/policy

[aled.sage] Test + fix BrooklynAccessUtils

[robertgmoss] add the creation of default database and user with generated password.

[ivana.yovcheva] [BROOKLYN-162] Renaming package brooklyn.basic at ./core

[robertgmoss] escape user input to sql

[yavor] Adding --replacepkgs parameter to ensure proper epel install

[hadrian] Fix conflicts after merging #833

[hadrian] [BROOKLYN-162] Package renames in ./core/internal

[ivana.yovcheva] [BROOKLYN-162] Renaming package policy

[cheepeero] brooklyn-software-messaging: add org.apache package prefix

[cheepeero] brooklyn-software-database: add org.apache package prefix

[robertgmoss] make initialize database optional

[robertgmoss] add check to avoid null pointer exception

[alex.heneveld] BROOKLYN-162 convert camp-base and camp-server to org.apache prefix

[alex.heneveld] update leftover camp items

[alex.heneveld] update leftover rest items

[alex.heneveld] BROOKLYN-162 - apply org.apache package prefix to utils-common

[alex.heneveld] BROOKLYN-162 - apply org.apache package prefix to utils-groovy

[alex.heneveld] BROOKLYN-162 - apply org.apache package prefix to osgi test bundles; NB these
might be moved back to core/test/dependencies as per discussion at #810, once we finish a
few more package prefixes

[alex.heneveld] BROOKLYN-162 - apply org.apache package prefix to jmx util/agent projects

[alex.heneveld] BROOKLYN-162 - adjust software/monitoring for refactoring (i didn't have this
loaded)

[alex.heneveld] BROOKLYN-162 - apply org.apache package prefix to logback-includes class

[alex.heneveld] more rest-server tidies

[alex.heneveld] BROOKLYN-162 - apply org.apache package prefix to core config packages

[alex.heneveld] BROOKLYN-162 - apply org.apache package prefix to core camp

[valentin.aitken] Ldap config fix

[alex.heneveld] BROOKLYN-162 - update archetype sample for refactoring

[alex.heneveld] BROOKLYN-162 - update qa project for recent refactoring

[mike.zaccardo] Add deprecation guidelines to website docs

------------------------------------------
[...truncated 37641 lines...]
  SshCliToolIntegrationTest>ShellToolAbstractTest.testExecScriptReturningZeroExitCode:127
» Ssh
  SshCliToolIntegrationTest>ShellToolAbstractTest.testExecScriptWithSleepThenBigCommand:189->ShellToolAbstractTest.execScript:415->ShellToolAbstractTest.execScript:419->ShellToolAbstractTest.execScript:434
» Ssh
  SshCliToolIntegrationTest>ShellToolAbstractTest.testExecScriptWithSleepThenExit:148->ShellToolAbstractTest.execScript:415->ShellToolAbstractTest.execScript:419->ShellToolAbstractTest.execScript:434
» Ssh
  SshCliToolIntegrationTest>SshToolAbstractIntegrationTest.testOutputAsExpected:281->ShellToolAbstractTest.execCommands:395->ShellToolAbstractTest.execCommands:399->ShellToolAbstractTest.execCommands:403->ShellToolAbstractTest.execCommands:410
» Ssh
  SshCliToolIntegrationTest>ShellToolAbstractTest.testRunAsRoot:368 » Ssh exit c...
  SshCliToolIntegrationTest>ShellToolAbstractTest.testScriptDataNotLost:140->ShellToolAbstractTest.execScript:415->ShellToolAbstractTest.execScript:419->ShellToolAbstractTest.execScript:434
» Ssh
  SshCliToolIntegrationTest>SshToolAbstractIntegrationTest.testScriptDirPropertiesIsRespected:298
» Ssh
  SshCliToolIntegrationTest>ShellToolAbstractTest.testScriptHeader:339->ShellToolAbstractTest.execScript:434
» Ssh
  SshCliToolIntegrationTest>ShellToolAbstractTest.testStdErr:353 » Ssh exit code...
  SshCliToolPerformanceTest>SshToolAbstractPerformanceTest.testConsecutiveBigStdinCommands:95->SshToolAbstractPerformanceTest.runExecManyCommands:103->SshToolAbstractPerformanceTest.runMany:113->SshToolAbstractPerformanceTest.access$100:48->SshToolAbstractPerformanceTest.execScript:129
» Ssh
  SshCliToolPerformanceTest>SshToolAbstractPerformanceTest.testConsecutiveBigStdoutCommands:89->SshToolAbstractPerformanceTest.runExecManyCommands:103->SshToolAbstractPerformanceTest.runMany:113->SshToolAbstractPerformanceTest.access$100:48->SshToolAbstractPerformanceTest.execScript:129
» Ssh
  SshCliToolPerformanceTest>SshToolAbstractPerformanceTest.testConsecutiveSmallCommands:79->SshToolAbstractPerformanceTest.runExecManyCommands:103->SshToolAbstractPerformanceTest.runMany:113->SshToolAbstractPerformanceTest.access$100:48->SshToolAbstractPerformanceTest.execScript:129
» Ssh
  SshCliToolPerformanceTest>SshToolAbstractPerformanceTest.testConsecutiveSmallCommandsWithStdouterr:84->SshToolAbstractPerformanceTest.runExecManyCommands:103->SshToolAbstractPerformanceTest.runMany:113->SshToolAbstractPerformanceTest.access$100:48->SshToolAbstractPerformanceTest.execScript:129
» Ssh
  ProcessToolIntegrationTest>ShellToolAbstractTest.testRunAsRoot:369 not running as root;
whoami is: Executed /tmp/brooklyn-20150819-022715261-HuFc.sh, result 1
 (err is 'sudo: a password is required
') expected [true] but found [false]
  SshjToolAsyncStubIntegrationTest.testPolls:123->runTest:161 » Ssh (jenkins@loc...
  SshjToolAsyncStubIntegrationTest.testPollsAndReturnsNonZeroExitCode:134->runTest:161
» Ssh
  SshjToolAsyncStubIntegrationTest.testPollsRepeatedly:151->runTest:161 » Ssh (j...
org.apache.brooklyn.core.util.internal.ssh.sshj.SshjToolIntegrationTest.setUp(org.apache.brooklyn.core.util.internal.ssh.sshj.SshjToolIntegrationTest)
  Run 1: SshjToolIntegrationTest>SshToolAbstractIntegrationTest.setUp:99->ShellToolAbstractTest.setUp:85->ShellToolAbstractTest.connect:100
» Ssh
  Run 2: PASS
  Run 3: PASS
  Run 4: PASS
  Run 5: PASS
  Run 6: PASS
  Run 7: PASS
  Run 8: PASS
  Run 9: PASS
  Run 10: PASS
  Run 11: PASS
  Run 12: PASS
  Run 13: PASS
  Run 14: PASS
  Run 15: PASS
  Run 16: PASS
  Run 17: PASS
  Run 18: PASS
  Run 19: PASS
  Run 20: PASS
  Run 21: PASS
  Run 22: PASS
  Run 23: PASS
  Run 24: PASS
  Run 25: PASS
  Run 26: PASS
  Run 27: PASS
  Run 28: PASS
  Run 29: PASS
  Run 30: PASS
  Run 31: PASS
  Run 32: PASS
  Run 33: PASS
  Run 34: PASS
  Run 35: PASS
  Run 36: PASS
  Run 37: PASS
  Run 38: PASS
  Run 39: PASS
  Run 40: PASS
  Run 41: PASS
  Run 42: PASS
  Run 43: PASS

  SshjToolPerformanceTest>SshToolAbstractPerformanceTest.testConsecutiveBigStdinCommands:95->SshToolAbstractPerformanceTest.runExecManyCommands:103->SshToolAbstractPerformanceTest.runMany:113->SshToolAbstractPerformanceTest.access$100:48->SshToolAbstractPerformanceTest.execScript:128
» Ssh
  SshjToolPerformanceTest>SshToolAbstractPerformanceTest.testConsecutiveBigStdoutCommands:89->SshToolAbstractPerformanceTest.runExecManyCommands:103->SshToolAbstractPerformanceTest.runMany:113->SshToolAbstractPerformanceTest.access$100:48->SshToolAbstractPerformanceTest.execScript:128
» Ssh
  SshjToolPerformanceTest>SshToolAbstractPerformanceTest.testConsecutiveConnectAndDisconnect:74->SshToolAbstractPerformanceTest.runMany:113
» Ssh
  SshjToolPerformanceTest>SshToolAbstractPerformanceTest.testConsecutiveSmallCommands:79->SshToolAbstractPerformanceTest.runExecManyCommands:103->SshToolAbstractPerformanceTest.runMany:113->SshToolAbstractPerformanceTest.access$100:48->SshToolAbstractPerformanceTest.execScript:128
» Ssh
  SshjToolPerformanceTest>SshToolAbstractPerformanceTest.testConsecutiveSmallCommandsWithStdouterr:84->SshToolAbstractPerformanceTest.runExecManyCommands:103->SshToolAbstractPerformanceTest.runMany:113->SshToolAbstractPerformanceTest.access$100:48->SshToolAbstractPerformanceTest.execScript:128
» Ssh
  BashCommandsIntegrationTest.testAlternatives:192 » Execution java.lang.Illegal...
  BashCommandsIntegrationTest.testAlternativesWhereFirstSucceeds:178 » Execution
  BashCommandsIntegrationTest.testDownloadFirstSuccessfulFile:155 » IllegalState
  BashCommandsIntegrationTest.testDownloadToStdout:168 » Execution java.lang.Ill...
  BashCommandsIntegrationTest.testPipeMultiline:259 » PropagatedRuntime 
  BashCommandsIntegrationTest.testRequireFailureExitsImmediately:250 » Execution
  BashCommandsIntegrationTest.testRequireFileHandlesFailure:225 » Execution java...
  BashCommandsIntegrationTest.testRequireFileHandlesSuccess:238 » Execution java...
  BashCommandsIntegrationTest.testRequireTestHandlesFailure:203 » Execution java...
  BashCommandsIntegrationTest.testRequireTestHandlesSuccess:215 » Execution java...
  BashCommandsIntegrationTest.testSudo:132 » IllegalState Cannot establish ssh c...
  BashCommandsIntegrationTest.testWaitForFileContentsWhenAbortingOnFail:270 » IllegalState
  BashCommandsIntegrationTest.testWaitForFileContentsWhenContentsAppearAfterStart:304 » PropagatedRuntime
  BashCommandsIntegrationTest.testWaitForFileContentsWhenNotAbortingOnFail:283 » PropagatedRuntime
  SshTasksTest.testCopyTo:127 » FileNotFound File '/tmp/SshTasksTest-oN5t/f1' do...
  SshTasksTest.testCopyToFailBadSubdirCreate:179 » FileNotFound File '/tmp/SshTa...
  SshTasksTest.testSshEchoHello:117 » PropagatedRuntime 
  SshTasksTest.testSshFetch:194 » PropagatedRuntime 
  SshTasksTest.testSshIgnoringHeaderProperty:209 mismatched output was:  expected [true] but
found [false]
  SshTasksTest.testSshWithHeaderProperty:202 mismatched output was:  expected [true] but found
[false]
  LocalhostProvisioningAndAccessTest.testProvisionAndConnect:54 » IllegalState C...
  LocationConfigUtilsTest.testReadsPrivateKeyFileWithTildePath:90 expected [true] but found
[false]
  LocationConfigUtilsTest.testReadsPublicKeyFileWithTildePath:144 expected [true] but found
[false]
  MachineDetailsTest.testGetMachineDetails:69 » PropagatedRuntime 
  SshMachineLocationIntegrationTest.testExecScriptScriptDirFlagIsRespected:106 » IllegalState
  SshMachineLocationIntegrationTest.testExtractingConnectablePassphraselessKey:78 » NullPointer
  SshMachineLocationIntegrationTest.testLocationScriptDirConfigIsRespected:122 » IllegalState
  SshMachineLocationIntegrationTest.testMissingLocationScriptDirIsAlsoOkay:137 » IllegalState
  SshMachineLocationPerformanceTest.testConcurrentSmallCommands:95->runExecManyCommands:138->runMany:158
» Execution
  SshMachineLocationPerformanceTest.testConsecutiveBigStdinCommands:106->runExecManyCommands:130->runExecManyCommands:138->runMany:158
» Execution
  SshMachineLocationPerformanceTest.testConsecutiveBigStdoutCommands:100->runExecManyCommands:130->runExecManyCommands:138->runMany:158
» Execution
  SshMachineLocationPerformanceTest.testConsecutiveSmallCommands:77->runExecManyCommands:130->runExecManyCommands:138->runMany:158
» Execution
  SshMachineLocationPerformanceTest.testConsecutiveSmallCommandsWithCustomStdoutAndErr:90->runMany:158
» Execution
  SshMachineLocationPerformanceTest.testConsecutiveSmallCommandsWithDifferentProperties:126->runMany:158
» Execution
  SshMachineLocationReuseIntegrationTest.testBasicReuse:120 » IllegalState Canno...
  SshMachineLocationReuseIntegrationTest.testNewConnectionForDifferentProps:134 » IllegalState
  SshMachineLocationReuseIntegrationTest.testReuseWithInterestingProps:127 » IllegalState
  SshMachineLocationReuseIntegrationTest.testSshCacheExpiresEvenIfNotUsed:158 » IllegalState
  SshMachineLocationReuseIntegrationTest.testSshToolReusedWhenConfigDiffers:142 » IllegalState
  SshMachineLocationTest.testCopyFileTo:231 » IllegalState Cannot establish ssh ...
  SshMachineLocationTest.testCopyStreamTo:245 » IllegalState Cannot establish ss...
  SshMachineLocationTest.testGetMachineDetails:106 » Execution org.apache.brookl...
  SshMachineLocationTest.testInstallClasspathCopyTo:271 » IllegalState Cannot es...
  SshMachineLocationTest.testInstallUrlTo:257 » IllegalState Cannot establish ss...
  SshMachineLocationTest.testIsSshableWhenTrue:283 expected [true] but found [false]
  SshMachineLocationTest.testOverridingPropertyOnExec:212 » IllegalState Cannot ...
  SshMachineLocationTest.testSshExecCommands:199 » IllegalState Cannot establish...
  SshMachineLocationTest.testSshExecScript:188 » IllegalState Cannot establish s...
  HostGeoLookupIntegrationTest.testLocalhostGetsLocation:43 host lookup unavailable - is the
maxmind database installed? or else network unavailable or too slow? expected object to not
be null
  HostGeoLookupIntegrationTest.testMaxmindLookup:74 host lookup unavailable - is the maxmind
database installed? expected object to not be null
  HostGeoLookupIntegrationTest.testUtraceLookup:65 host lookup unavailable - maybe network
not available  expected object to not be null

Tests run: 1300, Failures: 117, Errors: 0, Skipped: 46

[JENKINS] Recording test results
[INFO] ------------------------------------------------------------------------
[INFO] Reactor Summary:
[INFO] 
[INFO] Brooklyn Root ..................................... SUCCESS [5.146s]
[INFO] Brooklyn Parent Project ........................... SUCCESS [6.557s]
[INFO] Brooklyn Test Support Utilities ................... SUCCESS [10.299s]
[INFO] Brooklyn Logback Includable Configuration ......... SUCCESS [4.207s]
[INFO] Brooklyn Common Utilities ......................... FAILURE [48.522s]
[INFO] Brooklyn API ...................................... SUCCESS [5.382s]
[INFO] Brooklyn Test Support ............................. SUCCESS [8.853s]
[INFO] CAMP Server Parent Project ........................ SUCCESS [1.193s]
[INFO] CAMP Base ......................................... SUCCESS [7.203s]
[INFO] Brooklyn Groovy Utilities ......................... SUCCESS [11.831s]
[INFO] Brooklyn Core ..................................... FAILURE [1:57:39.868s]
[INFO] ------------------------------------------------------------------------
[INFO] BUILD FAILURE
[INFO] ------------------------------------------------------------------------
[INFO] Total time: 2:00:25.169s
[INFO] Finished at: Wed Aug 19 04:04:20 UTC 2015
[INFO] Final Memory: 41M/241M
[INFO] ------------------------------------------------------------------------
Waiting for Jenkins to finish collecting data
[ERROR] Failed to execute goal org.apache.maven.plugins:maven-surefire-plugin:2.18.1:test
(default-test) on project brooklyn-utils-common: There are test failures.
[ERROR] 
[ERROR] Please refer to <https://builds.apache.org/job/incubator-brooklyn-master-integration/ws/utils/common/target/surefire-reports>
for the individual test results.
[ERROR] -> [Help 1]
[ERROR] Failed to execute goal org.apache.maven.plugins:maven-surefire-plugin:2.18.1:test
(default-test) on project brooklyn-core: There are test failures.
[ERROR] 
[ERROR] Please refer to <https://builds.apache.org/job/incubator-brooklyn-master-integration/ws/core/target/surefire-reports>
for the individual test results.
[ERROR] -> [Help 1]
[ERROR] 
[ERROR] To see the full stack trace of the errors, re-run Maven with the -e switch.
[ERROR] Re-run Maven using the -X switch to enable full debug logging.
[ERROR] 
[ERROR] For more information about the errors and possible solutions, please read the following
articles:
[ERROR] [Help 1] http://cwiki.apache.org/confluence/display/MAVEN/MojoFailureException
[ERROR] 
[ERROR] After correcting the problems, you can resume the build with the command
[ERROR]   mvn <goals> -rf :brooklyn-utils-common
[JENKINS] Archiving <https://builds.apache.org/job/incubator-brooklyn-master-integration/ws/core/pom.xml>
to org.apache.brooklyn/brooklyn-core/0.8.0-SNAPSHOT/brooklyn-core-0.8.0-SNAPSHOT.pom
Sending artifact delta relative to incubator-brooklyn-master-integration » Brooklyn Core
#2
Archived 1 artifacts
Archive block size is 32768
Received 0 blocks and 9758 bytes
Compression is 0.0%
Took 0.17 sec
[JENKINS] Archiving <https://builds.apache.org/job/incubator-brooklyn-master-integration/ws/utils/groovy/pom.xml>
to org.apache.brooklyn/brooklyn-utils-groovy/0.8.0-SNAPSHOT/brooklyn-utils-groovy-0.8.0-SNAPSHOT.pom
[JENKINS] Archiving <https://builds.apache.org/job/incubator-brooklyn-master-integration/ws/utils/groovy/target/brooklyn-utils-groovy-0.8.0-SNAPSHOT.jar>
to org.apache.brooklyn/brooklyn-utils-groovy/0.8.0-SNAPSHOT/brooklyn-utils-groovy-0.8.0-SNAPSHOT.jar
[JENKINS] Archiving <https://builds.apache.org/job/incubator-brooklyn-master-integration/ws/utils/groovy/target/brooklyn-utils-groovy-0.8.0-SNAPSHOT-sources.jar>
to org.apache.brooklyn/brooklyn-utils-groovy/0.8.0-SNAPSHOT/brooklyn-utils-groovy-0.8.0-SNAPSHOT-sources.jar
Sending artifact delta relative to incubator-brooklyn-master-integration » Brooklyn Groovy
Utilities #166
Archived 3 artifacts
Archive block size is 32768
Received 0 blocks and 89805 bytes
Compression is 0.0%
Took 0.3 sec
[JENKINS] Archiving <https://builds.apache.org/job/incubator-brooklyn-master-integration/ws/utils/common/pom.xml>
to org.apache.brooklyn/brooklyn-utils-common/0.8.0-SNAPSHOT/brooklyn-utils-common-0.8.0-SNAPSHOT.pom
No prior successful build to compare, so performing full copy of artifacts
[JENKINS] Archiving <https://builds.apache.org/job/incubator-brooklyn-master-integration/ws/usage/test-support/pom.xml>
to org.apache.brooklyn/brooklyn-test-support/0.8.0-SNAPSHOT/brooklyn-test-support-0.8.0-SNAPSHOT.pom
[JENKINS] Archiving <https://builds.apache.org/job/incubator-brooklyn-master-integration/ws/usage/test-support/target/brooklyn-test-support-0.8.0-SNAPSHOT.jar>
to org.apache.brooklyn/brooklyn-test-support/0.8.0-SNAPSHOT/brooklyn-test-support-0.8.0-SNAPSHOT.jar
[JENKINS] Archiving <https://builds.apache.org/job/incubator-brooklyn-master-integration/ws/usage/test-support/target/brooklyn-test-support-0.8.0-SNAPSHOT-sources.jar>
to org.apache.brooklyn/brooklyn-test-support/0.8.0-SNAPSHOT/brooklyn-test-support-0.8.0-SNAPSHOT-sources.jar
Sending artifact delta relative to incubator-brooklyn-master-integration » Brooklyn Test
Support #166
Archived 3 artifacts
Archive block size is 32768
Received 0 blocks and 113366 bytes
Compression is 0.0%
Took 0.23 sec
[JENKINS] Archiving <https://builds.apache.org/job/incubator-brooklyn-master-integration/ws/camp/camp-base/pom.xml>
to org.apache.brooklyn.camp/camp-base/0.8.0-SNAPSHOT/camp-base-0.8.0-SNAPSHOT.pom
[JENKINS] Archiving <https://builds.apache.org/job/incubator-brooklyn-master-integration/ws/camp/camp-base/target/camp-base-0.8.0-SNAPSHOT.jar>
to org.apache.brooklyn.camp/camp-base/0.8.0-SNAPSHOT/camp-base-0.8.0-SNAPSHOT.jar
[JENKINS] Archiving <https://builds.apache.org/job/incubator-brooklyn-master-integration/ws/camp/camp-base/target/camp-base-0.8.0-SNAPSHOT-sources.jar>
to org.apache.brooklyn.camp/camp-base/0.8.0-SNAPSHOT/camp-base-0.8.0-SNAPSHOT-sources.jar
Sending artifact delta relative to incubator-brooklyn-master-integration » CAMP Base #166
Archived 3 artifacts
Archive block size is 32768
Received 0 blocks and 134341 bytes
Compression is 0.0%
Took 0.37 sec
[JENKINS] Archiving <https://builds.apache.org/job/incubator-brooklyn-master-integration/ws/parent/pom.xml>
to org.apache.brooklyn/brooklyn-parent/0.8.0-SNAPSHOT/brooklyn-parent-0.8.0-SNAPSHOT.pom
Sending artifact delta relative to incubator-brooklyn-master-integration » Brooklyn Parent
Project #166
Archived 1 artifacts
Archive block size is 32768
Received 2 blocks and 24737 bytes
Compression is 72.6%
Took 0.16 sec
[JENKINS] Archiving <https://builds.apache.org/job/incubator-brooklyn-master-integration/ws/usage/logback-includes/pom.xml>
to org.apache.brooklyn/brooklyn-logback-includes/0.8.0-SNAPSHOT/brooklyn-logback-includes-0.8.0-SNAPSHOT.pom
[JENKINS] Archiving <https://builds.apache.org/job/incubator-brooklyn-master-integration/ws/usage/logback-includes/target/brooklyn-logback-includes-0.8.0-SNAPSHOT.jar>
to org.apache.brooklyn/brooklyn-logback-includes/0.8.0-SNAPSHOT/brooklyn-logback-includes-0.8.0-SNAPSHOT.jar
[JENKINS] Archiving <https://builds.apache.org/job/incubator-brooklyn-master-integration/ws/usage/logback-includes/target/brooklyn-logback-includes-0.8.0-SNAPSHOT-sources.jar>
to org.apache.brooklyn/brooklyn-logback-includes/0.8.0-SNAPSHOT/brooklyn-logback-includes-0.8.0-SNAPSHOT-sources.jar
Sending artifact delta relative to incubator-brooklyn-master-integration » Brooklyn Logback
Includable Configuration #166
Archived 3 artifacts
Archive block size is 32768
Received 0 blocks and 42452 bytes
Compression is 0.0%
Took 0.26 sec
[JENKINS] Archiving <https://builds.apache.org/job/incubator-brooklyn-master-integration/ws/pom.xml>
to org.apache.brooklyn/brooklyn/0.8.0-SNAPSHOT/brooklyn-0.8.0-SNAPSHOT.pom
Sending artifact delta relative to incubator-brooklyn-master-integration » Brooklyn Root
#166
Archived 1 artifacts
Archive block size is 32768
Received 0 blocks and 5415 bytes
Compression is 0.0%
Took 0.15 sec
[JENKINS] Archiving <https://builds.apache.org/job/incubator-brooklyn-master-integration/ws/utils/test-support/pom.xml>
to org.apache.brooklyn/brooklyn-utils-test-support/0.8.0-SNAPSHOT/brooklyn-utils-test-support-0.8.0-SNAPSHOT.pom
[JENKINS] Archiving <https://builds.apache.org/job/incubator-brooklyn-master-integration/ws/utils/test-support/target/brooklyn-utils-test-support-0.8.0-SNAPSHOT.jar>
to org.apache.brooklyn/brooklyn-utils-test-support/0.8.0-SNAPSHOT/brooklyn-utils-test-support-0.8.0-SNAPSHOT.jar
[JENKINS] Archiving <https://builds.apache.org/job/incubator-brooklyn-master-integration/ws/utils/test-support/target/brooklyn-utils-test-support-0.8.0-SNAPSHOT-sources.jar>
to org.apache.brooklyn/brooklyn-utils-test-support/0.8.0-SNAPSHOT/brooklyn-utils-test-support-0.8.0-SNAPSHOT-sources.jar
Sending artifact delta relative to incubator-brooklyn-master-integration » Brooklyn Test
Support Utilities #166
Archived 3 artifacts
Archive block size is 32768
Received 0 blocks and 45758 bytes
Compression is 0.0%
Took 0.16 sec
[JENKINS] Archiving <https://builds.apache.org/job/incubator-brooklyn-master-integration/ws/camp/pom.xml>
to org.apache.brooklyn.camp/camp-parent/0.8.0-SNAPSHOT/camp-parent-0.8.0-SNAPSHOT.pom
Sending artifact delta relative to incubator-brooklyn-master-integration » CAMP Server Parent
Project #166
Archived 1 artifacts
Archive block size is 32768
Received 0 blocks and 1828 bytes
Compression is 0.0%
Took 0.15 sec
[JENKINS] Archiving <https://builds.apache.org/job/incubator-brooklyn-master-integration/ws/api/pom.xml>
to org.apache.brooklyn/brooklyn-api/0.8.0-SNAPSHOT/brooklyn-api-0.8.0-SNAPSHOT.pom
[JENKINS] Archiving <https://builds.apache.org/job/incubator-brooklyn-master-integration/ws/api/target/brooklyn-api-0.8.0-SNAPSHOT.jar>
to org.apache.brooklyn/brooklyn-api/0.8.0-SNAPSHOT/brooklyn-api-0.8.0-SNAPSHOT.jar
[JENKINS] Archiving <https://builds.apache.org/job/incubator-brooklyn-master-integration/ws/api/target/brooklyn-api-0.8.0-SNAPSHOT-sources.jar>
to org.apache.brooklyn/brooklyn-api/0.8.0-SNAPSHOT/brooklyn-api-0.8.0-SNAPSHOT-sources.jar
Sending artifact delta relative to incubator-brooklyn-master-integration » Brooklyn API #166
Archived 3 artifacts
Archive block size is 32768
Received 0 blocks and 265519 bytes
Compression is 0.0%
Took 0.25 sec
channel stopped
Looks like the node went offline during the build. Check the slave log for the details.

Mime
View raw message