brooklyn-dev mailing list archives

Site index · List index
Message view « Date » · « Thread »
Top « Date » · « Thread »
From Apache Jenkins Server <jenk...@builds.apache.org>
Subject Build failed in Jenkins: incubator-brooklyn-master-integration #169
Date Fri, 21 Aug 2015 21:00:00 GMT
See <https://builds.apache.org/job/incubator-brooklyn-master-integration/169/changes>

Changes:

[aled.sage] Move BrooklynFeatureEnablement to o.a.b.core

[aled.sage] Move EntityLocal to o.a.b.api.entity

[aled.sage] Move BrooklynClassLoadingContext to o.a.b.core.mgmt.classloading

[aled.sage] Move Usage(Listener|Manager) to o.a.b.core.mgmt.usage

[aled.sage] rename core’s o.a.b.entity to o.a.b.core.entity

[aled.sage] Fix imports in sandbox

[aled.sage] rename core’s o.a.b.location to o.a.b.core.location

[aled.sage] Delete deprecated GeneralPurposePolicy from core

[aled.sage] Rename o.a.b.policy.core to o.a.b.core.policy

[aled.sage] Moves SshEffectorTasks from software-base to core

[aled.sage] Fix corrupted static imports in groovy

[aled.sage] Fix imports in utils/test-bundles (missed first time)

[aled.sage] Rename o.a.b.test to o.a.b.test.support

[aled.sage] Rename utils-groovy’s package to o.a.b.util.groovy

[aled.sage] Renamed package references missed previously

[aled.sage] Rename o.a.b.util.groovy.internal to o.a.b.util.groovy

[aled.sage] Move SshEffectorTasks into core’s effector.ssh package

[aled.sage] Rename o.a.b.effector.core to o.a.b.core.effector

[aled.sage] Rename o.a.b.sensor.core to o.a.b.core.sensor

[aled.sage] Rename o.a.b.sensor.feed to o.a.b.feed and o.a.b.core.feed

[aled.sage] Rename o.a.b.sensor.enricher to o.a.b.core.enricher

[aled.sage] Move HasBrooklynManagementContext to o.a.b.core.mgmt

[richard] Skip Maven deploy for the OSGi test bundles

[aled.sage] Move o.a.b.sensor.ssh contents to core

[aled.sage] Move HttpRequestSensor to o.a.b.core.sensor.http

[aled.sage] move WindowsPerformanceCounterSensors to o.a.b.core.sensor.windows

[aled.sage] Delete deprecated UsageManager.UsageListener

[aled.sage] Delete deprecated RegistryLocationResolver

[aled.sage] Delete deprecated DynamicClusterImpl.createNode(Map)

[aled.sage] Deleted deprecated o.a.b.core.entity.lifecycle.QuorumCheck

[aled.sage] Delete deprecated MachinePool and BrooklynMachinePool

[aled.sage] Add TaskBuilder.displayName; deprecate TaskBuilder.name

[aled.sage] Adds TaskPredicates

[aled.sage] Adds VanillaSoftwareProcessStreamsIntegrationTest

[alex.heneveld] add RAT header for TaskPredicatesTest, as per #858

[alex.heneveld] Revert "Align groupId with that of the test bundles"

[alex.heneveld] Revert "[BROOKLYN-161] Ignore tests until osgi test support is in place"

[alex.heneveld] Revert "[BROOKLYN-161] Remove generated jars from source repo"

[alex.heneveld] restore the osgi bundles (original code -- will not yet compile)

[alex.heneveld] update the osgi tests code for BROOKLYN-162 refactoring (replacing newly restored
old files in original location with the updated files we made in the temporary location)

[alex.heneveld] remove the temporary test-bundles location of osgi test jars, and remove from
pom

[alex.heneveld] update osgi test entities pom file, and improve README

[alex.heneveld] restore test bundle osgi jar files, until a better mechanism for having them
is determined

[alex.heneveld] update the osgi tests with new BROOKLYN-162 package prefix

[alex.heneveld] update the standalone brooklyn-AppInCatalog.jar to refer to new packages,
and re-enable disabled test

[alex.heneveld] Illustration and test for PlanToSpecTransformer which uses XML, and tidies
encountered in the process

------------------------------------------
[...truncated 41490 lines...]
  SshMachineLocationPerformanceTest.testConcurrentSmallCommands:96->runExecManyCommands:139->runMany:159
» Execution
  SshMachineLocationPerformanceTest.testConsecutiveBigStdinCommands:107->runExecManyCommands:131->runExecManyCommands:139->runMany:159
» Execution
  SshMachineLocationPerformanceTest.testConsecutiveBigStdoutCommands:101->runExecManyCommands:131->runExecManyCommands:139->runMany:159
» Execution
  SshMachineLocationPerformanceTest.testConsecutiveSmallCommands:78->runExecManyCommands:131->runExecManyCommands:139->runMany:159
» Execution
  SshMachineLocationPerformanceTest.testConsecutiveSmallCommandsWithCustomStdoutAndErr:91->runMany:159
» Execution
  SshMachineLocationPerformanceTest.testConsecutiveSmallCommandsWithDifferentProperties:127->runMany:159
» Execution
  SshMachineLocationReuseIntegrationTest.testBasicReuse:119 » IllegalState Canno...
  SshMachineLocationReuseIntegrationTest.testNewConnectionForDifferentProps:133 » IllegalState
  SshMachineLocationReuseIntegrationTest.testReuseWithInterestingProps:126 » IllegalState
  SshMachineLocationReuseIntegrationTest.testSshCacheExpiresEvenIfNotUsed:157 » IllegalState
  SshMachineLocationReuseIntegrationTest.testSshToolReusedWhenConfigDiffers:141 » IllegalState
  SshMachineLocationTest.testCopyFileTo:236 » IllegalState Cannot establish ssh ...
  SshMachineLocationTest.testCopyStreamTo:250 » IllegalState Cannot establish ss...
  SshMachineLocationTest.testGetMachineDetails:111 » Execution org.apache.brookl...
  SshMachineLocationTest.testInstallClasspathCopyTo:276 » IllegalState Cannot es...
  SshMachineLocationTest.testInstallUrlTo:262 » IllegalState Cannot establish ss...
  SshMachineLocationTest.testIsSshableWhenTrue:288 expected [true] but found [false]
  SshMachineLocationTest.testOverridingPropertyOnExec:217 » IllegalState Cannot ...
  SshMachineLocationTest.testSshExecCommands:204 » IllegalState Cannot establish...
  SshMachineLocationTest.testSshExecScript:193 » IllegalState Cannot establish s...
  ResourceUtilsTest.testGetResourceViaSftp:157 » Runtime Error getting resource ...
  ResourceUtilsTest.testGetResourceViaSftpWithUsername:164 » Runtime Error getti...
  ArchiveUtilsTest.testDeployExplicitDestFile:110 » IllegalState Cannot establis...
  ArchiveUtilsTest.testDeployJarNotUnpacked:103 » IllegalState Cannot establish ...
  ArchiveUtilsTest.testDeployZipDeletingArchiveAfterUnpack:95 » IllegalState Can...
  ArchiveUtilsTest.testDeployZipWithNoOptionalArgsSupplied:87 » IllegalState Can...
  SshCliToolIntegrationTest>SshToolAbstractIntegrationTest.testAllocatePty:233 » Ssh
  SshCliToolIntegrationTest>SshToolAbstractIntegrationTest.testCopyFileToServerWithPermissions:192->SshToolAbstractIntegrationTest.assertRemoteFileContents:105->ShellToolAbstractTest.execCommands:395->ShellToolAbstractTest.execCommands:399->ShellToolAbstractTest.execCommands:403->ShellToolAbstractTest.execCommands:410
» Ssh
  SshCliToolIntegrationTest>SshToolAbstractIntegrationTest.testCopyFromServer:206 » FileNotFound
  SshCliToolIntegrationTest>SshToolAbstractIntegrationTest.testCopyToServerFromBytes:149->SshToolAbstractIntegrationTest.assertRemoteFileContents:105->ShellToolAbstractTest.execCommands:395->ShellToolAbstractTest.execCommands:399->ShellToolAbstractTest.execCommands:403->ShellToolAbstractTest.execCommands:410
» Ssh
  SshCliToolIntegrationTest>SshToolAbstractIntegrationTest.testCopyToServerFromInputStream:164->SshToolAbstractIntegrationTest.assertRemoteFileContents:105->ShellToolAbstractTest.execCommands:395->ShellToolAbstractTest.execCommands:399->ShellToolAbstractTest.execCommands:403->ShellToolAbstractTest.execCommands:410
» Ssh
  SshCliToolIntegrationTest>SshToolAbstractIntegrationTest.testCopyToServerWithPermissions:171->SshToolAbstractIntegrationTest.assertRemoteFilePermissions:114->ShellToolAbstractTest.execCommands:395->ShellToolAbstractTest.execCommands:399->ShellToolAbstractTest.execCommands:403->ShellToolAbstractTest.execCommands:410
» Ssh
  SshCliToolIntegrationTest>ShellToolAbstractTest.testExecBigCommand:272->ShellToolAbstractTest.execCommands:395->ShellToolAbstractTest.execCommands:399->ShellToolAbstractTest.execCommands:403->ShellToolAbstractTest.execCommands:410
» Ssh
  SshCliToolIntegrationTest>ShellToolAbstractTest.testExecBigConcurrentCommand:279->ShellToolAbstractTest.runExecBigConcurrentCommand:306
» Execution
  SshCliToolIntegrationTest>ShellToolAbstractTest.testExecCapturesStderr:330 » Ssh
  SshCliToolIntegrationTest>ShellToolAbstractTest.testExecChainOfCommands:245->ShellToolAbstractTest.execCommands:395->ShellToolAbstractTest.execCommands:399->ShellToolAbstractTest.execCommands:403->ShellToolAbstractTest.execCommands:410
» Ssh
  SshCliToolIntegrationTest>ShellToolAbstractTest.testExecCommandWithEnvVariables:264->ShellToolAbstractTest.execCommands:403->ShellToolAbstractTest.execCommands:410
» Ssh
  SshCliToolIntegrationTest>ShellToolAbstractTest.testExecConsecutiveCommands:105->ShellToolAbstractTest.execScript:415->ShellToolAbstractTest.execScript:419->ShellToolAbstractTest.execScript:434
» Ssh
  SshCliToolIntegrationTest.testExecReturningNonZeroExitCode:114 » Ssh exit code...
  SshCliToolIntegrationTest>ShellToolAbstractTest.testExecReturningZeroExitCode:258 »
Ssh
  SshCliToolIntegrationTest>ShellToolAbstractTest.testExecScriptAbortsOnCommandFailure:179
» Ssh
  SshCliToolIntegrationTest>ShellToolAbstractTest.testExecScriptBigChainOfCommand:169->ShellToolAbstractTest.execScript:423->ShellToolAbstractTest.execScript:427->ShellToolAbstractTest.execScript:434
» Ssh
  SshCliToolIntegrationTest>ShellToolAbstractTest.testExecScriptBigCommand:156->ShellToolAbstractTest.execScript:415->ShellToolAbstractTest.execScript:419->ShellToolAbstractTest.execScript:434
» Ssh
  SshCliToolIntegrationTest>ShellToolAbstractTest.testExecScriptCapturesStderr:319 » Ssh
  SshCliToolIntegrationTest>ShellToolAbstractTest.testExecScriptChainOfCommands:114->ShellToolAbstractTest.execScript:415->ShellToolAbstractTest.execScript:419->ShellToolAbstractTest.execScript:434
» Ssh
  SshCliToolIntegrationTest>ShellToolAbstractTest.testExecScriptCommandWithEnvVariables:133->ShellToolAbstractTest.execScript:427->ShellToolAbstractTest.execScript:434
» Ssh
  SshCliToolIntegrationTest>ShellToolAbstractTest.testExecScriptEchosDontExecuteWhenToldNoExtraOutput:388
» Ssh
  SshCliToolIntegrationTest>ShellToolAbstractTest.testExecScriptEchosExecute:375->ShellToolAbstractTest.execScript:415->ShellToolAbstractTest.execScript:419->ShellToolAbstractTest.execScript:434
» Ssh
  SshCliToolIntegrationTest>ShellToolAbstractTest.testExecScriptReturningNonZeroExitCode:121
» Ssh
  SshCliToolIntegrationTest>ShellToolAbstractTest.testExecScriptReturningZeroExitCode:127
» Ssh
  SshCliToolIntegrationTest>ShellToolAbstractTest.testExecScriptWithSleepThenBigCommand:189->ShellToolAbstractTest.execScript:415->ShellToolAbstractTest.execScript:419->ShellToolAbstractTest.execScript:434
» Ssh
  SshCliToolIntegrationTest>ShellToolAbstractTest.testExecScriptWithSleepThenExit:148->ShellToolAbstractTest.execScript:415->ShellToolAbstractTest.execScript:419->ShellToolAbstractTest.execScript:434
» Ssh
  SshCliToolIntegrationTest>SshToolAbstractIntegrationTest.testOutputAsExpected:281->ShellToolAbstractTest.execCommands:395->ShellToolAbstractTest.execCommands:399->ShellToolAbstractTest.execCommands:403->ShellToolAbstractTest.execCommands:410
» Ssh
  SshCliToolIntegrationTest>ShellToolAbstractTest.testRunAsRoot:368 » Ssh exit c...
  SshCliToolIntegrationTest>ShellToolAbstractTest.testScriptDataNotLost:140->ShellToolAbstractTest.execScript:415->ShellToolAbstractTest.execScript:419->ShellToolAbstractTest.execScript:434
» Ssh
  SshCliToolIntegrationTest>SshToolAbstractIntegrationTest.testScriptDirPropertiesIsRespected:298
» Ssh
  SshCliToolIntegrationTest>ShellToolAbstractTest.testScriptHeader:339->ShellToolAbstractTest.execScript:434
» Ssh
  SshCliToolIntegrationTest>ShellToolAbstractTest.testStdErr:353 » Ssh exit code...
  SshCliToolPerformanceTest>SshToolAbstractPerformanceTest.testConsecutiveBigStdinCommands:95->SshToolAbstractPerformanceTest.runExecManyCommands:103->SshToolAbstractPerformanceTest.runMany:113->SshToolAbstractPerformanceTest.access$100:48->SshToolAbstractPerformanceTest.execScript:129
» Ssh
  SshCliToolPerformanceTest>SshToolAbstractPerformanceTest.testConsecutiveBigStdoutCommands:89->SshToolAbstractPerformanceTest.runExecManyCommands:103->SshToolAbstractPerformanceTest.runMany:113->SshToolAbstractPerformanceTest.access$100:48->SshToolAbstractPerformanceTest.execScript:129
» Ssh
  SshCliToolPerformanceTest>SshToolAbstractPerformanceTest.testConsecutiveSmallCommands:79->SshToolAbstractPerformanceTest.runExecManyCommands:103->SshToolAbstractPerformanceTest.runMany:113->SshToolAbstractPerformanceTest.access$100:48->SshToolAbstractPerformanceTest.execScript:129
» Ssh
  SshCliToolPerformanceTest>SshToolAbstractPerformanceTest.testConsecutiveSmallCommandsWithStdouterr:84->SshToolAbstractPerformanceTest.runExecManyCommands:103->SshToolAbstractPerformanceTest.runMany:113->SshToolAbstractPerformanceTest.access$100:48->SshToolAbstractPerformanceTest.execScript:129
» Ssh
  ProcessToolIntegrationTest>ShellToolAbstractTest.testRunAsRoot:369 not running as root;
whoami is: Executed /tmp/brooklyn-20150821-195142820-G3Tq.sh, result 1
 (err is 'sudo: a password is required
') expected [true] but found [false]
  SshjToolAsyncStubIntegrationTest.testPolls:123->runTest:161 » Ssh (jenkins@loc...
  SshjToolAsyncStubIntegrationTest.testPollsAndReturnsNonZeroExitCode:134->runTest:161
» Ssh
  SshjToolAsyncStubIntegrationTest.testPollsRepeatedly:151->runTest:161 » Ssh (j...
org.apache.brooklyn.util.core.internal.ssh.sshj.SshjToolIntegrationTest.setUp(org.apache.brooklyn.util.core.internal.ssh.sshj.SshjToolIntegrationTest)
  Run 1: SshjToolIntegrationTest>SshToolAbstractIntegrationTest.setUp:99->ShellToolAbstractTest.setUp:85->ShellToolAbstractTest.connect:100
» Ssh
  Run 2: PASS
  Run 3: PASS
  Run 4: PASS
  Run 5: PASS
  Run 6: PASS
  Run 7: PASS
  Run 8: PASS
  Run 9: PASS
  Run 10: PASS
  Run 11: PASS
  Run 12: PASS
  Run 13: PASS
  Run 14: PASS
  Run 15: PASS
  Run 16: PASS
  Run 17: PASS
  Run 18: PASS
  Run 19: PASS
  Run 20: PASS
  Run 21: PASS
  Run 22: PASS
  Run 23: PASS
  Run 24: PASS
  Run 25: PASS
  Run 26: PASS
  Run 27: PASS
  Run 28: PASS
  Run 29: PASS
  Run 30: PASS
  Run 31: PASS
  Run 32: PASS
  Run 33: PASS
  Run 34: PASS
  Run 35: PASS
  Run 36: PASS
  Run 37: PASS
  Run 38: PASS
  Run 39: PASS
  Run 40: PASS
  Run 41: PASS
  Run 42: PASS
  Run 43: PASS

  SshjToolPerformanceTest>SshToolAbstractPerformanceTest.testConsecutiveBigStdinCommands:95->SshToolAbstractPerformanceTest.runExecManyCommands:103->SshToolAbstractPerformanceTest.runMany:113->SshToolAbstractPerformanceTest.access$100:48->SshToolAbstractPerformanceTest.execScript:128
» Ssh
  SshjToolPerformanceTest>SshToolAbstractPerformanceTest.testConsecutiveBigStdoutCommands:89->SshToolAbstractPerformanceTest.runExecManyCommands:103->SshToolAbstractPerformanceTest.runMany:113->SshToolAbstractPerformanceTest.access$100:48->SshToolAbstractPerformanceTest.execScript:128
» Ssh
  SshjToolPerformanceTest>SshToolAbstractPerformanceTest.testConsecutiveConnectAndDisconnect:74->SshToolAbstractPerformanceTest.runMany:113
» Ssh
  SshjToolPerformanceTest>SshToolAbstractPerformanceTest.testConsecutiveSmallCommands:79->SshToolAbstractPerformanceTest.runExecManyCommands:103->SshToolAbstractPerformanceTest.runMany:113->SshToolAbstractPerformanceTest.access$100:48->SshToolAbstractPerformanceTest.execScript:128
» Ssh
  SshjToolPerformanceTest>SshToolAbstractPerformanceTest.testConsecutiveSmallCommandsWithStdouterr:84->SshToolAbstractPerformanceTest.runExecManyCommands:103->SshToolAbstractPerformanceTest.runMany:113->SshToolAbstractPerformanceTest.access$100:48->SshToolAbstractPerformanceTest.execScript:128
» Ssh
  BashCommandsIntegrationTest.testAlternatives:190 » Execution java.lang.Illegal...
  BashCommandsIntegrationTest.testAlternativesWhereFirstSucceeds:176 » Execution
  BashCommandsIntegrationTest.testDownloadFirstSuccessfulFile:153 » IllegalState
  BashCommandsIntegrationTest.testDownloadToStdout:166 » Execution java.lang.Ill...
  BashCommandsIntegrationTest.testPipeMultiline:257 » PropagatedRuntime 
  BashCommandsIntegrationTest.testRequireFailureExitsImmediately:248 » Execution
  BashCommandsIntegrationTest.testRequireFileHandlesFailure:223 » Execution java...
  BashCommandsIntegrationTest.testRequireFileHandlesSuccess:236 » Execution java...
  BashCommandsIntegrationTest.testRequireTestHandlesFailure:201 » Execution java...
  BashCommandsIntegrationTest.testRequireTestHandlesSuccess:213 » Execution java...
  BashCommandsIntegrationTest.testSudo:130 » IllegalState Cannot establish ssh c...
  BashCommandsIntegrationTest.testWaitForFileContentsWhenAbortingOnFail:268 » IllegalState
  BashCommandsIntegrationTest.testWaitForFileContentsWhenContentsAppearAfterStart:302 » PropagatedRuntime
  BashCommandsIntegrationTest.testWaitForFileContentsWhenNotAbortingOnFail:281 » PropagatedRuntime
  SshTasksTest.testCopyTo:126 » FileNotFound File '/tmp/SshTasksTest-qJk6/f1' do...
  SshTasksTest.testCopyToFailBadSubdirCreate:178 » FileNotFound File '/tmp/SshTa...
  SshTasksTest.testSshEchoHello:116 » PropagatedRuntime 
  SshTasksTest.testSshFetch:193 » PropagatedRuntime 
  SshTasksTest.testSshIgnoringHeaderProperty:208 mismatched output was:  expected [true] but
found [false]
  SshTasksTest.testSshWithHeaderProperty:201 mismatched output was:  expected [true] but found
[false]

Tests run: 1315, Failures: 131, Errors: 0, Skipped: 46

[JENKINS] Recording test results
[INFO] ------------------------------------------------------------------------
[INFO] Reactor Summary:
[INFO] 
[INFO] Brooklyn Root ..................................... SUCCESS [5.101s]
[INFO] Brooklyn Parent Project ........................... SUCCESS [11.328s]
[INFO] Brooklyn Test Support Utilities ................... SUCCESS [10.585s]
[INFO] Brooklyn Logback Includable Configuration ......... SUCCESS [3.544s]
[INFO] Brooklyn Common Utilities ......................... FAILURE [46.910s]
[INFO] Brooklyn API ...................................... SUCCESS [5.999s]
[INFO] Brooklyn Test Support ............................. SUCCESS [8.515s]
[INFO] Brooklyn Groovy Utilities ......................... SUCCESS [11.314s]
[INFO] Brooklyn Core ..................................... FAILURE [2:12:05.042s]
[INFO] ------------------------------------------------------------------------
[INFO] BUILD FAILURE
[INFO] ------------------------------------------------------------------------
[INFO] Total time: 2:14:37.369s
[INFO] Finished at: Fri Aug 21 21:00:46 UTC 2015
[INFO] Final Memory: 40M/240M
[INFO] ------------------------------------------------------------------------
Waiting for Jenkins to finish collecting data
[ERROR] Failed to execute goal org.apache.maven.plugins:maven-surefire-plugin:2.18.1:test
(default-test) on project brooklyn-utils-common: There are test failures.
[ERROR] 
[ERROR] Please refer to <https://builds.apache.org/job/incubator-brooklyn-master-integration/ws/utils/common/target/surefire-reports>
for the individual test results.
[ERROR] -> [Help 1]
[ERROR] Failed to execute goal org.apache.maven.plugins:maven-surefire-plugin:2.18.1:test
(default-test) on project brooklyn-core: There are test failures.
[ERROR] 
[ERROR] Please refer to <https://builds.apache.org/job/incubator-brooklyn-master-integration/ws/core/target/surefire-reports>
for the individual test results.
[ERROR] -> [Help 1]
[ERROR] 
[ERROR] To see the full stack trace of the errors, re-run Maven with the -e switch.
[ERROR] Re-run Maven using the -X switch to enable full debug logging.
[ERROR] 
[ERROR] For more information about the errors and possible solutions, please read the following
articles:
[ERROR] [Help 1] http://cwiki.apache.org/confluence/display/MAVEN/MojoFailureException
[ERROR] 
[ERROR] After correcting the problems, you can resume the build with the command
[ERROR]   mvn <goals> -rf :brooklyn-utils-common
[JENKINS] Archiving <https://builds.apache.org/job/incubator-brooklyn-master-integration/ws/core/pom.xml>
to org.apache.brooklyn/brooklyn-core/0.8.0-SNAPSHOT/brooklyn-core-0.8.0-SNAPSHOT.pom
Sending artifact delta relative to incubator-brooklyn-master-integration » Brooklyn Core
#2
Archived 1 artifacts
Archive block size is 32768
Received 0 blocks and 9435 bytes
Compression is 0.0%
Took 0.15 sec
[JENKINS] Archiving <https://builds.apache.org/job/incubator-brooklyn-master-integration/ws/utils/groovy/pom.xml>
to org.apache.brooklyn/brooklyn-utils-groovy/0.8.0-SNAPSHOT/brooklyn-utils-groovy-0.8.0-SNAPSHOT.pom
[JENKINS] Archiving <https://builds.apache.org/job/incubator-brooklyn-master-integration/ws/utils/groovy/target/brooklyn-utils-groovy-0.8.0-SNAPSHOT.jar>
to org.apache.brooklyn/brooklyn-utils-groovy/0.8.0-SNAPSHOT/brooklyn-utils-groovy-0.8.0-SNAPSHOT.jar
[JENKINS] Archiving <https://builds.apache.org/job/incubator-brooklyn-master-integration/ws/utils/groovy/target/brooklyn-utils-groovy-0.8.0-SNAPSHOT-sources.jar>
to org.apache.brooklyn/brooklyn-utils-groovy/0.8.0-SNAPSHOT/brooklyn-utils-groovy-0.8.0-SNAPSHOT-sources.jar
Sending artifact delta relative to incubator-brooklyn-master-integration » Brooklyn Groovy
Utilities #168
Archived 3 artifacts
Archive block size is 32768
Received 0 blocks and 89723 bytes
Compression is 0.0%
Took 0.35 sec
[JENKINS] Archiving <https://builds.apache.org/job/incubator-brooklyn-master-integration/ws/utils/common/pom.xml>
to org.apache.brooklyn/brooklyn-utils-common/0.8.0-SNAPSHOT/brooklyn-utils-common-0.8.0-SNAPSHOT.pom
No prior successful build to compare, so performing full copy of artifacts
[JENKINS] Archiving <https://builds.apache.org/job/incubator-brooklyn-master-integration/ws/usage/test-support/pom.xml>
to org.apache.brooklyn/brooklyn-test-support/0.8.0-SNAPSHOT/brooklyn-test-support-0.8.0-SNAPSHOT.pom
[JENKINS] Archiving <https://builds.apache.org/job/incubator-brooklyn-master-integration/ws/usage/test-support/target/brooklyn-test-support-0.8.0-SNAPSHOT.jar>
to org.apache.brooklyn/brooklyn-test-support/0.8.0-SNAPSHOT/brooklyn-test-support-0.8.0-SNAPSHOT.jar
[JENKINS] Archiving <https://builds.apache.org/job/incubator-brooklyn-master-integration/ws/usage/test-support/target/brooklyn-test-support-0.8.0-SNAPSHOT-sources.jar>
to org.apache.brooklyn/brooklyn-test-support/0.8.0-SNAPSHOT/brooklyn-test-support-0.8.0-SNAPSHOT-sources.jar
Sending artifact delta relative to incubator-brooklyn-master-integration » Brooklyn Test
Support #168
Archived 3 artifacts
Archive block size is 32768
Received 0 blocks and 109404 bytes
Compression is 0.0%
Took 0.23 sec
[JENKINS] Archiving <https://builds.apache.org/job/incubator-brooklyn-master-integration/ws/parent/pom.xml>
to org.apache.brooklyn/brooklyn-parent/0.8.0-SNAPSHOT/brooklyn-parent-0.8.0-SNAPSHOT.pom
Sending artifact delta relative to incubator-brooklyn-master-integration » Brooklyn Parent
Project #168
Archived 1 artifacts
Archive block size is 32768
Received 1 blocks and 57548 bytes
Compression is 36.3%
Took 0.15 sec
[JENKINS] Archiving <https://builds.apache.org/job/incubator-brooklyn-master-integration/ws/usage/logback-includes/pom.xml>
to org.apache.brooklyn/brooklyn-logback-includes/0.8.0-SNAPSHOT/brooklyn-logback-includes-0.8.0-SNAPSHOT.pom
[JENKINS] Archiving <https://builds.apache.org/job/incubator-brooklyn-master-integration/ws/usage/logback-includes/target/brooklyn-logback-includes-0.8.0-SNAPSHOT.jar>
to org.apache.brooklyn/brooklyn-logback-includes/0.8.0-SNAPSHOT/brooklyn-logback-includes-0.8.0-SNAPSHOT.jar
[JENKINS] Archiving <https://builds.apache.org/job/incubator-brooklyn-master-integration/ws/usage/logback-includes/target/brooklyn-logback-includes-0.8.0-SNAPSHOT-sources.jar>
to org.apache.brooklyn/brooklyn-logback-includes/0.8.0-SNAPSHOT/brooklyn-logback-includes-0.8.0-SNAPSHOT-sources.jar
Sending artifact delta relative to incubator-brooklyn-master-integration » Brooklyn Logback
Includable Configuration #168
Archived 3 artifacts
Archive block size is 32768
Received 0 blocks and 42453 bytes
Compression is 0.0%
Took 0.15 sec
[JENKINS] Archiving <https://builds.apache.org/job/incubator-brooklyn-master-integration/ws/pom.xml>
to org.apache.brooklyn/brooklyn/0.8.0-SNAPSHOT/brooklyn-0.8.0-SNAPSHOT.pom
Sending artifact delta relative to incubator-brooklyn-master-integration » Brooklyn Root
#168
Archived 1 artifacts
Archive block size is 32768
Received 0 blocks and 5371 bytes
Compression is 0.0%
Took 0.15 sec
[JENKINS] Archiving <https://builds.apache.org/job/incubator-brooklyn-master-integration/ws/utils/test-support/pom.xml>
to org.apache.brooklyn/brooklyn-utils-test-support/0.8.0-SNAPSHOT/brooklyn-utils-test-support-0.8.0-SNAPSHOT.pom
[JENKINS] Archiving <https://builds.apache.org/job/incubator-brooklyn-master-integration/ws/utils/test-support/target/brooklyn-utils-test-support-0.8.0-SNAPSHOT.jar>
to org.apache.brooklyn/brooklyn-utils-test-support/0.8.0-SNAPSHOT/brooklyn-utils-test-support-0.8.0-SNAPSHOT.jar
[JENKINS] Archiving <https://builds.apache.org/job/incubator-brooklyn-master-integration/ws/utils/test-support/target/brooklyn-utils-test-support-0.8.0-SNAPSHOT-sources.jar>
to org.apache.brooklyn/brooklyn-utils-test-support/0.8.0-SNAPSHOT/brooklyn-utils-test-support-0.8.0-SNAPSHOT-sources.jar
Sending artifact delta relative to incubator-brooklyn-master-integration » Brooklyn Test
Support Utilities #168
Archived 3 artifacts
Archive block size is 32768
Received 0 blocks and 46372 bytes
Compression is 0.0%
Took 0.15 sec
[JENKINS] Archiving <https://builds.apache.org/job/incubator-brooklyn-master-integration/ws/api/pom.xml>
to org.apache.brooklyn/brooklyn-api/0.8.0-SNAPSHOT/brooklyn-api-0.8.0-SNAPSHOT.pom
[JENKINS] Archiving <https://builds.apache.org/job/incubator-brooklyn-master-integration/ws/api/target/brooklyn-api-0.8.0-SNAPSHOT.jar>
to org.apache.brooklyn/brooklyn-api/0.8.0-SNAPSHOT/brooklyn-api-0.8.0-SNAPSHOT.jar
[JENKINS] Archiving <https://builds.apache.org/job/incubator-brooklyn-master-integration/ws/api/target/brooklyn-api-0.8.0-SNAPSHOT-sources.jar>
to org.apache.brooklyn/brooklyn-api/0.8.0-SNAPSHOT/brooklyn-api-0.8.0-SNAPSHOT-sources.jar
Sending artifact delta relative to incubator-brooklyn-master-integration » Brooklyn API #168
Archived 3 artifacts
Archive block size is 32768
Received 0 blocks and 262099 bytes
Compression is 0.0%
Took 0.24 sec
channel stopped
Looks like the node went offline during the build. Check the slave log for the details.

Mime
View raw message