brooklyn-dev mailing list archives

Site index · List index
Message view « Date » · « Thread »
Top « Date » · « Thread »
From Apache Jenkins Server <jenk...@builds.apache.org>
Subject Build failed in Jenkins: incubator-brooklyn-master-integration #124
Date Thu, 18 Jun 2015 19:53:11 GMT
See <https://builds.apache.org/job/incubator-brooklyn-master-integration/124/>

------------------------------------------
[...truncated 29966 lines...]
	at org.apache.maven.surefire.testng.TestNGDirectoryTestSuite.execute(TestNGDirectoryTestSuite.java:108)
	at org.apache.maven.surefire.testng.TestNGProvider.invoke(TestNGProvider.java:111)
	at org.apache.maven.surefire.booter.ForkedBooter.invokeProviderInSameClassLoader(ForkedBooter.java:203)
	at org.apache.maven.surefire.booter.ForkedBooter.runSuitesInProcess(ForkedBooter.java:155)
	at org.apache.maven.surefire.booter.ForkedBooter.main(ForkedBooter.java:103)
Caused by: java.io.FileNotFoundException: /home/jenkins/.ssh/id_rsa_with_passphrase (No such
file or directory)
	at java.io.FileInputStream.open(Native Method)
	at java.io.FileInputStream.<init>(FileInputStream.java:138)
	at net.schmizz.sshj.userauth.password.PrivateKeyFileResource.getReader(PrivateKeyFileResource.java:34)
	at net.schmizz.sshj.userauth.keyprovider.PKCS8KeyFile.readKeyPair(PKCS8KeyFile.java:128)
	at net.schmizz.sshj.userauth.keyprovider.PKCS8KeyFile.getPublic(PKCS8KeyFile.java:72)
	at net.schmizz.sshj.userauth.keyprovider.OpenSSHKeyFile.getPublic(OpenSSHKeyFile.java:60)
	at net.schmizz.sshj.userauth.method.KeyedAuthMethod.putPubKey(KeyedAuthMethod.java:44)
	at net.schmizz.sshj.userauth.method.AuthPublickey.buildReq(AuthPublickey.java:62)
	at net.schmizz.sshj.userauth.method.AuthPublickey.buildReq(AuthPublickey.java:81)
	at net.schmizz.sshj.userauth.method.AbstractAuthMethod.request(AbstractAuthMethod.java:63)
	at net.schmizz.sshj.userauth.UserAuthImpl.authenticate(UserAuthImpl.java:92)
	at net.schmizz.sshj.SSHClient.auth(SSHClient.java:205)
	at net.schmizz.sshj.SSHClient.authPublickey(SSHClient.java:305)
	at net.schmizz.sshj.SSHClient.authPublickey(SSHClient.java:324)
	at brooklyn.util.internal.ssh.sshj.SshjClientConnection.create(SshjClientConnection.java:206)
	at brooklyn.util.internal.ssh.sshj.SshjClientConnection.create(SshjClientConnection.java:42)
	at brooklyn.util.internal.ssh.sshj.SshjTool.acquire(SshjTool.java:631)
	at brooklyn.util.internal.ssh.sshj.SshjTool.acquire(SshjTool.java:617)
	at brooklyn.util.internal.ssh.sshj.SshjTool.connect(SshjTool.java:206)
	at brooklyn.util.internal.ssh.SshToolAbstractIntegrationTest.testSshKeyWithPassphrase(SshToolAbstractIntegrationTest.java:245)
	at sun.reflect.NativeMethodAccessorImpl.invoke0(Native Method)
	at sun.reflect.NativeMethodAccessorImpl.invoke(NativeMethodAccessorImpl.java:57)
	at sun.reflect.DelegatingMethodAccessorImpl.invoke(DelegatingMethodAccessorImpl.java:43)
	at java.lang.reflect.Method.invoke(Method.java:606)
	at org.testng.internal.MethodInvocationHelper.invokeMethod(MethodInvocationHelper.java:84)
	at org.testng.internal.Invoker.invokeMethod(Invoker.java:714)
	at org.testng.internal.Invoker.invokeTestMethod(Invoker.java:901)
	at org.testng.internal.Invoker.invokeTestMethods(Invoker.java:1231)
	at org.testng.internal.TestMethodWorker.invokeTestMethods(TestMethodWorker.java:127)
	at org.testng.internal.TestMethodWorker.run(TestMethodWorker.java:111)
	at org.testng.TestRunner.privateRun(TestRunner.java:767)
	at org.testng.TestRunner.run(TestRunner.java:617)
	at org.testng.SuiteRunner.runTest(SuiteRunner.java:348)
	at org.testng.SuiteRunner.runSequentially(SuiteRunner.java:343)
	at org.testng.SuiteRunner.privateRun(SuiteRunner.java:305)
	at org.testng.SuiteRunner.run(SuiteRunner.java:254)
	at org.testng.SuiteRunnerWorker.runSuite(SuiteRunnerWorker.java:52)
	at org.testng.SuiteRunnerWorker.run(SuiteRunnerWorker.java:86)
	at org.testng.TestNG.runSuitesSequentially(TestNG.java:1224)
	at org.testng.TestNG.runSuitesLocally(TestNG.java:1149)
	at org.testng.TestNG.run(TestNG.java:1057)
	at org.apache.maven.surefire.testng.TestNGExecutor.run(TestNGExecutor.java:115)
	at org.apache.maven.surefire.testng.TestNGDirectoryTestSuite.executeMulti(TestNGDirectoryTestSuite.java:205)
	at org.apache.maven.surefire.testng.TestNGDirectoryTestSuite.execute(TestNGDirectoryTestSuite.java:108)
	at org.apache.maven.surefire.testng.TestNGProvider.invoke(TestNGProvider.java:111)
	at org.apache.maven.surefire.booter.ForkedBooter.invokeProviderInSameClassLoader(ForkedBooter.java:203)
	at org.apache.maven.surefire.booter.ForkedBooter.runSuitesInProcess(ForkedBooter.java:155)
	at org.apache.maven.surefire.booter.ForkedBooter.main(ForkedBooter.java:103)

testCatalogLookup(brooklyn.catalog.internal.CatalogDtoTest)  Time elapsed: 0.288 sec  <<<
FAILURE!
java.lang.AssertionError: expected object to not be null
	at org.testng.Assert.fail(Assert.java:94)
	at org.testng.Assert.assertNotNull(Assert.java:404)
	at org.testng.Assert.assertNotNull(Assert.java:389)
	at brooklyn.catalog.internal.CatalogDtoTest.checkCatalogHealthy(CatalogDtoTest.java:83)
	at brooklyn.catalog.internal.CatalogDtoTest.testCatalogLookup(CatalogDtoTest.java:62)

testMaxmindLookup(brooklyn.location.geo.HostGeoLookupIntegrationTest)  Time elapsed: 0.004
sec  <<< FAILURE!
java.lang.AssertionError: host lookup unavailable - is the maxmind database installed? expected
object to not be null
	at org.testng.Assert.fail(Assert.java:94)
	at org.testng.Assert.assertNotNull(Assert.java:404)
	at brooklyn.location.geo.HostGeoLookupIntegrationTest.testMaxmindLookup(HostGeoLookupIntegrationTest.java:71)

testExtractingConnectablePassphraselessKey(brooklyn.location.basic.SshMachineLocationIntegrationTest)
 Time elapsed: 0.004 sec  <<< FAILURE!
java.lang.NullPointerException: This test requires a localhost named location called 'localhost-passphrase'
(which should have a passphrase set)
	at com.google.common.base.Preconditions.checkNotNull(Preconditions.java:229)
	at brooklyn.location.basic.SshMachineLocationIntegrationTest.testExtractingConnectablePassphraselessKey(SshMachineLocationIntegrationTest.java:70)


Results :

Failed tests: 
  CatalogDtoTest.testCatalogLookup:62->checkCatalogHealthy:83 expected object to not be
null
  CatalogDtoTest.testCatalogSerializeAndLookup:74->checkCatalogHealthy:79 » ClassCast
  SshMachineLocationIntegrationTest.testExtractingConnectablePassphraselessKey:70 » NullPointer
  SshMachineLocationTest.testIsSshableWhenFalse:282 » Timeout Still running: r=b...
  HostGeoLookupIntegrationTest.testMaxmindLookup:71 host lookup unavailable - is the maxmind
database installed? expected object to not be null
  SshCliToolIntegrationTest>ShellToolAbstractTest.testRunAsRoot:368 not running as root;
whoami is: Executed /tmp/brooklyn-20150618-191938422-Vkyn.sh, result 1
 (err is 'sudo: a password is required
') expected [true] but found [false]
  ProcessToolIntegrationTest>ShellToolAbstractTest.testRunAsRoot:368 not running as root;
whoami is: Executed /tmp/brooklyn-20150618-191939327-OEXy.sh, result 1
 (err is 'sudo: a password is required
') expected [true] but found [false]
  SshjToolIntegrationTest.testAsyncExecStdoutAndStderr:196 expected [mystringToStderr
mystringPostSleepToStderr] but found [mystringToStderr
/home/jenkins/.bash_logout: line 7: 22993 Terminated              tail -c +1 -f /tmp/brooklyn-20150618-194023015-cIM8.stdout
/home/jenkins/.bash_logout: line 7: 22994 Terminated              tail -c +1 -f /tmp/brooklyn-20150618-194023015-cIM8.stderr
1>&2
tail: /tmp/brooklyn-20150618-194023015-cIM8.stderr: file truncated
/home/jenkins/.bash_logout: line 7: 23012 Terminated              tail -c +18 -f /tmp/brooklyn-20150618-194023015-cIM8.stdout
/home/jenkins/.bash_logout: line 7: 23013 Terminated              tail -c +273 -f /tmp/brooklyn-20150618-194023015-cIM8.stderr
1>&2
tail: /tmp/brooklyn-20150618-194023015-cIM8.stderr: file truncated
mystringPostSleepToStderr
/home/jenkins/.bash_logout: line 7: 23031 Terminated              tail -c +18 -f /tmp/brooklyn-20150618-194023015-cIM8.stdout
/home/jenkins/.bash_logout: line 7: 23032 Terminated              tail -c +598 -f /tmp/brooklyn-20150618-194023015-cIM8.stderr
1>&2
Usage:
 kill [options] <pid> [...]
Options:
 <pid> [...]            send signal to every <pid> listed
 -<signal>, -s, --signal <signal>
                        specify the <signal> to be sent
 -l, --list=[<signal>]  list all signal names, or convert one to a name
 -L, --table            list all signal names in a nice table
 -h, --help     display this help and exit
 -V, --version  output version information and exit
For more details see kill(1).
Usage:
 kill [options] <pid> [...]
Options:
 <pid> [...]            send signal to every <pid> listed
 -<signal>, -s, --signal <signal>
                        specify the <signal> to be sent
 -l, --list=[<signal>]  list all signal names, or convert one to a name
 -L, --table            list all signal names in a nice table
 -h, --help     display this help and exit
 -V, --version  output version information and exit
For more details see kill(1).]
  SshjToolIntegrationTest>ShellToolAbstractTest.testRunAsRoot:368 not running as root;
whoami is: Executed /tmp/brooklyn-20150618-193943051-eVm3.sh, result 1
 (err is 'sudo: a password is required
') expected [true] but found [false]
  SshjToolIntegrationTest>SshToolAbstractIntegrationTest.testSshKeyWithPassphrase:245 »
Ssh
  BashCommandsIntegrationTest.testSudo:134 out=; err=sudo: a password is required
 expected [0] but found [1]

Tests run: 1319, Failures: 11, Errors: 0, Skipped: 3

[JENKINS] Recording test results
[INFO] ------------------------------------------------------------------------
[INFO] Reactor Summary:
[INFO] 
[INFO] Brooklyn Parent Project ........................... SUCCESS [15.857s]
[INFO] Brooklyn Utilities to Support Testing (listeners etc)  SUCCESS [11.145s]
[INFO] Brooklyn Logback Includable Configuration ......... SUCCESS [3.633s]
[INFO] Brooklyn Common Utilities ......................... FAILURE [49.053s]
[INFO] Brooklyn Groovy Utilities ......................... SUCCESS [11.392s]
[INFO] Brooklyn API ...................................... SUCCESS [5.242s]
[INFO] Brooklyn Test Support ............................. SUCCESS [8.391s]
[INFO] CAMP Server Parent Project ........................ SUCCESS [1.080s]
[INFO] CAMP Base ......................................... SUCCESS [7.001s]
[INFO] Brooklyn Core ..................................... FAILURE [46:39.536s]
[INFO] ------------------------------------------------------------------------
[INFO] BUILD FAILURE
[INFO] ------------------------------------------------------------------------
[INFO] Total time: 49:05.461s
[INFO] Finished at: Thu Jun 18 19:52:43 UTC 2015
[INFO] Final Memory: 38M/242M
[INFO] ------------------------------------------------------------------------
Waiting for Jenkins to finish collecting data
[ERROR] Failed to execute goal org.apache.maven.plugins:maven-surefire-plugin:2.18.1:test
(default-test) on project brooklyn-utils-common: There are test failures.
[ERROR] 
[ERROR] Please refer to <https://builds.apache.org/job/incubator-brooklyn-master-integration/ws/utils/common/target/surefire-reports>
for the individual test results.
[ERROR] -> [Help 1]
[ERROR] Failed to execute goal org.apache.maven.plugins:maven-surefire-plugin:2.18.1:test
(default-test) on project brooklyn-core: There are test failures.
[ERROR] 
[ERROR] Please refer to <https://builds.apache.org/job/incubator-brooklyn-master-integration/ws/core/target/surefire-reports>
for the individual test results.
[ERROR] -> [Help 1]
[ERROR] 
[ERROR] To see the full stack trace of the errors, re-run Maven with the -e switch.
[ERROR] Re-run Maven using the -X switch to enable full debug logging.
[ERROR] 
[ERROR] For more information about the errors and possible solutions, please read the following
articles:
[ERROR] [Help 1] http://cwiki.apache.org/confluence/display/MAVEN/MojoFailureException
[ERROR] 
[ERROR] After correcting the problems, you can resume the build with the command
[ERROR]   mvn <goals> -rf :brooklyn-utils-common
[JENKINS] Archiving <https://builds.apache.org/job/incubator-brooklyn-master-integration/ws/core/pom.xml>
to org.apache.brooklyn/brooklyn-core/0.7.0-SNAPSHOT/brooklyn-core-0.7.0-SNAPSHOT.pom
Sending artifact delta relative to incubator-brooklyn-master-integration » Brooklyn Core
#2
Archived 1 artifacts
Archive block size is 32768
Received 0 blocks and 9754 bytes
Compression is 0.0%
Took 0.32 sec
[JENKINS] Archiving <https://builds.apache.org/job/incubator-brooklyn-master-integration/ws/utils/groovy/pom.xml>
to org.apache.brooklyn/brooklyn-utils-groovy/0.7.0-SNAPSHOT/brooklyn-utils-groovy-0.7.0-SNAPSHOT.pom
[JENKINS] Archiving <https://builds.apache.org/job/incubator-brooklyn-master-integration/ws/utils/groovy/target/brooklyn-utils-groovy-0.7.0-SNAPSHOT.jar>
to org.apache.brooklyn/brooklyn-utils-groovy/0.7.0-SNAPSHOT/brooklyn-utils-groovy-0.7.0-SNAPSHOT.jar
[JENKINS] Archiving <https://builds.apache.org/job/incubator-brooklyn-master-integration/ws/utils/groovy/target/brooklyn-utils-groovy-0.7.0-SNAPSHOT-sources.jar>
to org.apache.brooklyn/brooklyn-utils-groovy/0.7.0-SNAPSHOT/brooklyn-utils-groovy-0.7.0-SNAPSHOT-sources.jar
Sending artifact delta relative to incubator-brooklyn-master-integration » Brooklyn Groovy
Utilities #123
Archived 3 artifacts
Archive block size is 32768
Received 0 blocks and 88357 bytes
Compression is 0.0%
Took 0.36 sec
[JENKINS] Archiving <https://builds.apache.org/job/incubator-brooklyn-master-integration/ws/utils/common/pom.xml>
to org.apache.brooklyn/brooklyn-utils-common/0.7.0-SNAPSHOT/brooklyn-utils-common-0.7.0-SNAPSHOT.pom
No prior successful build to compare, so performing full copy of artifacts
[JENKINS] Archiving <https://builds.apache.org/job/incubator-brooklyn-master-integration/ws/usage/test-support/pom.xml>
to org.apache.brooklyn/brooklyn-test-support/0.7.0-SNAPSHOT/brooklyn-test-support-0.7.0-SNAPSHOT.pom
[JENKINS] Archiving <https://builds.apache.org/job/incubator-brooklyn-master-integration/ws/usage/test-support/target/brooklyn-test-support-0.7.0-SNAPSHOT.jar>
to org.apache.brooklyn/brooklyn-test-support/0.7.0-SNAPSHOT/brooklyn-test-support-0.7.0-SNAPSHOT.jar
[JENKINS] Archiving <https://builds.apache.org/job/incubator-brooklyn-master-integration/ws/usage/test-support/target/brooklyn-test-support-0.7.0-SNAPSHOT-sources.jar>
to org.apache.brooklyn/brooklyn-test-support/0.7.0-SNAPSHOT/brooklyn-test-support-0.7.0-SNAPSHOT-sources.jar
Sending artifact delta relative to incubator-brooklyn-master-integration » Brooklyn Test
Support #123
Archived 3 artifacts
Archive block size is 32768
Received 0 blocks and 111204 bytes
Compression is 0.0%
Took 0.27 sec
[JENKINS] Archiving <https://builds.apache.org/job/incubator-brooklyn-master-integration/ws/camp/camp-base/pom.xml>
to org.apache.brooklyn.camp/camp-base/0.7.0-SNAPSHOT/camp-base-0.7.0-SNAPSHOT.pom
[JENKINS] Archiving <https://builds.apache.org/job/incubator-brooklyn-master-integration/ws/camp/camp-base/target/camp-base-0.7.0-SNAPSHOT.jar>
to org.apache.brooklyn.camp/camp-base/0.7.0-SNAPSHOT/camp-base-0.7.0-SNAPSHOT.jar
[JENKINS] Archiving <https://builds.apache.org/job/incubator-brooklyn-master-integration/ws/camp/camp-base/target/camp-base-0.7.0-SNAPSHOT-sources.jar>
to org.apache.brooklyn.camp/camp-base/0.7.0-SNAPSHOT/camp-base-0.7.0-SNAPSHOT-sources.jar
Sending artifact delta relative to incubator-brooklyn-master-integration » CAMP Base #123
Archived 3 artifacts
Archive block size is 32768
Received 0 blocks and 131123 bytes
Compression is 0.0%
Took 0.35 sec
[JENKINS] Archiving <https://builds.apache.org/job/incubator-brooklyn-master-integration/ws/pom.xml>
to org.apache.brooklyn/brooklyn-parent/0.7.0-SNAPSHOT/brooklyn-parent-0.7.0-SNAPSHOT.pom
Sending artifact delta relative to incubator-brooklyn-master-integration » Brooklyn Parent
Project #123
Archived 1 artifacts
Archive block size is 32768
Received 2 blocks and 27613 bytes
Compression is 70.4%
Took 0.18 sec
[JENKINS] Archiving <https://builds.apache.org/job/incubator-brooklyn-master-integration/ws/usage/logback-includes/pom.xml>
to org.apache.brooklyn/brooklyn-logback-includes/0.7.0-SNAPSHOT/brooklyn-logback-includes-0.7.0-SNAPSHOT.pom
[JENKINS] Archiving <https://builds.apache.org/job/incubator-brooklyn-master-integration/ws/usage/logback-includes/target/brooklyn-logback-includes-0.7.0-SNAPSHOT.jar>
to org.apache.brooklyn/brooklyn-logback-includes/0.7.0-SNAPSHOT/brooklyn-logback-includes-0.7.0-SNAPSHOT.jar
[JENKINS] Archiving <https://builds.apache.org/job/incubator-brooklyn-master-integration/ws/usage/logback-includes/target/brooklyn-logback-includes-0.7.0-SNAPSHOT-sources.jar>
to org.apache.brooklyn/brooklyn-logback-includes/0.7.0-SNAPSHOT/brooklyn-logback-includes-0.7.0-SNAPSHOT-sources.jar
Sending artifact delta relative to incubator-brooklyn-master-integration » Brooklyn Logback
Includable Configuration #123
Archived 3 artifacts
Archive block size is 32768
Received 0 blocks and 41375 bytes
Compression is 0.0%
Took 0.25 sec
[JENKINS] Archiving <https://builds.apache.org/job/incubator-brooklyn-master-integration/ws/utils/test-support/pom.xml>
to org.apache.brooklyn/brooklyn-utils-test-support/0.7.0-SNAPSHOT/brooklyn-utils-test-support-0.7.0-SNAPSHOT.pom
[JENKINS] Archiving <https://builds.apache.org/job/incubator-brooklyn-master-integration/ws/utils/test-support/target/brooklyn-utils-test-support-0.7.0-SNAPSHOT.jar>
to org.apache.brooklyn/brooklyn-utils-test-support/0.7.0-SNAPSHOT/brooklyn-utils-test-support-0.7.0-SNAPSHOT.jar
[JENKINS] Archiving <https://builds.apache.org/job/incubator-brooklyn-master-integration/ws/utils/test-support/target/brooklyn-utils-test-support-0.7.0-SNAPSHOT-sources.jar>
to org.apache.brooklyn/brooklyn-utils-test-support/0.7.0-SNAPSHOT/brooklyn-utils-test-support-0.7.0-SNAPSHOT-sources.jar
Sending artifact delta relative to incubator-brooklyn-master-integration » Brooklyn Utilities
to Support Testing (listeners etc) #123
Archived 3 artifacts
Archive block size is 32768
Received 0 blocks and 44893 bytes
Compression is 0.0%
Took 0.24 sec
[JENKINS] Archiving <https://builds.apache.org/job/incubator-brooklyn-master-integration/ws/camp/pom.xml>
to org.apache.brooklyn.camp/camp-parent/0.7.0-SNAPSHOT/camp-parent-0.7.0-SNAPSHOT.pom
Sending artifact delta relative to incubator-brooklyn-master-integration » CAMP Server Parent
Project #123
Archived 1 artifacts
Archive block size is 32768
Received 0 blocks and 1821 bytes
Compression is 0.0%
Took 0.2 sec
[JENKINS] Archiving <https://builds.apache.org/job/incubator-brooklyn-master-integration/ws/api/pom.xml>
to org.apache.brooklyn/brooklyn-api/0.7.0-SNAPSHOT/brooklyn-api-0.7.0-SNAPSHOT.pom
[JENKINS] Archiving <https://builds.apache.org/job/incubator-brooklyn-master-integration/ws/api/target/brooklyn-api-0.7.0-SNAPSHOT.jar>
to org.apache.brooklyn/brooklyn-api/0.7.0-SNAPSHOT/brooklyn-api-0.7.0-SNAPSHOT.jar
[JENKINS] Archiving <https://builds.apache.org/job/incubator-brooklyn-master-integration/ws/api/target/brooklyn-api-0.7.0-SNAPSHOT-sources.jar>
to org.apache.brooklyn/brooklyn-api/0.7.0-SNAPSHOT/brooklyn-api-0.7.0-SNAPSHOT-sources.jar
Sending artifact delta relative to incubator-brooklyn-master-integration » Brooklyn API #123
Archived 3 artifacts
Archive block size is 32768
Received 0 blocks and 250611 bytes
Compression is 0.0%
Took 0.71 sec
channel stopped
Looks like the node went offline during the build. Check the slave log for the details.

Mime
View raw message