brooklyn-dev mailing list archives

Site index · List index
Message view « Date » · « Thread »
Top « Date » · « Thread »
From Apache Jenkins Server <jenk...@builds.apache.org>
Subject Build failed in Jenkins: incubator-brooklyn-master-windows #152
Date Tue, 20 Jan 2015 16:42:34 GMT
See <https://builds.apache.org/job/incubator-brooklyn-master-windows/152/changes>

Changes:

[alex.heneveld] refactor CSS and apply to javadoc

[alex.heneveld] blueprint tour tidy

[alex.heneveld] fix for auto-scroll-detecting side menu to take a link if it is clicked

[alex.heneveld] feature list in the docs

[alex.heneveld] docs - getting started - more on policies

[alex.heneveld] add java_link.html for javadoc+src, tidy up and expand locations docs

[alex.heneveld] fixes requested on #456

[alex.heneveld] lots more tidy-up of docs, esp in ops

[alex.heneveld] configure htmlproof (now as ruby script) to give useful info, and fix broken
links

[alex.heneveld] fix margin for headers on community page, and feature list now styled the
same

[alex.heneveld] tidies to download instructions

------------------------------------------
[...truncated 18784 lines...]
	at org.codehaus.groovy.reflection.CachedMethod.invoke(CachedMethod.java:90)
	at groovy.lang.MetaMethod.doMethodInvoke(MetaMethod.java:233)
	at groovy.lang.MetaClassImpl.invokeMethod(MetaClassImpl.java:1085)
	at groovy.lang.MetaClassImpl.invokeMethod(MetaClassImpl.java:909)
	at groovy.lang.DelegatingMetaClass.invokeMethod(DelegatingMetaClass.java:149)
	at groovy.lang.MetaObjectProtocol$invokeMethod.call(Unknown Source)
	at org.codehaus.groovy.runtime.callsite.CallSiteArray.defaultCall(CallSiteArray.java:45)
	at groovy.lang.MetaObjectProtocol$invokeMethod.call(Unknown Source)
	at brooklyn.util.GroovyJavaMethods.invokeMethodOnMetaClass(GroovyJavaMethods.groovy:144)
	at brooklyn.management.internal.AbstractManagementContext.invokeEffectorMethodLocal(AbstractManagementContext.java:273)
	at brooklyn.management.internal.AbstractManagementContext.invokeEffectorMethodSync(AbstractManagementContext.java:297)
	at brooklyn.management.internal.EffectorUtils.invokeMethodEffector(EffectorUtils.java:250)
	at brooklyn.entity.basic.MethodEffector.call(MethodEffector.java:149)
	at brooklyn.entity.trait.Startable$StopEffectorBody.call(Startable.java:69)
	at brooklyn.entity.trait.Startable$StopEffectorBody.call(Startable.java:1)
	at brooklyn.entity.effector.EffectorTasks$EffectorBodyTaskFactory$1.call(EffectorTasks.java:82)
	at brooklyn.util.task.DynamicSequentialTask$DstJob.call(DynamicSequentialTask.java:337)
	at brooklyn.util.task.BasicExecutionManager$SubmissionCallable.call(BasicExecutionManager.java:469)
	at java.util.concurrent.FutureTask$Sync.innerRun(FutureTask.java:303)
	at java.util.concurrent.FutureTask.run(FutureTask.java:138)
	at java.util.concurrent.ThreadPoolExecutor$Worker.runTask(ThreadPoolExecutor.java:886)
	at java.util.concurrent.ThreadPoolExecutor$Worker.run(ThreadPoolExecutor.java:908)
	at java.lang.Thread.run(Thread.java:662)
Caused by: java.util.concurrent.CancellationException: null
	at java.util.concurrent.FutureTask$Sync.innerGet(FutureTask.java:220)
	at java.util.concurrent.FutureTask.get(FutureTask.java:83)
	at com.google.common.util.concurrent.ForwardingFuture.get(ForwardingFuture.java:63)
	at brooklyn.util.task.BasicTask.get(BasicTask.java:343)
	at brooklyn.util.task.ParallelTask.runJobs(ParallelTask.java:63)
	at brooklyn.util.task.CompoundTask$1.call(CompoundTask.java:82)
	at brooklyn.util.task.CompoundTask$1.call(CompoundTask.java:1)
	at brooklyn.util.task.BasicExecutionManager$SubmissionCallable.call(BasicExecutionManager.java:469)
	at java.util.concurrent.FutureTask$Sync.innerRun(FutureTask.java:303)
	at java.util.concurrent.FutureTask.run(FutureTask.java:138)
	at java.util.concurrent.ThreadPoolExecutor$Worker.runTask(ThreadPoolExecutor.java:886)
	at java.util.concurrent.ThreadPoolExecutor$Worker.run(ThreadPoolExecutor.java:908)
	at java.lang.Thread.run(Thread.java:662)

2015-01-20 16:42:25,024 WARN  Task[post-start:e2fpXd5g] was never submitted; did the code
create it and forget to run it? ('cancel' the task to suppress this message)
2015-01-20 16:42:25,024 WARN  Task[customize:lMU4aAri] was never submitted; did the code create
it and forget to run it? ('cancel' the task to suppress this message)
2015-01-20 16:42:25,024 WARN  Task[copy-runtime-resources:AhZsxXtr] was never submitted; did
the code create it and forget to run it? ('cancel' the task to suppress this message)

Results :

Failed tests: 
  BrooklynNodeTest.tearDown:56 ยป PropagatedRuntime 
  ApplicationUsageTrackingTest.testUsageIncludesStartAndStopEvents:159->assertApplicationEvent:177
for destroyed: event=2015-01-20 16:41:49.757(1421772109757); pre=2015-01-20 16:41:49.764 (1421772109764);
post=2015-01-20 16:41:49.764 (1421772109764)



Tests run: 105, Failures: 2, Errors: 0, Skipped: 2

[JENKINS] Recording test results
[JENKINS] Archiving disabled
[INFO]                                                                         
[INFO] ------------------------------------------------------------------------
[INFO] Skipping Brooklyn Network Software Entities
[INFO] This project has been banned from the build due to previous failures.
[INFO] ------------------------------------------------------------------------
[INFO]                                                                         
[INFO] ------------------------------------------------------------------------
[INFO] Skipping Brooklyn OSGi Software Entities
[INFO] This project has been banned from the build due to previous failures.
[INFO] ------------------------------------------------------------------------
[INFO]                                                                         
[INFO] ------------------------------------------------------------------------
[INFO] Skipping Brooklyn Web App Software Entities
[INFO] This project has been banned from the build due to previous failures.
[INFO] ------------------------------------------------------------------------
[INFO]                                                                         
[INFO] ------------------------------------------------------------------------
[INFO] Skipping Brooklyn Messaging Software Entities
[INFO] This project has been banned from the build due to previous failures.
[INFO] ------------------------------------------------------------------------
[INFO]                                                                         
[INFO] ------------------------------------------------------------------------
[INFO] Skipping Brooklyn Database Software Entities
[INFO] This project has been banned from the build due to previous failures.
[INFO] ------------------------------------------------------------------------
[INFO]                                                                         
[INFO] ------------------------------------------------------------------------
[INFO] Skipping Brooklyn NoSQL Data Store Software Entities
[INFO] This project has been banned from the build due to previous failures.
[INFO] ------------------------------------------------------------------------
[INFO]                                                                         
[INFO] ------------------------------------------------------------------------
[INFO] Skipping Brooklyn Monitoring Software Entities
[INFO] This project has been banned from the build due to previous failures.
[INFO] ------------------------------------------------------------------------
[INFO]                                                                         
[INFO] ------------------------------------------------------------------------
[INFO] Skipping Brooklyn CAMP REST API
[INFO] This project has been banned from the build due to previous failures.
[INFO] ------------------------------------------------------------------------
[INFO]                                                                         
[INFO] ------------------------------------------------------------------------
[INFO] Skipping Brooklyn REST Server
[INFO] This project has been banned from the build due to previous failures.
[INFO] ------------------------------------------------------------------------
[INFO]                                                                         
[INFO] ------------------------------------------------------------------------
[INFO] Skipping Brooklyn REST Client
[INFO] This project has been banned from the build due to previous failures.
[INFO] ------------------------------------------------------------------------
[INFO]                                                                         
[INFO] ------------------------------------------------------------------------
[INFO] Skipping Brooklyn REST JavaScript Web GUI
[INFO] This project has been banned from the build due to previous failures.
[INFO] ------------------------------------------------------------------------
[INFO]                                                                         
[INFO] ------------------------------------------------------------------------
[INFO] Skipping Brooklyn Launcher
[INFO] This project has been banned from the build due to previous failures.
[INFO] ------------------------------------------------------------------------
[INFO]                                                                         
[INFO] ------------------------------------------------------------------------
[INFO] Skipping Brooklyn Command Line Interface
[INFO] This project has been banned from the build due to previous failures.
[INFO] ------------------------------------------------------------------------
[INFO]                                                                         
[INFO] ------------------------------------------------------------------------
[INFO] Skipping Brooklyn All Things
[INFO] This project has been banned from the build due to previous failures.
[INFO] ------------------------------------------------------------------------
[INFO]                                                                         
[INFO] ------------------------------------------------------------------------
[INFO] Skipping Brooklyn Distribution
[INFO] This project has been banned from the build due to previous failures.
[INFO] ------------------------------------------------------------------------
[INFO]                                                                         
[INFO] ------------------------------------------------------------------------
[INFO] Skipping Brooklyn Simple Web Cluster Example
[INFO] This project has been banned from the build due to previous failures.
[INFO] ------------------------------------------------------------------------
[INFO]                                                                         
[INFO] ------------------------------------------------------------------------
[INFO] Skipping Brooklyn Global Web Fabric Example
[INFO] This project has been banned from the build due to previous failures.
[INFO] ------------------------------------------------------------------------
[INFO]                                                                         
[INFO] ------------------------------------------------------------------------
[INFO] Skipping Brooklyn Simple Messaging Publish-Subscribe Example
[INFO] This project has been banned from the build due to previous failures.
[INFO] ------------------------------------------------------------------------
[INFO]                                                                         
[INFO] ------------------------------------------------------------------------
[INFO] Skipping Brooklyn NoSQL Cluster Examples
[INFO] This project has been banned from the build due to previous failures.
[INFO] ------------------------------------------------------------------------
[INFO]                                                                         
[INFO] ------------------------------------------------------------------------
[INFO] Skipping Brooklyn QA
[INFO] This project has been banned from the build due to previous failures.
[INFO] ------------------------------------------------------------------------
[INFO] ------------------------------------------------------------------------
[INFO] Reactor Summary:
[INFO] 
[INFO] Brooklyn Parent Project ........................... SUCCESS [26.132s]
[INFO] Brooklyn Utilities to Support Testing (listeners etc)  SUCCESS [7.295s]
[INFO] Brooklyn Logback Includable Configuration ......... SUCCESS [1.410s]
[INFO] Brooklyn Common Utilities ......................... SUCCESS [20.175s]
[INFO] Brooklyn Groovy Utilities ......................... SUCCESS [6.929s]
[INFO] Brooklyn API ...................................... SUCCESS [3.950s]
[INFO] Brooklyn Test Support ............................. SUCCESS [4.549s]
[INFO] CAMP Server Parent Project ........................ SUCCESS [0.252s]
[INFO] CAMP Base ......................................... SUCCESS [4.583s]
[INFO] Brooklyn Core ..................................... SUCCESS [3:20.355s]
[INFO] Brooklyn Policies ................................. SUCCESS [1:32.194s]
[INFO] Brooklyn Jclouds Location Targets ................. SUCCESS [38.654s]
[INFO] Brooklyn Secure JMXMP Agent ....................... SUCCESS [14.863s]
[INFO] Brooklyn JMX RMI Agent ............................ SUCCESS [1.866s]
[INFO] Brooklyn Software Base ............................ FAILURE [57.306s]
[INFO] Brooklyn Network Software Entities ................ SKIPPED
[INFO] Brooklyn OSGi Software Entities ................... SKIPPED
[INFO] Brooklyn Web App Software Entities ................ SKIPPED
[INFO] Brooklyn Messaging Software Entities .............. SKIPPED
[INFO] Brooklyn Database Software Entities ............... SKIPPED
[INFO] Brooklyn NoSQL Data Store Software Entities ....... SKIPPED
[INFO] Brooklyn Monitoring Software Entities ............. SKIPPED
[INFO] Brooklyn CAMP REST API ............................ SKIPPED
[INFO] Brooklyn REST Server .............................. SKIPPED
[INFO] Brooklyn REST Client .............................. SKIPPED
[INFO] Brooklyn REST JavaScript Web GUI .................. SKIPPED
[INFO] Brooklyn Launcher ................................. SKIPPED
[INFO] Brooklyn Command Line Interface ................... SKIPPED
[INFO] Brooklyn All Things ............................... SKIPPED
[INFO] Brooklyn Distribution ............................. SKIPPED
[INFO] Brooklyn Simple Web Cluster Example ............... SKIPPED
[INFO] Brooklyn Global Web Fabric Example ................ SKIPPED
[INFO] Brooklyn Simple Messaging Publish-Subscribe Example  SKIPPED
[INFO] Brooklyn NoSQL Cluster Examples ................... SKIPPED
[INFO] Brooklyn QA ....................................... SKIPPED
[INFO] ------------------------------------------------------------------------
[INFO] BUILD FAILURE
[INFO] ------------------------------------------------------------------------
[INFO] Total time: 8:10.900s
[INFO] Finished at: Tue Jan 20 16:42:25 GMT 2015
[INFO] Final Memory: 50M/245M
[INFO] ------------------------------------------------------------------------
[JENKINS] Archiving disabled
[JENKINS] Archiving disabled
[JENKINS] Archiving disabled
[JENKINS] Archiving disabled
[JENKINS] Archiving disabled
[JENKINS] Archiving disabled
[JENKINS] Archiving disabled
[JENKINS] Archiving disabled
[JENKINS] Archiving disabled
[JENKINS] Archiving disabled
[JENKINS] Archiving disabled
[JENKINS] Archiving disabled
[JENKINS] Archiving disabled
[JENKINS] Archiving disabled
[JENKINS] Archiving disabled
[JENKINS] Archiving disabled
[JENKINS] Archiving disabled
[JENKINS] Archiving disabled
[JENKINS] Archiving disabled
[JENKINS] Archiving disabled
[JENKINS] Archiving disabled
[JENKINS] Archiving disabled
[JENKINS] Archiving disabled
[JENKINS] Archiving disabled
[JENKINS] Archiving disabled
[JENKINS] Archiving disabled
[JENKINS] Archiving disabled
[JENKINS] Archiving disabled
[JENKINS] Archiving disabled
[JENKINS] Archiving disabled
[JENKINS] Archiving disabled
[JENKINS] Archiving disabled
[JENKINS] Archiving disabled
[JENKINS] Archiving disabled
[JENKINS] Archiving disabled
Waiting for Jenkins to finish collecting data
[ERROR] Failed to execute goal org.apache.maven.plugins:maven-surefire-plugin:2.18:test (default-test)
on project brooklyn-software-base: There are test failures.
[ERROR] 
[ERROR] Please refer to F:\hudson\hudson-slave\workspace\incubator-brooklyn-master-windows\software\base\target\surefire-reports
for the individual test results.
[ERROR] -> [Help 1]
[ERROR] 
[ERROR] To see the full stack trace of the errors, re-run Maven with the -e switch.
[ERROR] Re-run Maven using the -X switch to enable full debug logging.
[ERROR] 
[ERROR] For more information about the errors and possible solutions, please read the following
articles:
[ERROR] [Help 1] http://cwiki.apache.org/confluence/display/MAVEN/MojoFailureException
[ERROR] 
[ERROR] After correcting the problems, you can resume the build with the command
[ERROR]   mvn <goals> -rf :brooklyn-software-base
channel stopped

Mime
View raw message