brooklyn-dev mailing list archives

Site index · List index
Message view « Date » · « Thread »
Top « Date » · « Thread »
From Apache Jenkins Server <jenk...@builds.apache.org>
Subject Build failed in Jenkins: incubator-brooklyn-master-integration #3
Date Fri, 19 Dec 2014 13:57:51 GMT
See <https://builds.apache.org/job/incubator-brooklyn-master-integration/3/changes>

Changes:

[aled.sage] RebindOptions: declare fields public

[aled.sage] Extracts AbstractBlueprintTest and marks MongoDbBlueprintTest as WIP

------------------------------------------
[...truncated 36343 lines...]
brooklyn.entity.rebind.persister.BrooklynMementoPersisterInMemorySizeIntegrationTest.testPersistenceVolumeFastManyTimes(brooklyn.entity.rebind.persister.BrooklynMementoPersisterInMemorySizeIntegrationTest)
  Run 1: PASS
  Run 2: PASS
  Run 3: PASS
  Run 4: PASS
  Run 5: PASS
  Run 6: PASS
  Run 7: PASS
  Run 8: PASS
  Run 9: PASS
  Run 10: PASS
  Run 11: PASS
  Run 12: PASS
  Run 13: PASS
  Run 14: PASS
  Run 15: PASS
  Run 16: PASS
  Run 17: PASS
  Run 18: PASS
  Run 19: PASS
  Run 20: BrooklynMementoPersisterInMemorySizeIntegrationTest.testPersistenceVolumeFastManyTimes:54->doTestPersistenceVolume:70
should have written less than 20k, wrote 22880 expected [true] but found [false]

  SshFeedIntegrationTest.testAddedEarly:207 val=null expected [true] but found [false]
  SshFeedIntegrationTest.testDynamicEnvAndCommandSupplier:237 val=null expected [true] but
found [false]
  SshFeedIntegrationTest.testFailsOnNonZero:180 val=null expected [true] but found [false]
  SshFeedIntegrationTest.testFeedDeDupe:111->testReturnsSshStdoutAndInfersMachine:103 val=null
expected [true] but found [false]
  SshFeedIntegrationTest.testReturnsSshExitStatus:134 entity=TestEntityImpl{id=BUAWgUel};
attribute=Sensor: aLong (java.lang.Integer) expected [123] but found [null]
  SshFeedIntegrationTest.testReturnsSshStderr:163 val=null expected [true] but found [false]
  SshFeedIntegrationTest.testReturnsSshStdout:147 val=null expected [true] but found [false]
  SshFeedIntegrationTest.testReturnsSshStdoutAndInfersMachine:103 val=null expected [true]
but found [false]
  LocalhostProvisioningAndAccessTest.testProvisionAndConnect:54 » IllegalState C...
  LocationConfigUtilsTest.testInfersPublicKeyFileFromPrivateKeyFile:95 expected [true] but
found [false]
  LocationConfigUtilsTest.testReadsPrivateKeyFileWithMultipleColonSeparatedFilesWithGoodFirst:77
expected [true] but found [false]
  LocationConfigUtilsTest.testReadsPrivateKeyFileWithMultipleColonSeparatedFilesWithGoodLast:68
expected [true] but found [false]
  LocationConfigUtilsTest.testReadsPrivateKeyFileWithTildaPath:59 expected [true] but found
[false]
  LocationConfigUtilsTest.testReadsPublicKeyFileWithTildaPath:86 expected [true] but found
[false]
  MachineDetailsTest.testGetMachineDetails:69 » PropagatedRuntime 
  SshMachineLocationIntegrationTest.testExtractingConnectablePassphraselessKey:64 » NullPointer
  SshMachineLocationPerformanceTest.testConcurrentSmallCommands:96->runExecManyCommands:139->runMany:159
» Execution
  SshMachineLocationPerformanceTest.testConsecutiveBigStdinCommands:107->runExecManyCommands:131->runExecManyCommands:139->runMany:159
» Execution
  SshMachineLocationPerformanceTest.testConsecutiveBigStdoutCommands:101->runExecManyCommands:131->runExecManyCommands:139->runMany:159
» Execution
  SshMachineLocationPerformanceTest.testConsecutiveSmallCommands:78->runExecManyCommands:131->runExecManyCommands:139->runMany:159
» Execution
  SshMachineLocationPerformanceTest.testConsecutiveSmallCommandsWithCustomStdoutAndErr:91->runMany:159
» Execution
  SshMachineLocationPerformanceTest.testConsecutiveSmallCommandsWithDifferentProperties:127->runMany:159
» Execution
  SshMachineLocationReuseIntegrationTest.testBasicReuse:119 » IllegalState Canno...
  SshMachineLocationReuseIntegrationTest.testNewConnectionForDifferentProps:133 » IllegalState
  SshMachineLocationReuseIntegrationTest.testReuseWithInterestingProps:126 » IllegalState
  SshMachineLocationReuseIntegrationTest.testSshCacheExpiresEvenIfNotUsed:157 » IllegalState
  SshMachineLocationReuseIntegrationTest.testSshToolReusedWhenConfigDiffers:141 » IllegalState
  SshMachineLocationTest.testCopyFileTo:221 » IllegalState Cannot establish ssh ...
  SshMachineLocationTest.testCopyStreamTo:235 » IllegalState Cannot establish ss...
  SshMachineLocationTest.testGetMachineDetails:109 » Execution brooklyn.util.exc...
  SshMachineLocationTest.testInstallClasspathCopyTo:261 » IllegalState Cannot es...
  SshMachineLocationTest.testInstallUrlTo:247 » IllegalState Cannot establish ss...
  SshMachineLocationTest.testIsSshableWhenFalse:282 » Timeout Still running: r=b...
  SshMachineLocationTest.testIsSshableWhenTrue:273 expected [true] but found [false]
  SshMachineLocationTest.testOverridingPropertyOnExec:202 » IllegalState Cannot ...
  SshMachineLocationTest.testSshExecCommands:189 » IllegalState Cannot establish...
  SshMachineLocationTest.testSshExecScript:178 » IllegalState Cannot establish s...
  HostGeoLookupIntegrationTest.testMaxmindLookup:69 NullPointer
  HotStandbyTest.testHotStandbyDoesNotLeakLotsOfRebindsCreatingAndDestroyingAChildEntity:494->assertUsedMemoryMaxDelta:366->assertUsedMemoryLessThan:361
Too much memory used - 88m > max 88m
  ResourceUtilsTest.testGetResourceViaSftp:154 » Runtime Error getting resource ...
  ResourceUtilsTest.testGetResourceViaSftpWithUsername:161 » Runtime Error getti...
  SshCliToolIntegrationTest>SshToolAbstractIntegrationTest.testAllocatePty:231 » Ssh
  SshCliToolIntegrationTest>SshToolAbstractIntegrationTest.testCopyFileToServerWithPermissions:190->SshToolAbstractIntegrationTest.assertRemoteFileContents:103->ShellToolAbstractTest.execCommands:394->ShellToolAbstractTest.execCommands:398->ShellToolAbstractTest.execCommands:402->ShellToolAbstractTest.execCommands:412
» Ssh
  SshCliToolIntegrationTest>SshToolAbstractIntegrationTest.testCopyFromServer:204 » FileNotFound
  SshCliToolIntegrationTest>SshToolAbstractIntegrationTest.testCopyToServerFromBytes:147->SshToolAbstractIntegrationTest.assertRemoteFileContents:103->ShellToolAbstractTest.execCommands:394->ShellToolAbstractTest.execCommands:398->ShellToolAbstractTest.execCommands:402->ShellToolAbstractTest.execCommands:412
» Ssh
  SshCliToolIntegrationTest>SshToolAbstractIntegrationTest.testCopyToServerFromInputStream:162->SshToolAbstractIntegrationTest.assertRemoteFileContents:103->ShellToolAbstractTest.execCommands:394->ShellToolAbstractTest.execCommands:398->ShellToolAbstractTest.execCommands:402->ShellToolAbstractTest.execCommands:412
» Ssh
  SshCliToolIntegrationTest>SshToolAbstractIntegrationTest.testCopyToServerWithPermissions:169->SshToolAbstractIntegrationTest.assertRemoteFilePermissions:112->ShellToolAbstractTest.execCommands:394->ShellToolAbstractTest.execCommands:398->ShellToolAbstractTest.execCommands:402->ShellToolAbstractTest.execCommands:412
» Ssh
  SshCliToolIntegrationTest>ShellToolAbstractTest.testExecBigCommand:271->ShellToolAbstractTest.execCommands:394->ShellToolAbstractTest.execCommands:398->ShellToolAbstractTest.execCommands:402->ShellToolAbstractTest.execCommands:412
» Ssh
  SshCliToolIntegrationTest>ShellToolAbstractTest.testExecBigConcurrentCommand:278->ShellToolAbstractTest.runExecBigConcurrentCommand:305
» Execution
  SshCliToolIntegrationTest>ShellToolAbstractTest.testExecCapturesStderr:329 » Ssh
  SshCliToolIntegrationTest>ShellToolAbstractTest.testExecChainOfCommands:244->ShellToolAbstractTest.execCommands:394->ShellToolAbstractTest.execCommands:398->ShellToolAbstractTest.execCommands:402->ShellToolAbstractTest.execCommands:412
» Ssh
  SshCliToolIntegrationTest>ShellToolAbstractTest.testExecCommandWithEnvVariables:263->ShellToolAbstractTest.execCommands:402->ShellToolAbstractTest.execCommands:412
» Ssh
  SshCliToolIntegrationTest>ShellToolAbstractTest.testExecConsecutiveCommands:104->ShellToolAbstractTest.execScript:417->ShellToolAbstractTest.execScript:421->ShellToolAbstractTest.execScript:436
» Ssh
  SshCliToolIntegrationTest.testExecReturningNonZeroExitCode:115 » Ssh exit code...
  SshCliToolIntegrationTest>ShellToolAbstractTest.testExecReturningZeroExitCode:257 »
Ssh
  SshCliToolIntegrationTest>ShellToolAbstractTest.testExecScriptAbortsOnCommandFailure:178
» Ssh
  SshCliToolIntegrationTest>ShellToolAbstractTest.testExecScriptBigChainOfCommand:168->ShellToolAbstractTest.execScript:425->ShellToolAbstractTest.execScript:429->ShellToolAbstractTest.execScript:436
» Ssh
  SshCliToolIntegrationTest>ShellToolAbstractTest.testExecScriptBigCommand:155->ShellToolAbstractTest.execScript:417->ShellToolAbstractTest.execScript:421->ShellToolAbstractTest.execScript:436
» Ssh
  SshCliToolIntegrationTest>ShellToolAbstractTest.testExecScriptCapturesStderr:318 » Ssh
  SshCliToolIntegrationTest>ShellToolAbstractTest.testExecScriptChainOfCommands:113->ShellToolAbstractTest.execScript:417->ShellToolAbstractTest.execScript:421->ShellToolAbstractTest.execScript:436
» Ssh
  SshCliToolIntegrationTest>ShellToolAbstractTest.testExecScriptCommandWithEnvVariables:132->ShellToolAbstractTest.execScript:429->ShellToolAbstractTest.execScript:436
» Ssh
  SshCliToolIntegrationTest>ShellToolAbstractTest.testExecScriptEchosDontExecuteWhenToldNoExtraOutput:387
» Ssh
  SshCliToolIntegrationTest>ShellToolAbstractTest.testExecScriptEchosExecute:374->ShellToolAbstractTest.execScript:417->ShellToolAbstractTest.execScript:421->ShellToolAbstractTest.execScript:436
» Ssh
  SshCliToolIntegrationTest>ShellToolAbstractTest.testExecScriptReturningNonZeroExitCode:120
» Ssh
  SshCliToolIntegrationTest>ShellToolAbstractTest.testExecScriptReturningZeroExitCode:126
» Ssh
  SshCliToolIntegrationTest>ShellToolAbstractTest.testExecScriptWithSleepThenBigCommand:188->ShellToolAbstractTest.execScript:417->ShellToolAbstractTest.execScript:421->ShellToolAbstractTest.execScript:436
» Ssh
  SshCliToolIntegrationTest>ShellToolAbstractTest.testExecScriptWithSleepThenExit:147->ShellToolAbstractTest.execScript:417->ShellToolAbstractTest.execScript:421->ShellToolAbstractTest.execScript:436
» Ssh
  SshCliToolIntegrationTest>SshToolAbstractIntegrationTest.testOutputAsExpected:279->ShellToolAbstractTest.execCommands:394->ShellToolAbstractTest.execCommands:398->ShellToolAbstractTest.execCommands:402->ShellToolAbstractTest.execCommands:412
» Ssh
  SshCliToolIntegrationTest>ShellToolAbstractTest.testRunAsRoot:367 » Ssh exit c...
  SshCliToolIntegrationTest>ShellToolAbstractTest.testScriptDataNotLost:139->ShellToolAbstractTest.execScript:417->ShellToolAbstractTest.execScript:421->ShellToolAbstractTest.execScript:436
» Ssh
  SshCliToolIntegrationTest>ShellToolAbstractTest.testScriptHeader:338->ShellToolAbstractTest.execScript:436
» Ssh
  SshCliToolIntegrationTest>ShellToolAbstractTest.testStdErr:352 » Ssh exit code...
  SshCliToolPerformanceTest>SshToolAbstractPerformanceTest.testConsecutiveBigStdinCommands:95->SshToolAbstractPerformanceTest.runExecManyCommands:103->SshToolAbstractPerformanceTest.runMany:113->SshToolAbstractPerformanceTest.access$2:122->SshToolAbstractPerformanceTest.execScript:129
» Ssh
  SshCliToolPerformanceTest>SshToolAbstractPerformanceTest.testConsecutiveBigStdoutCommands:89->SshToolAbstractPerformanceTest.runExecManyCommands:103->SshToolAbstractPerformanceTest.runMany:113->SshToolAbstractPerformanceTest.access$2:122->SshToolAbstractPerformanceTest.execScript:129
» Ssh
  SshCliToolPerformanceTest>SshToolAbstractPerformanceTest.testConsecutiveSmallCommands:79->SshToolAbstractPerformanceTest.runExecManyCommands:103->SshToolAbstractPerformanceTest.runMany:113->SshToolAbstractPerformanceTest.access$2:122->SshToolAbstractPerformanceTest.execScript:129
» Ssh
  SshCliToolPerformanceTest>SshToolAbstractPerformanceTest.testConsecutiveSmallCommandsWithStdouterr:84->SshToolAbstractPerformanceTest.runExecManyCommands:103->SshToolAbstractPerformanceTest.runMany:113->SshToolAbstractPerformanceTest.access$2:122->SshToolAbstractPerformanceTest.execScript:129
» Ssh
  ProcessToolIntegrationTest>ShellToolAbstractTest.testRunAsRoot:368 not running as root;
whoami is: Executed /tmp/brooklyn-20141219-124411381-ygS9.sh, result 1
 (err is 'sudo: a password is required
') expected [true] but found [false]
brooklyn.util.internal.ssh.sshj.SshjToolIntegrationTest.setUp(brooklyn.util.internal.ssh.sshj.SshjToolIntegrationTest)
  Run 1: SshjToolIntegrationTest>SshToolAbstractIntegrationTest.setUp:97->ShellToolAbstractTest.setUp:84->ShellToolAbstractTest.connect:99
» Ssh
  Run 2: PASS
  Run 3: PASS
  Run 4: PASS
  Run 5: PASS
  Run 6: PASS
  Run 7: PASS
  Run 8: PASS
  Run 9: PASS
  Run 10: PASS
  Run 11: PASS
  Run 12: PASS
  Run 13: PASS
  Run 14: PASS
  Run 15: PASS
  Run 16: PASS
  Run 17: PASS
  Run 18: PASS
  Run 19: PASS
  Run 20: PASS
  Run 21: PASS
  Run 22: PASS
  Run 23: PASS
  Run 24: PASS
  Run 25: PASS
  Run 26: PASS
  Run 27: PASS
  Run 28: PASS
  Run 29: PASS
  Run 30: PASS
  Run 31: PASS
  Run 32: PASS
  Run 33: PASS
  Run 34: PASS
  Run 35: PASS
  Run 36: PASS
  Run 37: PASS
  Run 38: PASS

  SshjToolPerformanceTest>SshToolAbstractPerformanceTest.testConsecutiveBigStdinCommands:95->SshToolAbstractPerformanceTest.runExecManyCommands:103->SshToolAbstractPerformanceTest.runMany:113->SshToolAbstractPerformanceTest.access$2:122->SshToolAbstractPerformanceTest.execScript:128
» Ssh
  SshjToolPerformanceTest>SshToolAbstractPerformanceTest.testConsecutiveBigStdoutCommands:89->SshToolAbstractPerformanceTest.runExecManyCommands:103->SshToolAbstractPerformanceTest.runMany:113->SshToolAbstractPerformanceTest.access$2:122->SshToolAbstractPerformanceTest.execScript:128
» Ssh
  SshjToolPerformanceTest>SshToolAbstractPerformanceTest.testConsecutiveConnectAndDisconnect:74->SshToolAbstractPerformanceTest.runMany:113
» Ssh
  SshjToolPerformanceTest>SshToolAbstractPerformanceTest.testConsecutiveSmallCommands:79->SshToolAbstractPerformanceTest.runExecManyCommands:103->SshToolAbstractPerformanceTest.runMany:113->SshToolAbstractPerformanceTest.access$2:122->SshToolAbstractPerformanceTest.execScript:128
» Ssh
  SshjToolPerformanceTest>SshToolAbstractPerformanceTest.testConsecutiveSmallCommandsWithStdouterr:84->SshToolAbstractPerformanceTest.runExecManyCommands:103->SshToolAbstractPerformanceTest.runMany:113->SshToolAbstractPerformanceTest.access$2:122->SshToolAbstractPerformanceTest.execScript:128
» Ssh
  BashCommandsIntegrationTest.testAlternatives:188 » Execution java.lang.Illegal...
  BashCommandsIntegrationTest.testAlternativesWhereFirstSucceeds:174 » Execution
  BashCommandsIntegrationTest.testDownloadFirstSuccessfulFile:151 » IllegalState
  BashCommandsIntegrationTest.testDownloadToStdout:164 » Execution java.lang.Ill...
  BashCommandsIntegrationTest.testPipeMultiline:256 » PropagatedRuntime 
  BashCommandsIntegrationTest.testRequireFailureExitsImmediately:246 » Execution
  BashCommandsIntegrationTest.testRequireFileHandlesFailure:221 » Execution java...
  BashCommandsIntegrationTest.testRequireFileHandlesSuccess:234 » Execution java...
  BashCommandsIntegrationTest.testRequireTestHandlesFailure:199 » Execution java...
  BashCommandsIntegrationTest.testRequireTestHandlesSuccess:211 » Execution java...
  BashCommandsIntegrationTest.testSudo:128 » IllegalState Cannot establish ssh c...
  BashCommandsIntegrationTest.testWaitForFileContentsWhenAbortingOnFail:266 » IllegalState
  BashCommandsIntegrationTest.testWaitForFileContentsWhenContentsAppearAfterStart:300 » PropagatedRuntime
  BashCommandsIntegrationTest.testWaitForFileContentsWhenNotAbortingOnFail:279 » PropagatedRuntime
  SshTasksTest.testCopyTo:120 » FileNotFound File '/tmp/SshTasksTest-bqzi/f1' do...
  SshTasksTest.testCopyToFailBadSubdirCreate:172 » FileNotFound File '/tmp/SshTa...
  SshTasksTest.testSshEchoHello:110 » PropagatedRuntime 
  SshTasksTest.testSshFetch:187 » PropagatedRuntime 
  SshTasksTest.testSshIgnoringHeaderProperty:202 mismatched output was:  expected [true] but
found [false]
  SshTasksTest.testSshWithHeaderProperty:195 mismatched output was:  expected [true] but found
[false]



Tests run: 1248, Failures: 111, Errors: 0, Skipped: 41

[JENKINS] Recording test results
[INFO] ------------------------------------------------------------------------
[INFO] Reactor Summary:
[INFO] 
[INFO] Brooklyn Parent Project ........................... SUCCESS [22.468s]
[INFO] Brooklyn Utilities to Support Testing (listeners etc)  SUCCESS [12.177s]
[INFO] Brooklyn Logback Includable Configuration ......... SUCCESS [4.067s]
[INFO] Brooklyn Common Utilities ......................... FAILURE [1:04.824s]
[INFO] Brooklyn Groovy Utilities ......................... SUCCESS [9.464s]
[INFO] Brooklyn API ...................................... SUCCESS [5.929s]
[INFO] Brooklyn Test Support ............................. SUCCESS [6.282s]
[INFO] CAMP Server Parent Project ........................ SUCCESS [1.634s]
[INFO] CAMP Base ......................................... SUCCESS [7.776s]
[INFO] Brooklyn Core ..................................... FAILURE [1:30:49.789s]
[INFO] ------------------------------------------------------------------------
[INFO] BUILD FAILURE
[INFO] ------------------------------------------------------------------------
[INFO] Total time: 1:33:59.971s
[INFO] Finished at: Fri Dec 19 13:56:53 UTC 2014
[INFO] Final Memory: 40M/242M
[INFO] ------------------------------------------------------------------------
Waiting for Jenkins to finish collecting data
[ERROR] Failed to execute goal org.apache.maven.plugins:maven-surefire-plugin:2.18:test (default-test)
on project brooklyn-utils-common: There are test failures.
[ERROR] 
[ERROR] Please refer to <https://builds.apache.org/job/incubator-brooklyn-master-integration/ws/utils/common/target/surefire-reports>
for the individual test results.
[ERROR] -> [Help 1]
[ERROR] Failed to execute goal org.apache.maven.plugins:maven-surefire-plugin:2.18:test (default-test)
on project brooklyn-core: There are test failures.
[ERROR] 
[ERROR] Please refer to <https://builds.apache.org/job/incubator-brooklyn-master-integration/ws/core/target/surefire-reports>
for the individual test results.
[ERROR] -> [Help 1]
[ERROR] 
[ERROR] To see the full stack trace of the errors, re-run Maven with the -e switch.
[ERROR] Re-run Maven using the -X switch to enable full debug logging.
[ERROR] 
[ERROR] For more information about the errors and possible solutions, please read the following
articles:
[ERROR] [Help 1] http://cwiki.apache.org/confluence/display/MAVEN/MojoFailureException
[ERROR] 
[ERROR] After correcting the problems, you can resume the build with the command
[ERROR]   mvn <goals> -rf :brooklyn-utils-common
[JENKINS] Archiving <https://builds.apache.org/job/incubator-brooklyn-master-integration/ws/core/pom.xml>
to org.apache.brooklyn/brooklyn-core/0.7.0-SNAPSHOT/brooklyn-core-0.7.0-SNAPSHOT.pom
Sending artifact delta relative to incubator-brooklyn-master-integration » Brooklyn Core
#2
Archived 1 artifacts
Archive block size is 32768
Received 0 blocks and 8260 bytes
Compression is 0.0%
Took 5.2 sec
[JENKINS] Archiving <https://builds.apache.org/job/incubator-brooklyn-master-integration/ws/utils/groovy/pom.xml>
to org.apache.brooklyn/brooklyn-utils-groovy/0.7.0-SNAPSHOT/brooklyn-utils-groovy-0.7.0-SNAPSHOT.pom
[JENKINS] Archiving <https://builds.apache.org/job/incubator-brooklyn-master-integration/ws/utils/groovy/target/brooklyn-utils-groovy-0.7.0-SNAPSHOT.jar>
to org.apache.brooklyn/brooklyn-utils-groovy/0.7.0-SNAPSHOT/brooklyn-utils-groovy-0.7.0-SNAPSHOT.jar
[JENKINS] Archiving <https://builds.apache.org/job/incubator-brooklyn-master-integration/ws/utils/groovy/target/brooklyn-utils-groovy-0.7.0-SNAPSHOT-sources.jar>
to org.apache.brooklyn/brooklyn-utils-groovy/0.7.0-SNAPSHOT/brooklyn-utils-groovy-0.7.0-SNAPSHOT-sources.jar
No prior successful build to compare, so performing full copy of artifacts
[JENKINS] Archiving <https://builds.apache.org/job/incubator-brooklyn-master-integration/ws/utils/common/pom.xml>
to org.apache.brooklyn/brooklyn-utils-common/0.7.0-SNAPSHOT/brooklyn-utils-common-0.7.0-SNAPSHOT.pom
No prior successful build to compare, so performing full copy of artifacts
[JENKINS] Archiving <https://builds.apache.org/job/incubator-brooklyn-master-integration/ws/usage/test-support/pom.xml>
to org.apache.brooklyn/brooklyn-test-support/0.7.0-SNAPSHOT/brooklyn-test-support-0.7.0-SNAPSHOT.pom
[JENKINS] Archiving <https://builds.apache.org/job/incubator-brooklyn-master-integration/ws/usage/test-support/target/brooklyn-test-support-0.7.0-SNAPSHOT.jar>
to org.apache.brooklyn/brooklyn-test-support/0.7.0-SNAPSHOT/brooklyn-test-support-0.7.0-SNAPSHOT.jar
[JENKINS] Archiving <https://builds.apache.org/job/incubator-brooklyn-master-integration/ws/usage/test-support/target/brooklyn-test-support-0.7.0-SNAPSHOT-sources.jar>
to org.apache.brooklyn/brooklyn-test-support/0.7.0-SNAPSHOT/brooklyn-test-support-0.7.0-SNAPSHOT-sources.jar
No prior successful build to compare, so performing full copy of artifacts
[JENKINS] Archiving <https://builds.apache.org/job/incubator-brooklyn-master-integration/ws/camp/camp-base/pom.xml>
to org.apache.brooklyn.camp/camp-base/0.7.0-SNAPSHOT/camp-base-0.7.0-SNAPSHOT.pom
[JENKINS] Archiving <https://builds.apache.org/job/incubator-brooklyn-master-integration/ws/camp/camp-base/target/camp-base-0.7.0-SNAPSHOT.jar>
to org.apache.brooklyn.camp/camp-base/0.7.0-SNAPSHOT/camp-base-0.7.0-SNAPSHOT.jar
[JENKINS] Archiving <https://builds.apache.org/job/incubator-brooklyn-master-integration/ws/camp/camp-base/target/camp-base-0.7.0-SNAPSHOT-sources.jar>
to org.apache.brooklyn.camp/camp-base/0.7.0-SNAPSHOT/camp-base-0.7.0-SNAPSHOT-sources.jar
No prior successful build to compare, so performing full copy of artifacts
[JENKINS] Archiving <https://builds.apache.org/job/incubator-brooklyn-master-integration/ws/pom.xml>
to org.apache.brooklyn/brooklyn-parent/0.7.0-SNAPSHOT/brooklyn-parent-0.7.0-SNAPSHOT.pom
No prior successful build to compare, so performing full copy of artifacts
[JENKINS] Archiving <https://builds.apache.org/job/incubator-brooklyn-master-integration/ws/usage/logback-includes/pom.xml>
to org.apache.brooklyn/brooklyn-logback-includes/0.7.0-SNAPSHOT/brooklyn-logback-includes-0.7.0-SNAPSHOT.pom
[JENKINS] Archiving <https://builds.apache.org/job/incubator-brooklyn-master-integration/ws/usage/logback-includes/target/brooklyn-logback-includes-0.7.0-SNAPSHOT.jar>
to org.apache.brooklyn/brooklyn-logback-includes/0.7.0-SNAPSHOT/brooklyn-logback-includes-0.7.0-SNAPSHOT.jar
[JENKINS] Archiving <https://builds.apache.org/job/incubator-brooklyn-master-integration/ws/usage/logback-includes/target/brooklyn-logback-includes-0.7.0-SNAPSHOT-sources.jar>
to org.apache.brooklyn/brooklyn-logback-includes/0.7.0-SNAPSHOT/brooklyn-logback-includes-0.7.0-SNAPSHOT-sources.jar
No prior successful build to compare, so performing full copy of artifacts
[JENKINS] Archiving <https://builds.apache.org/job/incubator-brooklyn-master-integration/ws/utils/test-support/pom.xml>
to org.apache.brooklyn/brooklyn-utils-test-support/0.7.0-SNAPSHOT/brooklyn-utils-test-support-0.7.0-SNAPSHOT.pom
[JENKINS] Archiving <https://builds.apache.org/job/incubator-brooklyn-master-integration/ws/utils/test-support/target/brooklyn-utils-test-support-0.7.0-SNAPSHOT.jar>
to org.apache.brooklyn/brooklyn-utils-test-support/0.7.0-SNAPSHOT/brooklyn-utils-test-support-0.7.0-SNAPSHOT.jar
[JENKINS] Archiving <https://builds.apache.org/job/incubator-brooklyn-master-integration/ws/utils/test-support/target/brooklyn-utils-test-support-0.7.0-SNAPSHOT-sources.jar>
to org.apache.brooklyn/brooklyn-utils-test-support/0.7.0-SNAPSHOT/brooklyn-utils-test-support-0.7.0-SNAPSHOT-sources.jar
No prior successful build to compare, so performing full copy of artifacts
[JENKINS] Archiving <https://builds.apache.org/job/incubator-brooklyn-master-integration/ws/camp/pom.xml>
to org.apache.brooklyn.camp/camp-parent/0.7.0-SNAPSHOT/camp-parent-0.7.0-SNAPSHOT.pom
No prior successful build to compare, so performing full copy of artifacts
[JENKINS] Archiving <https://builds.apache.org/job/incubator-brooklyn-master-integration/ws/api/pom.xml>
to org.apache.brooklyn/brooklyn-api/0.7.0-SNAPSHOT/brooklyn-api-0.7.0-SNAPSHOT.pom
[JENKINS] Archiving <https://builds.apache.org/job/incubator-brooklyn-master-integration/ws/api/target/brooklyn-api-0.7.0-SNAPSHOT.jar>
to org.apache.brooklyn/brooklyn-api/0.7.0-SNAPSHOT/brooklyn-api-0.7.0-SNAPSHOT.jar
[JENKINS] Archiving <https://builds.apache.org/job/incubator-brooklyn-master-integration/ws/api/target/brooklyn-api-0.7.0-SNAPSHOT-sources.jar>
to org.apache.brooklyn/brooklyn-api/0.7.0-SNAPSHOT/brooklyn-api-0.7.0-SNAPSHOT-sources.jar
No prior successful build to compare, so performing full copy of artifacts
channel stopped
Looks like the node went offline during the build. Check the slave log for the details.

Mime
View raw message