brooklyn-dev mailing list archives

Site index · List index
Message view « Date » · « Thread »
Top « Date » · « Thread »
From Apache Jenkins Server <jenk...@builds.apache.org>
Subject Build failed in Jenkins: incubator-brooklyn-master-windows #93
Date Wed, 03 Dec 2014 18:00:14 GMT
See <https://builds.apache.org/job/incubator-brooklyn-master-windows/93/changes>

Changes:

[sam.corbett] Logging brooklyn-persister thread Jclouds messages in a separate file

[grkvlt] Fix the DynamicMultiGroup rebind actions

[sam.corbett] BindDnsServer strips invalid characters from domain names

[grkvlt] Make BUCKETS map immutable (see review comment from @aledsage)

------------------------------------------
[...truncated 20421 lines...]
[INFO] Building jar: F:\hudson\hudson-slave\workspace\incubator-brooklyn-master-windows\examples\webapps\hello-world-webapp\target\brooklyn-example-hello-world-webapp-sources.jar
[INFO] 
[INFO] --- maven-install-plugin:2.5.1:install (default-install) @ brooklyn-example-hello-world-webapp
---
[INFO] Installing F:\hudson\hudson-slave\workspace\incubator-brooklyn-master-windows\examples\webapps\hello-world-webapp\target\brooklyn-example-hello-world-webapp.war
to f:\hudson\hudson-slave\maven-repositories\1\org\apache\brooklyn\example\brooklyn-example-hello-world-webapp\0.7.0-SNAPSHOT\brooklyn-example-hello-world-webapp-0.7.0-SNAPSHOT.war
[INFO] Installing F:\hudson\hudson-slave\workspace\incubator-brooklyn-master-windows\examples\webapps\hello-world-webapp\pom.xml
to f:\hudson\hudson-slave\maven-repositories\1\org\apache\brooklyn\example\brooklyn-example-hello-world-webapp\0.7.0-SNAPSHOT\brooklyn-example-hello-world-webapp-0.7.0-SNAPSHOT.pom
[INFO] Installing F:\hudson\hudson-slave\workspace\incubator-brooklyn-master-windows\examples\webapps\hello-world-webapp\target\brooklyn-example-hello-world-webapp-sources.jar
to f:\hudson\hudson-slave\maven-repositories\1\org\apache\brooklyn\example\brooklyn-example-hello-world-webapp\0.7.0-SNAPSHOT\brooklyn-example-hello-world-webapp-0.7.0-SNAPSHOT-sources.jar
[JENKINS] Archiving disabled
[INFO]                                                                         
[INFO] ------------------------------------------------------------------------
[INFO] Building hello-world-sql-webapp Maven Webapp 0.7.0-SNAPSHOT
[INFO] ------------------------------------------------------------------------
[INFO] 
[INFO] --- maven-clean-plugin:2.5:clean (default-clean) @ brooklyn-example-hello-world-sql-webapp
---
[INFO] Deleting F:\hudson\hudson-slave\workspace\incubator-brooklyn-master-windows\examples\webapps\hello-world-sql\target
[INFO] Deleting F:\hudson\hudson-slave\workspace\incubator-brooklyn-master-windows\examples\webapps\hello-world-sql
(includes = [brooklyn*.log, brooklyn*.log.*, stacktrace.log, test-output, prodDb.*], excludes
= [])
[INFO] 
[INFO] --- maven-replacer-plugin:1.4.0:replace (fix-eclipse-dot-classpath-mangling) @ brooklyn-example-hello-world-sql-webapp
---
[INFO] Ignoring missing file
[INFO] Replacement run on 0 file.
[INFO] 
[INFO] --- buildnumber-maven-plugin:1.3:create (default) @ brooklyn-example-hello-world-sql-webapp
---
[INFO] 
[INFO] --- maven-enforcer-plugin:1.3.1:enforce (brooklyn-build-req) @ brooklyn-example-hello-world-sql-webapp
---
[INFO] 
[INFO] --- maven-remote-resources-plugin:1.5:process (default) @ brooklyn-example-hello-world-sql-webapp
---
[INFO] 
[INFO] --- maven-resources-plugin:2.6:resources (default-resources) @ brooklyn-example-hello-world-sql-webapp
---
[INFO] Using 'UTF-8' encoding to copy filtered resources.
[INFO] skip non existing resourceDirectory F:\hudson\hudson-slave\workspace\incubator-brooklyn-master-windows\examples\webapps\hello-world-sql\src\main\resources
[INFO] Copying 3 resources
[INFO] 
[INFO] --- maven-compiler-plugin:3.1:compile (default-compile) @ brooklyn-example-hello-world-sql-webapp
---
[INFO] No sources to compile
[INFO] 
[INFO] --- maven-checkstyle-plugin:2.13:check (verify-style) @ brooklyn-example-hello-world-sql-webapp
---
[INFO] 
[INFO] 
[INFO] --- maven-bundle-plugin:2.3.4:manifest (bundle-manifest) @ brooklyn-example-hello-world-sql-webapp
---
[WARNING] Ignoring project type war - supportedProjectTypes = [jar]
[INFO] 
[INFO] --- maven-resources-plugin:2.6:testResources (default-testResources) @ brooklyn-example-hello-world-sql-webapp
---
[INFO] Using 'UTF-8' encoding to copy filtered resources.
[INFO] skip non existing resourceDirectory F:\hudson\hudson-slave\workspace\incubator-brooklyn-master-windows\examples\webapps\hello-world-sql\src\test\resources
[INFO] Copying 3 resources
[INFO] 
[INFO] --- maven-compiler-plugin:3.1:testCompile (default-testCompile) @ brooklyn-example-hello-world-sql-webapp
---
[INFO] No sources to compile
[INFO] 
[INFO] --- maven-surefire-plugin:2.18:test (default-test) @ brooklyn-example-hello-world-sql-webapp
---
[JENKINS] Recording test results
[INFO] 
[INFO] --- maven-war-plugin:2.1.1:war (default-war) @ brooklyn-example-hello-world-sql-webapp
---
[INFO] Packaging webapp
[INFO] Assembling webapp [brooklyn-example-hello-world-sql-webapp] in [F:\hudson\hudson-slave\workspace\incubator-brooklyn-master-windows\examples\webapps\hello-world-sql\target\brooklyn-example-hello-world-sql-webapp]
[INFO] Processing war project
[INFO] Copying webapp resources [F:\hudson\hudson-slave\workspace\incubator-brooklyn-master-windows\examples\webapps\hello-world-sql\src\main\webapp]
[INFO] Webapp assembled in [158 msecs]
[INFO] Building war: F:\hudson\hudson-slave\workspace\incubator-brooklyn-master-windows\examples\webapps\hello-world-sql\target\brooklyn-example-hello-world-sql-webapp.war
[WARNING] Warning: selected war files include a WEB-INF/web.xml which will be ignored 
(webxml attribute is missing from war task, or ignoreWebxml attribute is specified as 'true')
[INFO] 
[INFO] --- maven-site-plugin:3.4:attach-descriptor (attach-descriptor) @ brooklyn-example-hello-world-sql-webapp
---
[INFO] 
[INFO] --- apache-rat-plugin:0.10:check (default) @ brooklyn-example-hello-world-sql-webapp
---
[INFO] 51 implicit excludes (use -debug for more details).
[INFO] Exclude: sandbox/**
[INFO] Exclude: **/.git/**
[INFO] Exclude: **/.gitignore
[INFO] Exclude: **/.repository/**
[INFO] Exclude: **/.idea/**
[INFO] Exclude: **/*.iml
[INFO] Exclude: **/.classpath/**
[INFO] Exclude: **/.project
[INFO] Exclude: **/.settings/**
[INFO] Exclude: **/*.log
[INFO] Exclude: **/brooklyn*.log.*
[INFO] Exclude: **/target/**
[INFO] Exclude: ignored/**
[INFO] Exclude: LICENSE.md
[INFO] Exclude: **/MANIFEST.MF
[INFO] Exclude: **/test-output/**
[INFO] Exclude: **/*.pem.pub
[INFO] Exclude: **/*.svg
[INFO] Exclude: **/*.crt
[INFO] Exclude: **/*.csr
[INFO] Exclude: **/*.key
[INFO] Exclude: **/*.key.org
[INFO] Exclude: **/*.psd
[INFO] Exclude: **/*.json
[INFO] Exclude: **/*.plxarc
[INFO] Exclude: **/services/brooklyn.location.LocationResolver
[INFO] Exclude: **/src/test/resources/brooklyn/entity/basic/template_with_extra_substitutions.txt
[INFO] Exclude: **/src/main/resources/banner.txt
[INFO] Exclude: **/src/test/resources/ssl/certs/localhost/info.txt
[INFO] Exclude: **/sandbox/examples/src/main/scripts/amis.txt
[INFO] Exclude: docs/**
[INFO] 10 resources included (use -debug for more details)
[INFO] Rat check: Summary of files. Unapproved: 0 unknown: 0 generated: 0 approved: 9 licence.
[INFO] 
[INFO] --- maven-source-plugin:2.3:jar-no-fork (attach-sources) @ brooklyn-example-hello-world-sql-webapp
---
[INFO] Building jar: F:\hudson\hudson-slave\workspace\incubator-brooklyn-master-windows\examples\webapps\hello-world-sql\target\brooklyn-example-hello-world-sql-webapp-sources.jar
[INFO] 
[INFO] --- maven-install-plugin:2.5.1:install (default-install) @ brooklyn-example-hello-world-sql-webapp
---
[INFO] Installing F:\hudson\hudson-slave\workspace\incubator-brooklyn-master-windows\examples\webapps\hello-world-sql\target\brooklyn-example-hello-world-sql-webapp.war
to f:\hudson\hudson-slave\maven-repositories\1\org\apache\brooklyn\example\brooklyn-example-hello-world-sql-webapp\0.7.0-SNAPSHOT\brooklyn-example-hello-world-sql-webapp-0.7.0-SNAPSHOT.war
[INFO] Installing F:\hudson\hudson-slave\workspace\incubator-brooklyn-master-windows\examples\webapps\hello-world-sql\pom.xml
to f:\hudson\hudson-slave\maven-repositories\1\org\apache\brooklyn\example\brooklyn-example-hello-world-sql-webapp\0.7.0-SNAPSHOT\brooklyn-example-hello-world-sql-webapp-0.7.0-SNAPSHOT.pom
[INFO] Installing F:\hudson\hudson-slave\workspace\incubator-brooklyn-master-windows\examples\webapps\hello-world-sql\target\brooklyn-example-hello-world-sql-webapp-sources.jar
to f:\hudson\hudson-slave\maven-repositories\1\org\apache\brooklyn\example\brooklyn-example-hello-world-sql-webapp\0.7.0-SNAPSHOT\brooklyn-example-hello-world-sql-webapp-0.7.0-SNAPSHOT-sources.jar
[JENKINS] Archiving disabled
[INFO]                                                                         
[INFO] ------------------------------------------------------------------------
[INFO] Skipping Brooklyn Simple Web Cluster Example
[INFO] This project has been banned from the build due to previous failures.
[INFO] ------------------------------------------------------------------------
[INFO]                                                                         
[INFO] ------------------------------------------------------------------------
[INFO] Skipping Brooklyn Global Web Fabric Example
[INFO] This project has been banned from the build due to previous failures.
[INFO] ------------------------------------------------------------------------
[INFO]                                                                         
[INFO] ------------------------------------------------------------------------
[INFO] Skipping Brooklyn Simple Messaging Publish-Subscribe Example
[INFO] This project has been banned from the build due to previous failures.
[INFO] ------------------------------------------------------------------------
[INFO]                                                                         
[INFO] ------------------------------------------------------------------------
[INFO] Skipping Brooklyn NoSQL Cluster Examples
[INFO] This project has been banned from the build due to previous failures.
[INFO] ------------------------------------------------------------------------
[INFO]                                                                         
[INFO] ------------------------------------------------------------------------
[INFO] Skipping Brooklyn QA
[INFO] This project has been banned from the build due to previous failures.
[INFO] ------------------------------------------------------------------------
[INFO] ------------------------------------------------------------------------
[INFO] Reactor Summary:
[INFO] 
[INFO] Brooklyn Parent Project ........................... SUCCESS [30.837s]
[INFO] Brooklyn Utilities to Support Testing (listeners etc)  SUCCESS [12.345s]
[INFO] Brooklyn Logback Includable Configuration ......... SUCCESS [2.646s]
[INFO] Brooklyn Common Utilities ......................... SUCCESS [26.648s]
[INFO] Brooklyn Groovy Utilities ......................... SUCCESS [8.497s]
[INFO] Brooklyn API ...................................... SUCCESS [6.220s]
[INFO] Brooklyn Test Support ............................. SUCCESS [7.722s]
[INFO] CAMP Server Parent Project ........................ SUCCESS [0.266s]
[INFO] CAMP Base ......................................... SUCCESS [5.641s]
[INFO] Brooklyn REST Swagger Apidoc Utilities ............ SUCCESS [6.431s]
[INFO] Brooklyn Logback Configuration .................... SUCCESS [2.064s]
[INFO] CAMP Server ....................................... SUCCESS [14.498s]
[INFO] Brooklyn Core ..................................... SUCCESS [4:18.082s]
[INFO] Brooklyn Policies ................................. SUCCESS [1:38.628s]
[INFO] Brooklyn Hazelcast Storage ........................ SUCCESS [9.357s]
[INFO] Brooklyn Jclouds Location Targets ................. SUCCESS [42.659s]
[INFO] Brooklyn Secure JMXMP Agent ....................... SUCCESS [17.179s]
[INFO] Brooklyn JMX RMI Agent ............................ SUCCESS [3.327s]
[INFO] Brooklyn Software Base ............................ FAILURE [5:01.915s]
[INFO] Brooklyn Network Software Entities ................ SKIPPED
[INFO] Brooklyn OSGi Software Entities ................... SKIPPED
[INFO] Brooklyn Web App Software Entities ................ SKIPPED
[INFO] Brooklyn Messaging Software Entities .............. SKIPPED
[INFO] Brooklyn Database Software Entities ............... SKIPPED
[INFO] Brooklyn NoSQL Data Store Software Entities ....... SKIPPED
[INFO] Brooklyn Monitoring Software Entities ............. SKIPPED
[INFO] Brooklyn CAMP REST API ............................ SKIPPED
[INFO] Brooklyn REST API ................................. SUCCESS [12.193s]
[INFO] Brooklyn REST Server .............................. SKIPPED
[INFO] Brooklyn REST Client .............................. SKIPPED
[INFO] Brooklyn REST JavaScript Web GUI .................. SKIPPED
[INFO] Brooklyn Launcher ................................. SKIPPED
[INFO] Brooklyn Command Line Interface ................... SKIPPED
[INFO] Brooklyn All Things ............................... SKIPPED
[INFO] Brooklyn Distribution ............................. SKIPPED
[INFO] Brooklyn Quick-Start Project Archetype ............ SUCCESS [47.660s]
[INFO] Brooklyn Downstream Project Parent ................ SUCCESS [0.166s]
[INFO] Brooklyn Examples Aggregator Project .............. SUCCESS [2.223s]
[INFO] Brooklyn Examples Support Aggregator Project - Webapps  SUCCESS [0.244s]
[INFO] hello-world-webapp Maven Webapp ................... SUCCESS [2.134s]
[INFO] hello-world-sql-webapp Maven Webapp ............... SUCCESS [2.497s]
[INFO] Brooklyn Simple Web Cluster Example ............... SKIPPED
[INFO] Brooklyn Global Web Fabric Example ................ SKIPPED
[INFO] Brooklyn Simple Messaging Publish-Subscribe Example  SKIPPED
[INFO] Brooklyn NoSQL Cluster Examples ................... SKIPPED
[INFO] Brooklyn QA ....................................... SKIPPED
[INFO] ------------------------------------------------------------------------
[INFO] BUILD FAILURE
[INFO] ------------------------------------------------------------------------
[INFO] Total time: 15:37.309s
[INFO] Finished at: Wed Dec 03 17:59:33 GMT 2014
[INFO] Final Memory: 55M/245M
[INFO] ------------------------------------------------------------------------
[JENKINS] Archiving disabled
[JENKINS] Archiving disabled
[JENKINS] Archiving disabled
[JENKINS] Archiving disabled
[JENKINS] Archiving disabled
[JENKINS] Archiving disabled
[JENKINS] Archiving disabled
[JENKINS] Archiving disabled
[JENKINS] Archiving disabled
[JENKINS] Archiving disabled
[JENKINS] Archiving disabled
[JENKINS] Archiving disabled
[JENKINS] Archiving disabled
[JENKINS] Archiving disabled
[JENKINS] Archiving disabled
[JENKINS] Archiving disabled
[JENKINS] Archiving disabled
[JENKINS] Archiving disabled
[JENKINS] Archiving disabled
[JENKINS] Archiving disabled
[JENKINS] Archiving disabled
[JENKINS] Archiving disabled
[JENKINS] Archiving disabled
[JENKINS] Archiving disabled
[JENKINS] Archiving disabled
[JENKINS] Archiving disabled
[JENKINS] Archiving disabled
[JENKINS] Archiving disabled
[JENKINS] Archiving disabled
[JENKINS] Archiving disabled
[JENKINS] Archiving disabled
[JENKINS] Archiving disabled
[JENKINS] Archiving disabled
[JENKINS] Archiving disabled
[JENKINS] Archiving disabled
[JENKINS] Archiving disabled
[JENKINS] Archiving disabled
[JENKINS] Archiving disabled
[JENKINS] Archiving disabled
[JENKINS] Archiving disabled
[JENKINS] Archiving disabled
[JENKINS] Archiving disabled
[JENKINS] Archiving disabled
[JENKINS] Archiving disabled
[JENKINS] Archiving disabled
[JENKINS] Archiving disabled
Waiting for Jenkins to finish collecting data
[ERROR] Failed to execute goal org.apache.maven.plugins:maven-surefire-plugin:2.18:test (default-test)
on project brooklyn-software-base: There are test failures.
[ERROR] 
[ERROR] Please refer to F:\hudson\hudson-slave\workspace\incubator-brooklyn-master-windows\software\base\target\surefire-reports
for the individual test results.
[ERROR] -> [Help 1]
[ERROR] 
[ERROR] To see the full stack trace of the errors, re-run Maven with the -e switch.
[ERROR] Re-run Maven using the -X switch to enable full debug logging.
[ERROR] 
[ERROR] For more information about the errors and possible solutions, please read the following
articles:
[ERROR] [Help 1] http://cwiki.apache.org/confluence/display/MAVEN/MojoFailureException
[ERROR] 
[ERROR] After correcting the problems, you can resume the build with the command
[ERROR]   mvn <goals> -rf :brooklyn-software-base
channel stopped

Mime
View raw message