brooklyn-dev mailing list archives

Site index · List index
Message view « Date » · « Thread »
Top « Date » · « Thread »
From Apache Jenkins Server <jenk...@builds.apache.org>
Subject Build failed in Jenkins: incubator-brooklyn-master-windows #116
Date Tue, 23 Dec 2014 11:58:02 GMT
See <https://builds.apache.org/job/incubator-brooklyn-master-windows/116/changes>

Changes:

[alex.heneveld] try reading from disk when computing site structure

[alex.heneveld] allow `--skip-javadoc` on builds if javadoc is already built

------------------------------------------
[...truncated 15363 lines...]
2014-12-23 03:57:53,203 INFO  TESTNG INVOKING: "Surefire test" - brooklyn.rest.domain.EntitySpecTest.testDeserializeFromJSONOnlyWithType()
2014-12-23 03:57:53,213 INFO  TESTNG PASSED: "Surefire test" - brooklyn.rest.domain.EntitySpecTest.testDeserializeFromJSONOnlyWithType()
finished in 10 ms
2014-12-23 03:57:53,215 INFO  TESTNG INVOKING: "Surefire test" - brooklyn.rest.domain.EntitySpecTest.testSerializeToJSON()
2014-12-23 03:57:53,229 INFO  TESTNG PASSED: "Surefire test" - brooklyn.rest.domain.EntitySpecTest.testSerializeToJSON()
finished in 14 ms
2014-12-23 03:57:53,231 INFO  TESTNG INVOKING: "Surefire test" - brooklyn.rest.domain.EntitySummaryTest.testDeserializeFromJSON()
2014-12-23 03:57:53,264 INFO  TESTNG PASSED: "Surefire test" - brooklyn.rest.domain.EntitySummaryTest.testDeserializeFromJSON()
finished in 33 ms
2014-12-23 03:57:53,266 INFO  TESTNG INVOKING: "Surefire test" - brooklyn.rest.domain.EntitySummaryTest.testSerializeToJSON()
2014-12-23 03:57:53,430 INFO  TESTNG PASSED: "Surefire test" - brooklyn.rest.domain.EntitySummaryTest.testSerializeToJSON()
finished in 164 ms
2014-12-23 03:57:53,431 INFO  TESTNG INVOKING: "Surefire test" - brooklyn.rest.domain.LocationSpecTest.testDeserializeFromJSON()
2014-12-23 03:57:53,448 INFO  TESTNG PASSED: "Surefire test" - brooklyn.rest.domain.LocationSpecTest.testDeserializeFromJSON()
finished in 17 ms
2014-12-23 03:57:53,449 INFO  TESTNG INVOKING: "Surefire test" - brooklyn.rest.domain.LocationSpecTest.testDeserializeFromJSONWithNoCredential()
2014-12-23 03:57:53,455 INFO  TESTNG PASSED: "Surefire test" - brooklyn.rest.domain.LocationSpecTest.testDeserializeFromJSONWithNoCredential()
finished in 6 ms
2014-12-23 03:57:53,458 INFO  TESTNG INVOKING: "Surefire test" - brooklyn.rest.domain.LocationSpecTest.testSerializeToJSON()
2014-12-23 03:57:53,461 INFO  TESTNG PASSED: "Surefire test" - brooklyn.rest.domain.LocationSpecTest.testSerializeToJSON()
finished in 4 ms
2014-12-23 03:57:53,477 INFO  TESTNG 
===============================================
    Surefire test
    Tests run: 15, Failures: 0, Skips: 0
===============================================
2014-12-23 03:57:53,478 INFO  BrooklynLeakListener.onFinish attempting to terminate all extant
ManagementContexts: name=Surefire test; includedGroups=[]; excludedGroups=[Integration, Acceptance,
Live, WIP]; suiteName=Surefire suite; outDir=F:\jenkins\jenkins-slave\workspace\incubator-brooklyn-master-windows\usage\rest-api\target\surefire-reports\Surefire
suite: no brooklyn.management.internal.LocalManagementContext available, so skipped
Tests run: 15, Failures: 0, Errors: 0, Skipped: 0, Time elapsed: 1.69 sec - in TestSuite

Results :




Tests run: 15, Failures: 0, Errors: 0, Skipped: 0

[JENKINS] Recording test results
[INFO] 
[INFO] --- maven-jar-plugin:2.3.2:jar (default-jar) @ brooklyn-rest-api ---
[INFO] Building jar: F:\jenkins\jenkins-slave\workspace\incubator-brooklyn-master-windows\usage\rest-api\target\brooklyn-rest-api-0.7.0-SNAPSHOT.jar
[INFO] 
[INFO] --- maven-site-plugin:3.4:attach-descriptor (attach-descriptor) @ brooklyn-rest-api
---
[INFO] 
[INFO] --- maven-jar-plugin:2.3.2:test-jar (test-jar-creation) @ brooklyn-rest-api ---
[INFO] Building jar: F:\jenkins\jenkins-slave\workspace\incubator-brooklyn-master-windows\usage\rest-api\target\brooklyn-rest-api-0.7.0-SNAPSHOT-tests.jar
[INFO] 
[INFO] --- apache-rat-plugin:0.10:check (default) @ brooklyn-rest-api ---
[INFO] 51 implicit excludes (use -debug for more details).
[INFO] Exclude: sandbox/**
[INFO] Exclude: **/.git/**
[INFO] Exclude: **/.gitignore
[INFO] Exclude: **/.repository/**
[INFO] Exclude: **/.idea/**
[INFO] Exclude: **/*.iml
[INFO] Exclude: **/.classpath/**
[INFO] Exclude: **/.project
[INFO] Exclude: **/.settings/**
[INFO] Exclude: **/*.log
[INFO] Exclude: **/brooklyn*.log.*
[INFO] Exclude: **/target/**
[INFO] Exclude: ignored/**
[INFO] Exclude: LICENSE.md
[INFO] Exclude: **/MANIFEST.MF
[INFO] Exclude: **/test-output/**
[INFO] Exclude: **/*.pem.pub
[INFO] Exclude: **/*.svg
[INFO] Exclude: **/*.crt
[INFO] Exclude: **/*.csr
[INFO] Exclude: **/*.key
[INFO] Exclude: **/*.key.org
[INFO] Exclude: **/*.psd
[INFO] Exclude: **/*.json
[INFO] Exclude: **/*.plxarc
[INFO] Exclude: **/services/brooklyn.location.LocationResolver
[INFO] Exclude: **/src/test/resources/brooklyn/entity/basic/template_with_extra_substitutions.txt
[INFO] Exclude: **/src/main/resources/banner.txt
[INFO] Exclude: **/src/test/resources/ssl/certs/localhost/info.txt
[INFO] Exclude: **/sandbox/examples/src/main/scripts/amis.txt
[INFO] Exclude: docs/**
[INFO] 53 resources included (use -debug for more details)
[INFO] Rat check: Summary of files. Unapproved: 0 unknown: 0 generated: 0 approved: 53 licence.
[INFO] 
[INFO] --- maven-source-plugin:2.3:jar-no-fork (attach-sources) @ brooklyn-rest-api ---
[INFO] Building jar: F:\jenkins\jenkins-slave\workspace\incubator-brooklyn-master-windows\usage\rest-api\target\brooklyn-rest-api-0.7.0-SNAPSHOT-sources.jar
[INFO] 
[INFO] --- maven-install-plugin:2.5.1:install (default-install) @ brooklyn-rest-api ---
[INFO] Installing F:\jenkins\jenkins-slave\workspace\incubator-brooklyn-master-windows\usage\rest-api\target\brooklyn-rest-api-0.7.0-SNAPSHOT.jar
to f:\jenkins\jenkins-slave\maven-repositories\0\org\apache\brooklyn\brooklyn-rest-api\0.7.0-SNAPSHOT\brooklyn-rest-api-0.7.0-SNAPSHOT.jar
[INFO] Installing F:\jenkins\jenkins-slave\workspace\incubator-brooklyn-master-windows\usage\rest-api\pom.xml
to f:\jenkins\jenkins-slave\maven-repositories\0\org\apache\brooklyn\brooklyn-rest-api\0.7.0-SNAPSHOT\brooklyn-rest-api-0.7.0-SNAPSHOT.pom
[INFO] Installing F:\jenkins\jenkins-slave\workspace\incubator-brooklyn-master-windows\usage\rest-api\target\brooklyn-rest-api-0.7.0-SNAPSHOT-tests.jar
to f:\jenkins\jenkins-slave\maven-repositories\0\org\apache\brooklyn\brooklyn-rest-api\0.7.0-SNAPSHOT\brooklyn-rest-api-0.7.0-SNAPSHOT-tests.jar
[INFO] Installing F:\jenkins\jenkins-slave\workspace\incubator-brooklyn-master-windows\usage\rest-api\target\brooklyn-rest-api-0.7.0-SNAPSHOT-sources.jar
to f:\jenkins\jenkins-slave\maven-repositories\0\org\apache\brooklyn\brooklyn-rest-api\0.7.0-SNAPSHOT\brooklyn-rest-api-0.7.0-SNAPSHOT-sources.jar
[JENKINS] Archiving disabled
[INFO]                                                                         
[INFO] ------------------------------------------------------------------------
[INFO] Skipping Brooklyn REST Server
[INFO] This project has been banned from the build due to previous failures.
[INFO] ------------------------------------------------------------------------
[INFO]                                                                         
[INFO] ------------------------------------------------------------------------
[INFO] Skipping Brooklyn REST Client
[INFO] This project has been banned from the build due to previous failures.
[INFO] ------------------------------------------------------------------------
[INFO]                                                                         
[INFO] ------------------------------------------------------------------------
[INFO] Skipping Brooklyn REST JavaScript Web GUI
[INFO] This project has been banned from the build due to previous failures.
[INFO] ------------------------------------------------------------------------
[INFO]                                                                         
[INFO] ------------------------------------------------------------------------
[INFO] Skipping Brooklyn Launcher
[INFO] This project has been banned from the build due to previous failures.
[INFO] ------------------------------------------------------------------------
[INFO]                                                                         
[INFO] ------------------------------------------------------------------------
[INFO] Skipping Brooklyn Command Line Interface
[INFO] This project has been banned from the build due to previous failures.
[INFO] ------------------------------------------------------------------------
[INFO]                                                                         
[INFO] ------------------------------------------------------------------------
[INFO] Skipping Brooklyn All Things
[INFO] This project has been banned from the build due to previous failures.
[INFO] ------------------------------------------------------------------------
[INFO]                                                                         
[INFO] ------------------------------------------------------------------------
[INFO] Skipping Brooklyn Distribution
[INFO] This project has been banned from the build due to previous failures.
[INFO] ------------------------------------------------------------------------
[INFO]                                                                         
[INFO] ------------------------------------------------------------------------
[INFO] Skipping Brooklyn Simple Web Cluster Example
[INFO] This project has been banned from the build due to previous failures.
[INFO] ------------------------------------------------------------------------
[INFO]                                                                         
[INFO] ------------------------------------------------------------------------
[INFO] Skipping Brooklyn Global Web Fabric Example
[INFO] This project has been banned from the build due to previous failures.
[INFO] ------------------------------------------------------------------------
[INFO]                                                                         
[INFO] ------------------------------------------------------------------------
[INFO] Skipping Brooklyn Simple Messaging Publish-Subscribe Example
[INFO] This project has been banned from the build due to previous failures.
[INFO] ------------------------------------------------------------------------
[INFO]                                                                         
[INFO] ------------------------------------------------------------------------
[INFO] Skipping Brooklyn NoSQL Cluster Examples
[INFO] This project has been banned from the build due to previous failures.
[INFO] ------------------------------------------------------------------------
[INFO]                                                                         
[INFO] ------------------------------------------------------------------------
[INFO] Skipping Brooklyn QA
[INFO] This project has been banned from the build due to previous failures.
[INFO] ------------------------------------------------------------------------
[INFO] ------------------------------------------------------------------------
[INFO] Reactor Summary:
[INFO] 
[INFO] Brooklyn Parent Project ........................... SUCCESS [56.875s]
[INFO] Brooklyn Utilities to Support Testing (listeners etc)  SUCCESS [36.578s]
[INFO] Brooklyn Logback Includable Configuration ......... SUCCESS [6.953s]
[INFO] Brooklyn Common Utilities ......................... SUCCESS [52.103s]
[INFO] Brooklyn Groovy Utilities ......................... SUCCESS [11.344s]
[INFO] Brooklyn API ...................................... SUCCESS [7.563s]
[INFO] Brooklyn Test Support ............................. SUCCESS [14.985s]
[INFO] CAMP Server Parent Project ........................ SUCCESS [1.234s]
[INFO] CAMP Base ......................................... SUCCESS [17.609s]
[INFO] Brooklyn REST Swagger Apidoc Utilities ............ SUCCESS [23.500s]
[INFO] Brooklyn Logback Configuration .................... SUCCESS [2.281s]
[INFO] CAMP Server ....................................... SUCCESS [31.146s]
[INFO] Brooklyn Core ..................................... FAILURE [8:36.305s]
[INFO] Brooklyn Policies ................................. SKIPPED
[INFO] Brooklyn Hazelcast Storage ........................ SKIPPED
[INFO] Brooklyn Jclouds Location Targets ................. SKIPPED
[INFO] Brooklyn Secure JMXMP Agent ....................... SKIPPED
[INFO] Brooklyn JMX RMI Agent ............................ SUCCESS [2.493s]
[INFO] Brooklyn Software Base ............................ SKIPPED
[INFO] Brooklyn Network Software Entities ................ SKIPPED
[INFO] Brooklyn OSGi Software Entities ................... SKIPPED
[INFO] Brooklyn Web App Software Entities ................ SKIPPED
[INFO] Brooklyn Messaging Software Entities .............. SKIPPED
[INFO] Brooklyn Database Software Entities ............... SKIPPED
[INFO] Brooklyn NoSQL Data Store Software Entities ....... SKIPPED
[INFO] Brooklyn Monitoring Software Entities ............. SKIPPED
[INFO] Brooklyn CAMP REST API ............................ SKIPPED
[INFO] Brooklyn REST API ................................. SUCCESS [7.854s]
[INFO] Brooklyn REST Server .............................. SKIPPED
[INFO] Brooklyn REST Client .............................. SKIPPED
[INFO] Brooklyn REST JavaScript Web GUI .................. SKIPPED
[INFO] Brooklyn Launcher ................................. SKIPPED
[INFO] Brooklyn Command Line Interface ................... SKIPPED
[INFO] Brooklyn All Things ............................... SKIPPED
[INFO] Brooklyn Distribution ............................. SKIPPED
[INFO] Brooklyn Simple Web Cluster Example ............... SKIPPED
[INFO] Brooklyn Global Web Fabric Example ................ SKIPPED
[INFO] Brooklyn Simple Messaging Publish-Subscribe Example  SKIPPED
[INFO] Brooklyn NoSQL Cluster Examples ................... SKIPPED
[INFO] Brooklyn QA ....................................... SKIPPED
[INFO] ------------------------------------------------------------------------
[INFO] BUILD FAILURE
[INFO] ------------------------------------------------------------------------
[INFO] Total time: 13:27.162s
[INFO] Finished at: Tue Dec 23 03:57:54 PST 2014
[INFO] Final Memory: 41M/247M
[INFO] ------------------------------------------------------------------------
[JENKINS] Archiving disabled
[JENKINS] Archiving disabled
[JENKINS] Archiving disabled
[JENKINS] Archiving disabled
[JENKINS] Archiving disabled
[JENKINS] Archiving disabled
[JENKINS] Archiving disabled
[JENKINS] Archiving disabled
[JENKINS] Archiving disabled
[JENKINS] Archiving disabled
[JENKINS] Archiving disabled
[JENKINS] Archiving disabled
[JENKINS] Archiving disabled
[JENKINS] Archiving disabled
[JENKINS] Archiving disabled
[JENKINS] Archiving disabled
[JENKINS] Archiving disabled
[JENKINS] Archiving disabled
[JENKINS] Archiving disabled
[JENKINS] Archiving disabled
[JENKINS] Archiving disabled
[JENKINS] Archiving disabled
[JENKINS] Archiving disabled
[JENKINS] Archiving disabled
[JENKINS] Archiving disabled
[JENKINS] Archiving disabled
[JENKINS] Archiving disabled
[JENKINS] Archiving disabled
[JENKINS] Archiving disabled
[JENKINS] Archiving disabled
[JENKINS] Archiving disabled
[JENKINS] Archiving disabled
[JENKINS] Archiving disabled
[JENKINS] Archiving disabled
[JENKINS] Archiving disabled
[JENKINS] Archiving disabled
[JENKINS] Archiving disabled
[JENKINS] Archiving disabled
[JENKINS] Archiving disabled
[JENKINS] Archiving disabled
Waiting for Jenkins to finish collecting data
[ERROR] Failed to execute goal org.apache.maven.plugins:maven-surefire-plugin:2.18:test (default-test)
on project brooklyn-core: There are test failures.
[ERROR] 
[ERROR] Please refer to F:\jenkins\jenkins-slave\workspace\incubator-brooklyn-master-windows\core\target\surefire-reports
for the individual test results.
[ERROR] -> [Help 1]
[ERROR] 
[ERROR] To see the full stack trace of the errors, re-run Maven with the -e switch.
[ERROR] Re-run Maven using the -X switch to enable full debug logging.
[ERROR] 
[ERROR] For more information about the errors and possible solutions, please read the following
articles:
[ERROR] [Help 1] http://cwiki.apache.org/confluence/display/MAVEN/MojoFailureException
[ERROR] 
[ERROR] After correcting the problems, you can resume the build with the command
[ERROR]   mvn <goals> -rf :brooklyn-core
channel stopped

Mime
View raw message