brooklyn-dev mailing list archives

Site index · List index
Message view « Date » · « Thread »
Top « Date » · « Thread »
From Apache Jenkins Server <jenk...@builds.apache.org>
Subject Build failed in Jenkins: incubator-brooklyn-master-windows #106
Date Tue, 16 Dec 2014 00:33:21 GMT
See <https://builds.apache.org/job/incubator-brooklyn-master-windows/106/changes>

Changes:

[aled.sage] Adds AttributeSensor.persistenceMode

[aled.sage] BROOKLYN-102: Fix MongoDB rebind

------------------------------------------
[...truncated 19460 lines...]
2014-12-16 00:33:10,035 INFO  TESTNG INVOKING: "Surefire test" - brooklyn.rest.domain.EntitySpecTest.testDeserializeFromJSON()
2014-12-16 00:33:10,047 INFO  TESTNG PASSED: "Surefire test" - brooklyn.rest.domain.EntitySpecTest.testDeserializeFromJSON()
finished in 12 ms
2014-12-16 00:33:10,048 INFO  TESTNG INVOKING: "Surefire test" - brooklyn.rest.domain.EntitySpecTest.testDeserializeFromJSONOnlyWithType()
2014-12-16 00:33:10,056 INFO  TESTNG PASSED: "Surefire test" - brooklyn.rest.domain.EntitySpecTest.testDeserializeFromJSONOnlyWithType()
finished in 8 ms
2014-12-16 00:33:10,057 INFO  TESTNG INVOKING: "Surefire test" - brooklyn.rest.domain.EntitySpecTest.testSerializeToJSON()
2014-12-16 00:33:10,066 INFO  TESTNG PASSED: "Surefire test" - brooklyn.rest.domain.EntitySpecTest.testSerializeToJSON()
finished in 9 ms
2014-12-16 00:33:10,067 INFO  TESTNG INVOKING: "Surefire test" - brooklyn.rest.domain.EntitySummaryTest.testDeserializeFromJSON()
2014-12-16 00:33:10,077 INFO  TESTNG PASSED: "Surefire test" - brooklyn.rest.domain.EntitySummaryTest.testDeserializeFromJSON()
finished in 10 ms
2014-12-16 00:33:10,078 INFO  TESTNG INVOKING: "Surefire test" - brooklyn.rest.domain.EntitySummaryTest.testSerializeToJSON()
2014-12-16 00:33:10,096 INFO  TESTNG PASSED: "Surefire test" - brooklyn.rest.domain.EntitySummaryTest.testSerializeToJSON()
finished in 18 ms
2014-12-16 00:33:10,097 INFO  TESTNG INVOKING: "Surefire test" - brooklyn.rest.domain.LocationSpecTest.testDeserializeFromJSON()
2014-12-16 00:33:10,126 INFO  TESTNG PASSED: "Surefire test" - brooklyn.rest.domain.LocationSpecTest.testDeserializeFromJSON()
finished in 29 ms
2014-12-16 00:33:10,127 INFO  TESTNG INVOKING: "Surefire test" - brooklyn.rest.domain.LocationSpecTest.testDeserializeFromJSONWithNoCredential()
2014-12-16 00:33:10,138 INFO  TESTNG PASSED: "Surefire test" - brooklyn.rest.domain.LocationSpecTest.testDeserializeFromJSONWithNoCredential()
finished in 11 ms
2014-12-16 00:33:10,144 INFO  TESTNG INVOKING: "Surefire test" - brooklyn.rest.domain.LocationSpecTest.testSerializeToJSON()
2014-12-16 00:33:10,149 INFO  TESTNG PASSED: "Surefire test" - brooklyn.rest.domain.LocationSpecTest.testSerializeToJSON()
finished in 5 ms
2014-12-16 00:33:10,165 INFO  TESTNG 
===============================================
    Surefire test
    Tests run: 15, Failures: 0, Skips: 0
===============================================
2014-12-16 00:33:10,166 INFO  BrooklynLeakListener.onFinish attempting to terminate all extant
ManagementContexts: name=Surefire test; includedGroups=[]; excludedGroups=[Integration, Acceptance,
Live, WIP]; suiteName=Surefire suite; outDir=F:\hudson\hudson-slave\workspace\incubator-brooklyn-master-windows\usage\rest-api\target\surefire-reports\Surefire
suite: no brooklyn.management.internal.LocalManagementContext available, so skipped
Tests run: 15, Failures: 0, Errors: 0, Skipped: 0, Time elapsed: 1.391 sec - in TestSuite

Results :




Tests run: 15, Failures: 0, Errors: 0, Skipped: 0

[JENKINS] Recording test results
[INFO] 
[INFO] --- maven-jar-plugin:2.3.2:jar (default-jar) @ brooklyn-rest-api ---
[INFO] Building jar: F:\hudson\hudson-slave\workspace\incubator-brooklyn-master-windows\usage\rest-api\target\brooklyn-rest-api-0.7.0-SNAPSHOT.jar
[INFO] 
[INFO] --- maven-site-plugin:3.4:attach-descriptor (attach-descriptor) @ brooklyn-rest-api
---
[INFO] 
[INFO] --- maven-jar-plugin:2.3.2:test-jar (test-jar-creation) @ brooklyn-rest-api ---
[INFO] Building jar: F:\hudson\hudson-slave\workspace\incubator-brooklyn-master-windows\usage\rest-api\target\brooklyn-rest-api-0.7.0-SNAPSHOT-tests.jar
[INFO] 
[INFO] --- apache-rat-plugin:0.10:check (default) @ brooklyn-rest-api ---
[INFO] 51 implicit excludes (use -debug for more details).
[INFO] Exclude: sandbox/**
[INFO] Exclude: **/.git/**
[INFO] Exclude: **/.gitignore
[INFO] Exclude: **/.repository/**
[INFO] Exclude: **/.idea/**
[INFO] Exclude: **/*.iml
[INFO] Exclude: **/.classpath/**
[INFO] Exclude: **/.project
[INFO] Exclude: **/.settings/**
[INFO] Exclude: **/*.log
[INFO] Exclude: **/brooklyn*.log.*
[INFO] Exclude: **/target/**
[INFO] Exclude: ignored/**
[INFO] Exclude: LICENSE.md
[INFO] Exclude: **/MANIFEST.MF
[INFO] Exclude: **/test-output/**
[INFO] Exclude: **/*.pem.pub
[INFO] Exclude: **/*.svg
[INFO] Exclude: **/*.crt
[INFO] Exclude: **/*.csr
[INFO] Exclude: **/*.key
[INFO] Exclude: **/*.key.org
[INFO] Exclude: **/*.psd
[INFO] Exclude: **/*.json
[INFO] Exclude: **/*.plxarc
[INFO] Exclude: **/services/brooklyn.location.LocationResolver
[INFO] Exclude: **/src/test/resources/brooklyn/entity/basic/template_with_extra_substitutions.txt
[INFO] Exclude: **/src/main/resources/banner.txt
[INFO] Exclude: **/src/test/resources/ssl/certs/localhost/info.txt
[INFO] Exclude: **/sandbox/examples/src/main/scripts/amis.txt
[INFO] Exclude: docs/**
[INFO] 53 resources included (use -debug for more details)
[INFO] Rat check: Summary of files. Unapproved: 0 unknown: 0 generated: 0 approved: 53 licence.
[INFO] 
[INFO] --- maven-source-plugin:2.3:jar-no-fork (attach-sources) @ brooklyn-rest-api ---
[INFO] Building jar: F:\hudson\hudson-slave\workspace\incubator-brooklyn-master-windows\usage\rest-api\target\brooklyn-rest-api-0.7.0-SNAPSHOT-sources.jar
[INFO] 
[INFO] --- maven-install-plugin:2.5.1:install (default-install) @ brooklyn-rest-api ---
[INFO] Installing F:\hudson\hudson-slave\workspace\incubator-brooklyn-master-windows\usage\rest-api\target\brooklyn-rest-api-0.7.0-SNAPSHOT.jar
to f:\hudson\hudson-slave\maven-repositories\1\org\apache\brooklyn\brooklyn-rest-api\0.7.0-SNAPSHOT\brooklyn-rest-api-0.7.0-SNAPSHOT.jar
[INFO] Installing F:\hudson\hudson-slave\workspace\incubator-brooklyn-master-windows\usage\rest-api\pom.xml
to f:\hudson\hudson-slave\maven-repositories\1\org\apache\brooklyn\brooklyn-rest-api\0.7.0-SNAPSHOT\brooklyn-rest-api-0.7.0-SNAPSHOT.pom
[INFO] Installing F:\hudson\hudson-slave\workspace\incubator-brooklyn-master-windows\usage\rest-api\target\brooklyn-rest-api-0.7.0-SNAPSHOT-tests.jar
to f:\hudson\hudson-slave\maven-repositories\1\org\apache\brooklyn\brooklyn-rest-api\0.7.0-SNAPSHOT\brooklyn-rest-api-0.7.0-SNAPSHOT-tests.jar
[INFO] Installing F:\hudson\hudson-slave\workspace\incubator-brooklyn-master-windows\usage\rest-api\target\brooklyn-rest-api-0.7.0-SNAPSHOT-sources.jar
to f:\hudson\hudson-slave\maven-repositories\1\org\apache\brooklyn\brooklyn-rest-api\0.7.0-SNAPSHOT\brooklyn-rest-api-0.7.0-SNAPSHOT-sources.jar
[JENKINS] Archiving disabled
[INFO]                                                                         
[INFO] ------------------------------------------------------------------------
[INFO] Skipping Brooklyn REST Server
[INFO] This project has been banned from the build due to previous failures.
[INFO] ------------------------------------------------------------------------
[INFO]                                                                         
[INFO] ------------------------------------------------------------------------
[INFO] Skipping Brooklyn REST Client
[INFO] This project has been banned from the build due to previous failures.
[INFO] ------------------------------------------------------------------------
[INFO]                                                                         
[INFO] ------------------------------------------------------------------------
[INFO] Skipping Brooklyn REST JavaScript Web GUI
[INFO] This project has been banned from the build due to previous failures.
[INFO] ------------------------------------------------------------------------
[INFO]                                                                         
[INFO] ------------------------------------------------------------------------
[INFO] Skipping Brooklyn Launcher
[INFO] This project has been banned from the build due to previous failures.
[INFO] ------------------------------------------------------------------------
[INFO]                                                                         
[INFO] ------------------------------------------------------------------------
[INFO] Skipping Brooklyn Command Line Interface
[INFO] This project has been banned from the build due to previous failures.
[INFO] ------------------------------------------------------------------------
[INFO]                                                                         
[INFO] ------------------------------------------------------------------------
[INFO] Skipping Brooklyn All Things
[INFO] This project has been banned from the build due to previous failures.
[INFO] ------------------------------------------------------------------------
[INFO]                                                                         
[INFO] ------------------------------------------------------------------------
[INFO] Skipping Brooklyn Distribution
[INFO] This project has been banned from the build due to previous failures.
[INFO] ------------------------------------------------------------------------
[INFO]                                                                         
[INFO] ------------------------------------------------------------------------
[INFO] Skipping Brooklyn Simple Web Cluster Example
[INFO] This project has been banned from the build due to previous failures.
[INFO] ------------------------------------------------------------------------
[INFO]                                                                         
[INFO] ------------------------------------------------------------------------
[INFO] Skipping Brooklyn Global Web Fabric Example
[INFO] This project has been banned from the build due to previous failures.
[INFO] ------------------------------------------------------------------------
[INFO]                                                                         
[INFO] ------------------------------------------------------------------------
[INFO] Skipping Brooklyn Simple Messaging Publish-Subscribe Example
[INFO] This project has been banned from the build due to previous failures.
[INFO] ------------------------------------------------------------------------
[INFO]                                                                         
[INFO] ------------------------------------------------------------------------
[INFO] Skipping Brooklyn NoSQL Cluster Examples
[INFO] This project has been banned from the build due to previous failures.
[INFO] ------------------------------------------------------------------------
[INFO]                                                                         
[INFO] ------------------------------------------------------------------------
[INFO] Skipping Brooklyn QA
[INFO] This project has been banned from the build due to previous failures.
[INFO] ------------------------------------------------------------------------
[INFO] ------------------------------------------------------------------------
[INFO] Reactor Summary:
[INFO] 
[INFO] Brooklyn Parent Project ........................... SUCCESS [22.283s]
[INFO] Brooklyn Utilities to Support Testing (listeners etc)  SUCCESS [7.419s]
[INFO] Brooklyn Logback Includable Configuration ......... SUCCESS [1.383s]
[INFO] Brooklyn Common Utilities ......................... SUCCESS [17.275s]
[INFO] Brooklyn Groovy Utilities ......................... SUCCESS [6.784s]
[INFO] Brooklyn API ...................................... SUCCESS [4.004s]
[INFO] Brooklyn Test Support ............................. SUCCESS [4.083s]
[INFO] CAMP Server Parent Project ........................ SUCCESS [0.227s]
[INFO] CAMP Base ......................................... SUCCESS [4.645s]
[INFO] Brooklyn REST Swagger Apidoc Utilities ............ SUCCESS [3.733s]
[INFO] Brooklyn Logback Configuration .................... SUCCESS [0.458s]
[INFO] CAMP Server ....................................... SUCCESS [10.531s]
[INFO] Brooklyn Core ..................................... SUCCESS [3:17.586s]
[INFO] Brooklyn Policies ................................. SUCCESS [1:28.755s]
[INFO] Brooklyn Jclouds Location Targets ................. SUCCESS [38.466s]
[INFO] Brooklyn Secure JMXMP Agent ....................... SUCCESS [14.003s]
[INFO] Brooklyn JMX RMI Agent ............................ SUCCESS [1.826s]
[INFO] Brooklyn Software Base ............................ FAILURE [2:54.891s]
[INFO] Brooklyn Network Software Entities ................ SKIPPED
[INFO] Brooklyn OSGi Software Entities ................... SKIPPED
[INFO] Brooklyn Web App Software Entities ................ SKIPPED
[INFO] Brooklyn Messaging Software Entities .............. SKIPPED
[INFO] Brooklyn Database Software Entities ............... SKIPPED
[INFO] Brooklyn NoSQL Data Store Software Entities ....... SKIPPED
[INFO] Brooklyn Monitoring Software Entities ............. SKIPPED
[INFO] Brooklyn CAMP REST API ............................ SKIPPED
[INFO] Brooklyn REST API ................................. SUCCESS [7.522s]
[INFO] Brooklyn REST Server .............................. SKIPPED
[INFO] Brooklyn REST Client .............................. SKIPPED
[INFO] Brooklyn REST JavaScript Web GUI .................. SKIPPED
[INFO] Brooklyn Launcher ................................. SKIPPED
[INFO] Brooklyn Command Line Interface ................... SKIPPED
[INFO] Brooklyn All Things ............................... SKIPPED
[INFO] Brooklyn Distribution ............................. SKIPPED
[INFO] Brooklyn Simple Web Cluster Example ............... SKIPPED
[INFO] Brooklyn Global Web Fabric Example ................ SKIPPED
[INFO] Brooklyn Simple Messaging Publish-Subscribe Example  SKIPPED
[INFO] Brooklyn NoSQL Cluster Examples ................... SKIPPED
[INFO] Brooklyn QA ....................................... SKIPPED
[INFO] ------------------------------------------------------------------------
[INFO] BUILD FAILURE
[INFO] ------------------------------------------------------------------------
[INFO] Total time: 10:15.535s
[INFO] Finished at: Tue Dec 16 00:33:10 GMT 2014
[INFO] Final Memory: 49M/245M
[INFO] ------------------------------------------------------------------------
[JENKINS] Archiving disabled
[JENKINS] Archiving disabled
[JENKINS] Archiving disabled
[JENKINS] Archiving disabled
[JENKINS] Archiving disabled
[JENKINS] Archiving disabled
[JENKINS] Archiving disabled
[JENKINS] Archiving disabled
[JENKINS] Archiving disabled
[JENKINS] Archiving disabled
[JENKINS] Archiving disabled
[JENKINS] Archiving disabled
[JENKINS] Archiving disabled
[JENKINS] Archiving disabled
[JENKINS] Archiving disabled
[JENKINS] Archiving disabled
[JENKINS] Archiving disabled
[JENKINS] Archiving disabled
[JENKINS] Archiving disabled
[JENKINS] Archiving disabled
[JENKINS] Archiving disabled
[JENKINS] Archiving disabled
[JENKINS] Archiving disabled
[JENKINS] Archiving disabled
[JENKINS] Archiving disabled
[JENKINS] Archiving disabled
[JENKINS] Archiving disabled
[JENKINS] Archiving disabled
[JENKINS] Archiving disabled
[JENKINS] Archiving disabled
[JENKINS] Archiving disabled
[JENKINS] Archiving disabled
[JENKINS] Archiving disabled
[JENKINS] Archiving disabled
[JENKINS] Archiving disabled
[JENKINS] Archiving disabled
[JENKINS] Archiving disabled
[JENKINS] Archiving disabled
[JENKINS] Archiving disabled
Waiting for Jenkins to finish collecting data
[ERROR] Failed to execute goal org.apache.maven.plugins:maven-surefire-plugin:2.18:test (default-test)
on project brooklyn-software-base: There are test failures.
[ERROR] 
[ERROR] Please refer to F:\hudson\hudson-slave\workspace\incubator-brooklyn-master-windows\software\base\target\surefire-reports
for the individual test results.
[ERROR] -> [Help 1]
[ERROR] 
[ERROR] To see the full stack trace of the errors, re-run Maven with the -e switch.
[ERROR] Re-run Maven using the -X switch to enable full debug logging.
[ERROR] 
[ERROR] For more information about the errors and possible solutions, please read the following
articles:
[ERROR] [Help 1] http://cwiki.apache.org/confluence/display/MAVEN/MojoFailureException
[ERROR] 
[ERROR] After correcting the problems, you can resume the build with the command
[ERROR]   mvn <goals> -rf :brooklyn-software-base
channel stopped

Mime
View raw message