brooklyn-dev mailing list archives

Site index · List index
Message view « Date » · « Thread »
Top « Date » · « Thread »
From Apache Jenkins Server <jenk...@builds.apache.org>
Subject Build failed in Jenkins: incubator-brooklyn-master-windows #72
Date Sat, 15 Nov 2014 01:51:13 GMT
See <https://builds.apache.org/job/incubator-brooklyn-master-windows/72/changes>

Changes:

[svetoslav.neykov] Catalog item comparator - implement custom

[svetoslav.neykov] Fix NPE on creating entities with no explicit location

------------------------------------------
[...truncated 22321 lines...]
2014-11-14 17:50:28,220 INFO  TESTNG INVOKING CONFIGURATION: "Surefire test" - @BeforeMethod
brooklyn.entity.basic.SoftwareProcessEntityTest.setUp()
2014-11-14 17:50:28,233 INFO  TESTNG PASSED CONFIGURATION: "Surefire test" - @BeforeMethod
brooklyn.entity.basic.SoftwareProcessEntityTest.setUp() finished in 13 ms
2014-11-14 17:50:28,234 INFO  TESTNG INVOKING: "Surefire test" - brooklyn.entity.basic.SoftwareProcessEntityTest.testShutdownIsIdempotent()
2014-11-14 17:50:28,251 INFO  Starting MyServiceImpl{id=kqaxfZsF}, obtaining a new location
instance in FixedListMachineProvisioningLocation{id=dyAKzQZ3, name=FixedListMachineProvisioningLocation:dyAK}
with ports [22]
2014-11-14 17:50:28,252 INFO  Starting MyServiceImpl{id=kqaxfZsF} on machine SshMachineLocation[SshMachineLocation:L314:localhost/127.0.0.1]
2014-11-14 17:50:28,359 INFO  Stopping MyServiceImpl{id=kqaxfZsF} in [SshMachineLocation[SshMachineLocation:L314:localhost/127.0.0.1]]
2014-11-14 17:50:28,593 INFO  Stopping MyServiceImpl{id=kqaxfZsF} in []
2014-11-14 17:50:28,594 INFO  TESTNG PASSED: "Surefire test" - brooklyn.entity.basic.SoftwareProcessEntityTest.testShutdownIsIdempotent()
finished in 361 ms
2014-11-14 17:50:28,594 INFO  TESTNG INVOKING CONFIGURATION: "Surefire test" - @AfterMethod
brooklyn.entity.BrooklynAppUnitTestSupport.tearDown()
2014-11-14 17:50:28,597 INFO  Stopping MyServiceImpl{id=kqaxfZsF} in []
2014-11-14 17:50:28,599 INFO  TESTNG PASSED CONFIGURATION: "Surefire test" - @AfterMethod
brooklyn.entity.BrooklynAppUnitTestSupport.tearDown() finished in 5 ms
2014-11-14 17:50:28,599 INFO  TESTNG INVOKING CONFIGURATION: "Surefire test" - @BeforeMethod
brooklyn.management.usage.UsageListenerTest.setUp()
2014-11-14 17:50:28,599 INFO  TESTNG PASSED CONFIGURATION: "Surefire test" - @BeforeMethod
brooklyn.management.usage.UsageListenerTest.setUp() finished in 0 ms
2014-11-14 17:50:28,599 INFO  TESTNG INVOKING: "Surefire test" - brooklyn.management.usage.UsageListenerTest.testAddUsageListenerViaProperties()
2014-11-14 17:50:28,631 INFO  TESTNG PASSED: "Surefire test" - brooklyn.management.usage.UsageListenerTest.testAddUsageListenerViaProperties()
finished in 32 ms
2014-11-14 17:50:28,632 INFO  TESTNG INVOKING CONFIGURATION: "Surefire test" - @AfterMethod
brooklyn.management.usage.UsageListenerTest.tearDown()
2014-11-14 17:50:28,824 INFO  TESTNG PASSED CONFIGURATION: "Surefire test" - @AfterMethod
brooklyn.management.usage.UsageListenerTest.tearDown() finished in 192 ms
2014-11-14 17:50:28,850 INFO  TESTNG 
===============================================
    Surefire test
    Tests run: 93, Failures: 1, Skips: 0
===============================================
[GC 262684K->42306K(760256K), 0.0097557 secs]
2014-11-14 17:50:29,078 WARN  Task Task[LSM.publish(Application[XrtoSzDZ].Sensor: entity.children.removed
(brooklyn.entity.Entity)=MyServiceImpl{id=D1JjVRLP} @ 1416016228219);[subscription-delivery-entity-XrtoSzDZ[Application[XrtoSzDZ]]]:DRBUcW9o]
is being finalized before completion
2014-11-14 17:50:29,078 WARN  Task Task[LSM.publish(Application[XrtoSzDZ].Sensor: service.state.expected
(brooklyn.entity.basic.Lifecycle$Transition)=stopped @ 1416016228218 / Fri Nov 14 17:50:28
PST 2014 @ 1416016228218);[subscription-delivery-entity-XrtoSzDZ[Application[XrtoSzDZ]]]:F9LOnIvr]
is being finalized before completion
2014-11-14 17:50:29,078 WARN  Task Task[LSM.publish(MyServiceImpl{id=D1JjVRLP}.Sensor: service.state
(brooklyn.entity.basic.Lifecycle)=stopped @ 1416016228218);[subscription-delivery-entity-XrtoSzDZ[Application[XrtoSzDZ]]]:ClaTGvNL]
is being finalized before completion
2014-11-14 17:50:29,078 WARN  Task Task[LSM.publish(MyServiceImpl{id=D1JjVRLP}.Sensor: service.state.expected
(brooklyn.entity.basic.Lifecycle$Transition)=stopped @ 1416016228218 / Fri Nov 14 17:50:28
PST 2014 @ 1416016228218);[subscription-delivery-entity-D1JjVRLP[MyServiceImpl{id=D1JjVRLP}]]:awSy4itO]
is being finalized before completion
2014-11-14 17:50:29,079 WARN  Task Task[LSM.publish(MyServiceImpl{id=D1JjVRLP}.Sensor: service.isUp
(java.lang.Boolean)=false @ 1416016228218);[subscription-delivery-entity-XrtoSzDZ[Application[XrtoSzDZ]]]:TPsE60sB]
is being finalized before completion
2014-11-14 17:50:29,079 WARN  Task Task[LSM.publish(MyServiceImpl{id=D1JjVRLP}.Sensor: service.isUp
(java.lang.Boolean)=false @ 1416016228218);[subscription-delivery-entity-D1JjVRLP[MyServiceImpl{id=D1JjVRLP}]]:yhRUv0Lf]
is being finalized before completion
2014-11-14 17:50:29,079 WARN  Task Task[LSM.publish(MyServiceImpl{id=D1JjVRLP}.Sensor: service.isUp
(java.lang.Boolean)=false @ 1416016228212);[subscription-delivery-entity-XrtoSzDZ[Application[XrtoSzDZ]]]:C2qmdACA]
is being finalized before completion
2014-11-14 17:50:29,079 WARN  Task[post-launch:CYUQba1Q] was never submitted; did the code
create it and forget to run it? ('cancel' the task to suppress this message)
2014-11-14 17:50:29,079 WARN  Task[launch:kZXiRe0E] was never submitted; did the code create
it and forget to run it? ('cancel' the task to suppress this message)
2014-11-14 17:50:29,079 WARN  Task[copy-runtime-resources:XHIVUdmz] was never submitted; did
the code create it and forget to run it? ('cancel' the task to suppress this message)
2014-11-14 17:50:29,080 WARN  Task[customize:ISwKW1eD] was never submitted; did the code create
it and forget to run it? ('cancel' the task to suppress this message)
2014-11-14 17:50:29,080 WARN  Task[post-start:uM67Y39c] was never submitted; did the code
create it and forget to run it? ('cancel' the task to suppress this message)
Tests run: 93, Failures: 1, Errors: 0, Skipped: 0, Time elapsed: 54.913 sec <<< FAILURE!
- in TestSuite
testUsageIncludesStartAndStopEvents(brooklyn.management.usage.ApplicationUsageTrackingTest)
 Time elapsed: 0.487 sec  <<< FAILURE!
java.lang.AssertionError: for destroyed: event=2014-11-14 17:49:40.447(1416016180447); pre=2014-11-14
17:49:40.830 (1416016180830); post=2014-11-14 17:49:40.830 (1416016180830)
	at org.testng.Assert.fail(Assert.java:94)
	at brooklyn.management.usage.ApplicationUsageTrackingTest.assertApplicationEvent(ApplicationUsageTrackingTest.java:174)
	at brooklyn.management.usage.ApplicationUsageTrackingTest.testUsageIncludesStartAndStopEvents(ApplicationUsageTrackingTest.java:156)


Results :

Failed tests: 
  ApplicationUsageTrackingTest.testUsageIncludesStartAndStopEvents:156->assertApplicationEvent:174
for destroyed: event=2014-11-14 17:49:40.447(1416016180447); pre=2014-11-14 17:49:40.830 (1416016180830);
post=2014-11-14 17:49:40.830 (1416016180830)



Tests run: 93, Failures: 1, Errors: 0, Skipped: 0

[JENKINS] Recording test results
[JENKINS] Archiving disabled
[INFO]                                                                         
[INFO] ------------------------------------------------------------------------
[INFO] Skipping Brooklyn Network Software Entities
[INFO] This project has been banned from the build due to previous failures.
[INFO] ------------------------------------------------------------------------
[INFO]                                                                         
[INFO] ------------------------------------------------------------------------
[INFO] Skipping Brooklyn OSGi Software Entities
[INFO] This project has been banned from the build due to previous failures.
[INFO] ------------------------------------------------------------------------
[INFO]                                                                         
[INFO] ------------------------------------------------------------------------
[INFO] Skipping Brooklyn Web App Software Entities
[INFO] This project has been banned from the build due to previous failures.
[INFO] ------------------------------------------------------------------------
[INFO]                                                                         
[INFO] ------------------------------------------------------------------------
[INFO] Skipping Brooklyn Messaging Software Entities
[INFO] This project has been banned from the build due to previous failures.
[INFO] ------------------------------------------------------------------------
[INFO]                                                                         
[INFO] ------------------------------------------------------------------------
[INFO] Skipping Brooklyn Database Software Entities
[INFO] This project has been banned from the build due to previous failures.
[INFO] ------------------------------------------------------------------------
[INFO]                                                                         
[INFO] ------------------------------------------------------------------------
[INFO] Skipping Brooklyn NoSQL Data Store Software Entities
[INFO] This project has been banned from the build due to previous failures.
[INFO] ------------------------------------------------------------------------
[INFO]                                                                         
[INFO] ------------------------------------------------------------------------
[INFO] Skipping Brooklyn Monitoring Software Entities
[INFO] This project has been banned from the build due to previous failures.
[INFO] ------------------------------------------------------------------------
[INFO]                                                                         
[INFO] ------------------------------------------------------------------------
[INFO] Skipping Brooklyn CAMP REST API
[INFO] This project has been banned from the build due to previous failures.
[INFO] ------------------------------------------------------------------------
[INFO]                                                                         
[INFO] ------------------------------------------------------------------------
[INFO] Skipping Brooklyn REST Server
[INFO] This project has been banned from the build due to previous failures.
[INFO] ------------------------------------------------------------------------
[INFO]                                                                         
[INFO] ------------------------------------------------------------------------
[INFO] Skipping Brooklyn REST Client
[INFO] This project has been banned from the build due to previous failures.
[INFO] ------------------------------------------------------------------------
[INFO]                                                                         
[INFO] ------------------------------------------------------------------------
[INFO] Skipping Brooklyn REST JavaScript Web GUI
[INFO] This project has been banned from the build due to previous failures.
[INFO] ------------------------------------------------------------------------
[INFO]                                                                         
[INFO] ------------------------------------------------------------------------
[INFO] Skipping Brooklyn Launcher
[INFO] This project has been banned from the build due to previous failures.
[INFO] ------------------------------------------------------------------------
[INFO]                                                                         
[INFO] ------------------------------------------------------------------------
[INFO] Skipping Brooklyn Command Line Interface
[INFO] This project has been banned from the build due to previous failures.
[INFO] ------------------------------------------------------------------------
[INFO]                                                                         
[INFO] ------------------------------------------------------------------------
[INFO] Skipping Brooklyn All Things
[INFO] This project has been banned from the build due to previous failures.
[INFO] ------------------------------------------------------------------------
[INFO]                                                                         
[INFO] ------------------------------------------------------------------------
[INFO] Skipping Brooklyn Distribution
[INFO] This project has been banned from the build due to previous failures.
[INFO] ------------------------------------------------------------------------
[INFO]                                                                         
[INFO] ------------------------------------------------------------------------
[INFO] Skipping Brooklyn Simple Web Cluster Example
[INFO] This project has been banned from the build due to previous failures.
[INFO] ------------------------------------------------------------------------
[INFO]                                                                         
[INFO] ------------------------------------------------------------------------
[INFO] Skipping Brooklyn Global Web Fabric Example
[INFO] This project has been banned from the build due to previous failures.
[INFO] ------------------------------------------------------------------------
[INFO]                                                                         
[INFO] ------------------------------------------------------------------------
[INFO] Skipping Brooklyn Simple Messaging Publish-Subscribe Example
[INFO] This project has been banned from the build due to previous failures.
[INFO] ------------------------------------------------------------------------
[INFO]                                                                         
[INFO] ------------------------------------------------------------------------
[INFO] Skipping Brooklyn NoSQL Cluster Examples
[INFO] This project has been banned from the build due to previous failures.
[INFO] ------------------------------------------------------------------------
[INFO]                                                                         
[INFO] ------------------------------------------------------------------------
[INFO] Skipping Brooklyn QA
[INFO] This project has been banned from the build due to previous failures.
[INFO] ------------------------------------------------------------------------
[INFO] ------------------------------------------------------------------------
[INFO] Reactor Summary:
[INFO] 
[INFO] Brooklyn Parent Project ........................... SUCCESS [24.516s]
[INFO] Brooklyn Utilities to Support Testing (listeners etc)  SUCCESS [21.453s]
[INFO] Brooklyn Logback Includable Configuration ......... SUCCESS [2.750s]
[INFO] Brooklyn Common Utilities ......................... SUCCESS [50.791s]
[INFO] Brooklyn Groovy Utilities ......................... SUCCESS [11.449s]
[INFO] Brooklyn API ...................................... SUCCESS [11.403s]
[INFO] Brooklyn Test Support ............................. SUCCESS [9.557s]
[INFO] CAMP Server Parent Project ........................ SUCCESS [2.344s]
[INFO] CAMP Base ......................................... SUCCESS [11.554s]
[INFO] Brooklyn Core ..................................... SUCCESS [4:17.993s]
[INFO] Brooklyn Policies ................................. SUCCESS [2:17.960s]
[INFO] Brooklyn Jclouds Location Targets ................. SUCCESS [59.985s]
[INFO] Brooklyn Secure JMXMP Agent ....................... SUCCESS [21.249s]
[INFO] Brooklyn JMX RMI Agent ............................ SUCCESS [5.705s]
[INFO] Brooklyn Software Base ............................ FAILURE [1:23.924s]
[INFO] Brooklyn Network Software Entities ................ SKIPPED
[INFO] Brooklyn OSGi Software Entities ................... SKIPPED
[INFO] Brooklyn Web App Software Entities ................ SKIPPED
[INFO] Brooklyn Messaging Software Entities .............. SKIPPED
[INFO] Brooklyn Database Software Entities ............... SKIPPED
[INFO] Brooklyn NoSQL Data Store Software Entities ....... SKIPPED
[INFO] Brooklyn Monitoring Software Entities ............. SKIPPED
[INFO] Brooklyn CAMP REST API ............................ SKIPPED
[INFO] Brooklyn REST Server .............................. SKIPPED
[INFO] Brooklyn REST Client .............................. SKIPPED
[INFO] Brooklyn REST JavaScript Web GUI .................. SKIPPED
[INFO] Brooklyn Launcher ................................. SKIPPED
[INFO] Brooklyn Command Line Interface ................... SKIPPED
[INFO] Brooklyn All Things ............................... SKIPPED
[INFO] Brooklyn Distribution ............................. SKIPPED
[INFO] Brooklyn Simple Web Cluster Example ............... SKIPPED
[INFO] Brooklyn Global Web Fabric Example ................ SKIPPED
[INFO] Brooklyn Simple Messaging Publish-Subscribe Example  SKIPPED
[INFO] Brooklyn NoSQL Cluster Examples ................... SKIPPED
[INFO] Brooklyn QA ....................................... SKIPPED
[INFO] ------------------------------------------------------------------------
[INFO] BUILD FAILURE
[INFO] ------------------------------------------------------------------------
[INFO] Total time: 12:10.883s
[INFO] Finished at: Fri Nov 14 17:50:31 PST 2014
[INFO] Final Memory: 47M/247M
[INFO] ------------------------------------------------------------------------
[JENKINS] Archiving disabled
[JENKINS] Archiving disabled
[JENKINS] Archiving disabled
[JENKINS] Archiving disabled
[JENKINS] Archiving disabled
[JENKINS] Archiving disabled
[JENKINS] Archiving disabled
[JENKINS] Archiving disabled
[JENKINS] Archiving disabled
[JENKINS] Archiving disabled
[JENKINS] Archiving disabled
[JENKINS] Archiving disabled
[JENKINS] Archiving disabled
[JENKINS] Archiving disabled
[JENKINS] Archiving disabled
[JENKINS] Archiving disabled
[JENKINS] Archiving disabled
[JENKINS] Archiving disabled
[JENKINS] Archiving disabled
[JENKINS] Archiving disabled
[JENKINS] Archiving disabled
[JENKINS] Archiving disabled
[JENKINS] Archiving disabled
[JENKINS] Archiving disabled
[JENKINS] Archiving disabled
[JENKINS] Archiving disabled
[JENKINS] Archiving disabled
[JENKINS] Archiving disabled
[JENKINS] Archiving disabled
[JENKINS] Archiving disabled
[JENKINS] Archiving disabled
[JENKINS] Archiving disabled
[JENKINS] Archiving disabled
[JENKINS] Archiving disabled
[JENKINS] Archiving disabled
Waiting for Jenkins to finish collecting data
[ERROR] Failed to execute goal org.apache.maven.plugins:maven-surefire-plugin:2.18:test (default-test)
on project brooklyn-software-base: There are test failures.
[ERROR] 
[ERROR] Please refer to F:\jenkins\jenkins-slave\workspace\incubator-brooklyn-master-windows\software\base\target\surefire-reports
for the individual test results.
[ERROR] -> [Help 1]
[ERROR] 
[ERROR] To see the full stack trace of the errors, re-run Maven with the -e switch.
[ERROR] Re-run Maven using the -X switch to enable full debug logging.
[ERROR] 
[ERROR] For more information about the errors and possible solutions, please read the following
articles:
[ERROR] [Help 1] http://cwiki.apache.org/confluence/display/MAVEN/MojoFailureException
[ERROR] 
[ERROR] After correcting the problems, you can resume the build with the command
[ERROR]   mvn <goals> -rf :brooklyn-software-base
channel stopped

Mime
View raw message