brooklyn-dev mailing list archives

Site index · List index
Message view « Date » · « Thread »
Top « Date » · « Thread »
From Apache Jenkins Server <jenk...@builds.apache.org>
Subject Build failed in Jenkins: incubator-brooklyn-master-windows #33
Date Wed, 29 Oct 2014 16:59:54 GMT
See <https://builds.apache.org/job/incubator-brooklyn-master-windows/33/changes>

Changes:

[aled.sage] Fix typos in chef-blueprints.md

[aled.sage] Entities.waitForServiceUp: use finally block

[splodge] Configure JMX bits early enough to allow subsequent registration of required mbeans

[aled.sage] Adds MutableList.builder.addAll(V[])

[aled.sage] Fix BrooklynNode.stop

[aled.sage] Fix ElasticSearch test

[aled.sage] Fix RedisIntegrationTest

------------------------------------------
[...truncated 22595 lines...]
	at brooklyn.util.task.DynamicSequentialTask$DstJob.call(DynamicSequentialTask.java:323)
	at brooklyn.util.task.BasicExecutionManager$SubmissionCallable.call(BasicExecutionManager.java:469)
	at java.util.concurrent.FutureTask$Sync.innerRun(FutureTask.java:303)
	at java.util.concurrent.FutureTask.run(FutureTask.java:138)
	at java.util.concurrent.ThreadPoolExecutor$Worker.runTask(ThreadPoolExecutor.java:886)
	at java.util.concurrent.ThreadPoolExecutor$Worker.run(ThreadPoolExecutor.java:908)
	at java.lang.Thread.run(Thread.java:662)
Caused by: java.util.concurrent.ExecutionException: java.lang.IllegalStateException: Timeout
waiting for SERVICE_UP from MyServiceImpl{id=moGkfDS5}
	at java.util.concurrent.FutureTask$Sync.innerGet(FutureTask.java:222)
	at java.util.concurrent.FutureTask.get(FutureTask.java:83)
	at com.google.common.util.concurrent.ForwardingFuture.get(ForwardingFuture.java:63)
	at brooklyn.util.task.BasicTask.get(BasicTask.java:343)
	at brooklyn.util.task.BasicTask.getUnchecked(BasicTask.java:352)
	at brooklyn.util.task.DynamicSequentialTask.drain(DynamicSequentialTask.java:451)
	at brooklyn.util.task.DynamicTasks.drain(DynamicTasks.java:314)
	at brooklyn.util.task.DynamicTasks.waitForLast(DynamicTasks.java:303)
	at brooklyn.entity.software.MachineLifecycleEffectorTasks.start(MachineLifecycleEffectorTasks.java:219)
	at brooklyn.entity.software.MachineLifecycleEffectorTasks$1.call(MachineLifecycleEffectorTasks.java:156)
	at brooklyn.entity.software.MachineLifecycleEffectorTasks$1.call(MachineLifecycleEffectorTasks.java:1)
	at brooklyn.entity.effector.EffectorTasks$EffectorBodyTaskFactory$1.call(EffectorTasks.java:81)
	at brooklyn.util.task.DynamicSequentialTask$DstJob.call(DynamicSequentialTask.java:323)
	at brooklyn.util.task.BasicExecutionManager$SubmissionCallable.call(BasicExecutionManager.java:469)
	at java.util.concurrent.FutureTask$Sync.innerRun(FutureTask.java:303)
	at java.util.concurrent.FutureTask.run(FutureTask.java:138)
	at java.util.concurrent.ThreadPoolExecutor$Worker.runTask(ThreadPoolExecutor.java:886)
	at java.util.concurrent.ThreadPoolExecutor$Worker.run(ThreadPoolExecutor.java:908)
	at java.lang.Thread.run(Thread.java:662)
Caused by: java.lang.IllegalStateException: Timeout waiting for SERVICE_UP from MyServiceImpl{id=moGkfDS5}
	at brooklyn.entity.basic.Entities.waitForServiceUp(Entities.java:1012)
	at brooklyn.entity.basic.SoftwareProcessImpl.waitForServiceUp(SoftwareProcessImpl.java:317)
	at brooklyn.entity.basic.SoftwareProcessImpl.waitForServiceUp(SoftwareProcessImpl.java:314)
	at brooklyn.entity.basic.SoftwareProcessDriverLifecycleEffectorTasks.postStartCustom(SoftwareProcessDriverLifecycleEffectorTasks.java:160)
	at brooklyn.entity.software.MachineLifecycleEffectorTasks$7.run(MachineLifecycleEffectorTasks.java:414)
	at java.util.concurrent.Executors$RunnableAdapter.call(Executors.java:441)
	at brooklyn.util.task.DynamicSequentialTask$DstJob.call(DynamicSequentialTask.java:323)
	at brooklyn.util.task.BasicExecutionManager$SubmissionCallable.call(BasicExecutionManager.java:469)
	at java.util.concurrent.FutureTask$Sync.innerRun(FutureTask.java:303)
	at java.util.concurrent.FutureTask.run(FutureTask.java:138)
	at java.util.concurrent.ThreadPoolExecutor$Worker.runTask(ThreadPoolExecutor.java:886)
	at java.util.concurrent.ThreadPoolExecutor$Worker.run(ThreadPoolExecutor.java:908)
	at java.lang.Thread.run(Thread.java:662)


Results :

Failed tests: 
  SoftwareProcessEntityTest.testSetsMachineAttributes:86 ยป PropagatedRuntime 

Tests run: 86, Failures: 1, Errors: 0, Skipped: 0

[JENKINS] Recording test results
[JENKINS] Archiving disabled
[INFO]                                                                         
[INFO] ------------------------------------------------------------------------
[INFO] Skipping Brooklyn Network Software Entities
[INFO] This project has been banned from the build due to previous failures.
[INFO] ------------------------------------------------------------------------
[INFO]                                                                         
[INFO] ------------------------------------------------------------------------
[INFO] Skipping Brooklyn OSGi Software Entities
[INFO] This project has been banned from the build due to previous failures.
[INFO] ------------------------------------------------------------------------
[INFO]                                                                         
[INFO] ------------------------------------------------------------------------
[INFO] Skipping Brooklyn Web App Software Entities
[INFO] This project has been banned from the build due to previous failures.
[INFO] ------------------------------------------------------------------------
[INFO]                                                                         
[INFO] ------------------------------------------------------------------------
[INFO] Skipping Brooklyn Messaging Software Entities
[INFO] This project has been banned from the build due to previous failures.
[INFO] ------------------------------------------------------------------------
[INFO]                                                                         
[INFO] ------------------------------------------------------------------------
[INFO] Skipping Brooklyn Database Software Entities
[INFO] This project has been banned from the build due to previous failures.
[INFO] ------------------------------------------------------------------------
[INFO]                                                                         
[INFO] ------------------------------------------------------------------------
[INFO] Skipping Brooklyn NoSQL Data Store Software Entities
[INFO] This project has been banned from the build due to previous failures.
[INFO] ------------------------------------------------------------------------
[INFO]                                                                         
[INFO] ------------------------------------------------------------------------
[INFO] Skipping Brooklyn Monitoring Software Entities
[INFO] This project has been banned from the build due to previous failures.
[INFO] ------------------------------------------------------------------------
[INFO]                                                                         
[INFO] ------------------------------------------------------------------------
[INFO] Skipping Brooklyn CAMP REST API
[INFO] This project has been banned from the build due to previous failures.
[INFO] ------------------------------------------------------------------------
[INFO]                                                                         
[INFO] ------------------------------------------------------------------------
[INFO] Skipping Brooklyn REST Server
[INFO] This project has been banned from the build due to previous failures.
[INFO] ------------------------------------------------------------------------
[INFO]                                                                         
[INFO] ------------------------------------------------------------------------
[INFO] Skipping Brooklyn REST Client
[INFO] This project has been banned from the build due to previous failures.
[INFO] ------------------------------------------------------------------------
[INFO]                                                                         
[INFO] ------------------------------------------------------------------------
[INFO] Skipping Brooklyn REST JavaScript Web GUI
[INFO] This project has been banned from the build due to previous failures.
[INFO] ------------------------------------------------------------------------
[INFO]                                                                         
[INFO] ------------------------------------------------------------------------
[INFO] Skipping Brooklyn Launcher
[INFO] This project has been banned from the build due to previous failures.
[INFO] ------------------------------------------------------------------------
[INFO]                                                                         
[INFO] ------------------------------------------------------------------------
[INFO] Skipping Brooklyn Command Line Interface
[INFO] This project has been banned from the build due to previous failures.
[INFO] ------------------------------------------------------------------------
[INFO]                                                                         
[INFO] ------------------------------------------------------------------------
[INFO] Skipping Brooklyn All Things
[INFO] This project has been banned from the build due to previous failures.
[INFO] ------------------------------------------------------------------------
[INFO]                                                                         
[INFO] ------------------------------------------------------------------------
[INFO] Skipping Brooklyn Distribution
[INFO] This project has been banned from the build due to previous failures.
[INFO] ------------------------------------------------------------------------
[INFO]                                                                         
[INFO] ------------------------------------------------------------------------
[INFO] Skipping Brooklyn Simple Web Cluster Example
[INFO] This project has been banned from the build due to previous failures.
[INFO] ------------------------------------------------------------------------
[INFO]                                                                         
[INFO] ------------------------------------------------------------------------
[INFO] Skipping Brooklyn Global Web Fabric Example
[INFO] This project has been banned from the build due to previous failures.
[INFO] ------------------------------------------------------------------------
[INFO]                                                                         
[INFO] ------------------------------------------------------------------------
[INFO] Skipping Brooklyn Simple Messaging Publish-Subscribe Example
[INFO] This project has been banned from the build due to previous failures.
[INFO] ------------------------------------------------------------------------
[INFO]                                                                         
[INFO] ------------------------------------------------------------------------
[INFO] Skipping Brooklyn NoSQL Cluster Examples
[INFO] This project has been banned from the build due to previous failures.
[INFO] ------------------------------------------------------------------------
[INFO]                                                                         
[INFO] ------------------------------------------------------------------------
[INFO] Skipping Brooklyn QA
[INFO] This project has been banned from the build due to previous failures.
[INFO] ------------------------------------------------------------------------
[INFO] ------------------------------------------------------------------------
[INFO] Reactor Summary:
[INFO] 
[INFO] Brooklyn Parent Project ........................... SUCCESS [23.871s]
[INFO] Brooklyn Utilities to Support Testing (listeners etc)  SUCCESS [17.613s]
[INFO] Brooklyn Logback Includable Configuration ......... SUCCESS [2.230s]
[INFO] Brooklyn Common Utilities ......................... SUCCESS [33.759s]
[INFO] Brooklyn Groovy Utilities ......................... SUCCESS [11.085s]
[INFO] Brooklyn API ...................................... SUCCESS [6.210s]
[INFO] Brooklyn Test Support ............................. SUCCESS [6.542s]
[INFO] CAMP Server Parent Project ........................ SUCCESS [0.198s]
[INFO] CAMP Base ......................................... SUCCESS [8.720s]
[INFO] Brooklyn Core ..................................... SUCCESS [4:18.237s]
[INFO] Brooklyn Policies ................................. SUCCESS [4:20.708s]
[INFO] Brooklyn Hazelcast Storage ........................ SUCCESS [8.533s]
[INFO] Brooklyn Jclouds Location Targets ................. SUCCESS [54.163s]
[INFO] Brooklyn Secure JMXMP Agent ....................... SUCCESS [21.539s]
[INFO] Brooklyn JMX RMI Agent ............................ SUCCESS [4.575s]
[INFO] Brooklyn Software Base ............................ FAILURE [3:13.221s]
[INFO] Brooklyn Network Software Entities ................ SKIPPED
[INFO] Brooklyn OSGi Software Entities ................... SKIPPED
[INFO] Brooklyn Web App Software Entities ................ SKIPPED
[INFO] Brooklyn Messaging Software Entities .............. SKIPPED
[INFO] Brooklyn Database Software Entities ............... SKIPPED
[INFO] Brooklyn NoSQL Data Store Software Entities ....... SKIPPED
[INFO] Brooklyn Monitoring Software Entities ............. SKIPPED
[INFO] Brooklyn CAMP REST API ............................ SKIPPED
[INFO] Brooklyn REST Server .............................. SKIPPED
[INFO] Brooklyn REST Client .............................. SKIPPED
[INFO] Brooklyn REST JavaScript Web GUI .................. SKIPPED
[INFO] Brooklyn Launcher ................................. SKIPPED
[INFO] Brooklyn Command Line Interface ................... SKIPPED
[INFO] Brooklyn All Things ............................... SKIPPED
[INFO] Brooklyn Distribution ............................. SKIPPED
[INFO] Brooklyn Simple Web Cluster Example ............... SKIPPED
[INFO] Brooklyn Global Web Fabric Example ................ SKIPPED
[INFO] Brooklyn Simple Messaging Publish-Subscribe Example  SKIPPED
[INFO] Brooklyn NoSQL Cluster Examples ................... SKIPPED
[INFO] Brooklyn QA ....................................... SKIPPED
[INFO] ------------------------------------------------------------------------
[INFO] BUILD FAILURE
[INFO] ------------------------------------------------------------------------
[INFO] Total time: 15:25.171s
[INFO] Finished at: Wed Oct 29 09:59:41 PDT 2014
[INFO] Final Memory: 46M/132M
[INFO] ------------------------------------------------------------------------
[JENKINS] Archiving disabled
[JENKINS] Archiving disabled
[JENKINS] Archiving disabled
[JENKINS] Archiving disabled
[JENKINS] Archiving disabled
[JENKINS] Archiving disabled
[JENKINS] Archiving disabled
[JENKINS] Archiving disabled
[JENKINS] Archiving disabled
[JENKINS] Archiving disabled
[JENKINS] Archiving disabled
[JENKINS] Archiving disabled
[JENKINS] Archiving disabled
[JENKINS] Archiving disabled
[JENKINS] Archiving disabled
[JENKINS] Archiving disabled
[JENKINS] Archiving disabled
[JENKINS] Archiving disabled
[JENKINS] Archiving disabled
[JENKINS] Archiving disabled
[JENKINS] Archiving disabled
[JENKINS] Archiving disabled
[JENKINS] Archiving disabled
[JENKINS] Archiving disabled
[JENKINS] Archiving disabled
[JENKINS] Archiving disabled
[JENKINS] Archiving disabled
[JENKINS] Archiving disabled
[JENKINS] Archiving disabled
[JENKINS] Archiving disabled
[JENKINS] Archiving disabled
[JENKINS] Archiving disabled
[JENKINS] Archiving disabled
[JENKINS] Archiving disabled
[JENKINS] Archiving disabled
[JENKINS] Archiving disabled
Waiting for Jenkins to finish collecting data
[ERROR] Failed to execute goal org.apache.maven.plugins:maven-surefire-plugin:2.17:test (default-test)
on project brooklyn-software-base: There are test failures.
[ERROR] 
[ERROR] Please refer to F:\jenkins\jenkins-slave\workspace\incubator-brooklyn-master-windows\software\base\target\surefire-reports
for the individual test results.
[ERROR] -> [Help 1]
[ERROR] 
[ERROR] To see the full stack trace of the errors, re-run Maven with the -e switch.
[ERROR] Re-run Maven using the -X switch to enable full debug logging.
[ERROR] 
[ERROR] For more information about the errors and possible solutions, please read the following
articles:
[ERROR] [Help 1] http://cwiki.apache.org/confluence/display/MAVEN/MojoFailureException
[ERROR] 
[ERROR] After correcting the problems, you can resume the build with the command
[ERROR]   mvn <goals> -rf :brooklyn-software-base
channel stopped

Mime
View raw message