brooklyn-dev mailing list archives

Site index · List index
Message view « Date » · « Thread »
Top « Date » · « Thread »
From Apache Jenkins Server <jenk...@builds.apache.org>
Subject Build failed in Jenkins: incubator-brooklyn-master-windows #14
Date Thu, 09 Oct 2014 13:09:46 GMT
See <https://builds.apache.org/job/incubator-brooklyn-master-windows/14/changes>

Changes:

[alex.heneveld] support `raw` parameter for accessing config values

[alex.heneveld] don't use censoredValue renderer hint for now, as there is no nice way to
uncensor in the gui

[alex.heneveld] fix deplicate `RendererHint` application

------------------------------------------
[...truncated 21760 lines...]
[INFO] 
[INFO] --- maven-resources-plugin:2.6:testResources (default-testResources) @ brooklyn-archetype-quickstart
---
[INFO] Using 'UTF-8' encoding to copy filtered resources.
[INFO] Copying 17 resources
[INFO] Copying 3 resources
[INFO] 
[INFO] --- maven-archetype-plugin:2.2:jar (default-jar) @ brooklyn-archetype-quickstart ---
[INFO] Building archetype jar: F:\jenkins\jenkins-slave\workspace\incubator-brooklyn-master-windows\usage\archetypes\quickstart\target\brooklyn-archetype-quickstart-0.7.0-SNAPSHOT
[INFO] 
[INFO] --- maven-site-plugin:3.4:attach-descriptor (attach-descriptor) @ brooklyn-archetype-quickstart
---
[INFO] 
[INFO] --- maven-jar-plugin:2.3.2:test-jar (test-jar-creation) @ brooklyn-archetype-quickstart
---
[INFO] Building jar: F:\jenkins\jenkins-slave\workspace\incubator-brooklyn-master-windows\usage\archetypes\quickstart\target\brooklyn-archetype-quickstart-0.7.0-SNAPSHOT-tests.jar
[INFO] 
[INFO] --- maven-archetype-plugin:2.2:integration-test (default-integration-test) @ brooklyn-archetype-quickstart
---
[INFO] Processing Archetype IT project: integration-test-1
[INFO] ----------------------------------------------------------------------------
[INFO] Using following parameters for creating project from Archetype: brooklyn-archetype-quickstart:0.7.0-SNAPSHOT
[INFO] ----------------------------------------------------------------------------
[INFO] Parameter: groupId, Value: com.acme.sample
[INFO] Parameter: artifactId, Value: brooklyn-sample
[INFO] Parameter: version, Value: 0.1.0-SNAPSHOT
[INFO] Parameter: package, Value: com.acme.sample.brooklyn
[INFO] Parameter: packageInPathFormat, Value: com/acme/sample/brooklyn
[INFO] Parameter: package, Value: com.acme.sample.brooklyn
[INFO] Parameter: version, Value: 0.1.0-SNAPSHOT
[INFO] Parameter: groupId, Value: com.acme.sample
[INFO] Parameter: artifactId, Value: brooklyn-sample
[WARNING] Don't override file F:\jenkins\jenkins-slave\workspace\incubator-brooklyn-master-windows\usage\archetypes\quickstart\target\test-classes\projects\integration-test-1\project\brooklyn-sample\src\main\resources\sample-icon.png
[INFO] project created from Archetype in dir: F:\jenkins\jenkins-slave\workspace\incubator-brooklyn-master-windows\usage\archetypes\quickstart\target\test-classes\projects\integration-test-1\project\brooklyn-sample
[INFO] Comparing generated project with reference content: F:\jenkins\jenkins-slave\workspace\incubator-brooklyn-master-windows\usage\archetypes\quickstart\target\test-classes\projects\integration-test-1\reference
[WARNING] Contents of file pom.xml are not equal
[WARNING] Contents of file README.md are not equal
[WARNING] Contents of file src\main\assembly\assembly.xml are not equal
[WARNING] Contents of file src\main\assembly\files\conf\logback.xml are not equal
[WARNING] Contents of file src\main\assembly\files\README.txt are not equal
[WARNING] Contents of file src\main\assembly\scripts\start.sh are not equal
[WARNING] Contents of file src\main\java\com\acme\sample\brooklyn\sample\app\ClusterWebServerDatabaseSample.java
are not equal
[WARNING] Contents of file src\main\java\com\acme\sample\brooklyn\sample\app\SingleWebServerSample.java
are not equal
[WARNING] Contents of file src\main\java\com\acme\sample\brooklyn\SampleMain.java are not
equal
[WARNING] Contents of file src\main\resources\logback-custom.xml are not equal
[WARNING] Contents of file src\main\resources\visitors-creation-script.sql are not equal
[WARNING] Contents of file src\test\java\com\acme\sample\brooklyn\sample\app\SampleLocalhostIntegrationTest.java
are not equal
[WARNING] Contents of file src\test\java\com\acme\sample\brooklyn\sample\app\SampleUnitTest.java
are not equal
[JENKINS] Recording test results
[JENKINS] Archiving disabled
[INFO]                                                                         
[INFO] ------------------------------------------------------------------------
[INFO] Building Brooklyn Examples Aggregator Project 0.7.0-SNAPSHOT
[INFO] ------------------------------------------------------------------------
[INFO] 
[INFO] --- maven-clean-plugin:2.5:clean (default-clean) @ brooklyn-examples-parent ---
[INFO] Deleting F:\jenkins\jenkins-slave\workspace\incubator-brooklyn-master-windows\examples\target
[INFO] Deleting F:\jenkins\jenkins-slave\workspace\incubator-brooklyn-master-windows\examples
(includes = [brooklyn*.log, brooklyn*.log.*, stacktrace.log, test-output, prodDb.*], excludes
= [])
[INFO] 
[INFO] --- maven-replacer-plugin:1.4.0:replace (fix-eclipse-dot-classpath-mangling) @ brooklyn-examples-parent
---
[INFO] Ignoring missing file
[INFO] Replacement run on 0 file.
[INFO] 
[INFO] --- buildnumber-maven-plugin:1.3:create (default) @ brooklyn-examples-parent ---
[INFO] 
[INFO] --- maven-enforcer-plugin:1.3.1:enforce (brooklyn-build-req) @ brooklyn-examples-parent
---
[INFO] 
[INFO] --- maven-remote-resources-plugin:1.5:process (default) @ brooklyn-examples-parent
---
[INFO] 
[INFO] --- maven-checkstyle-plugin:2.13:check (verify-style) @ brooklyn-examples-parent ---
[INFO] 
[INFO] 
[INFO] --- maven-site-plugin:3.4:attach-descriptor (attach-descriptor) @ brooklyn-examples-parent
---
[INFO] 
[INFO] --- apache-rat-plugin:0.10:check (default) @ brooklyn-examples-parent ---
[INFO] 56 implicit excludes (use -debug for more details).
[INFO] Exclude: **/simple-open-loop-policy/localrepo/io/brooklyn/org.marre.smsj/1.0.0-20051126/org.marre.smsj-1.0.0-20051126.pom
[INFO] Exclude: **/.git/**
[INFO] Exclude: **/.gitignore
[INFO] Exclude: **/.repository/**
[INFO] Exclude: **/.idea/**
[INFO] Exclude: **/*.iml
[INFO] Exclude: **/.classpath/**
[INFO] Exclude: **/.project
[INFO] Exclude: **/.settings/**
[INFO] Exclude: **/*.log
[INFO] Exclude: **/brooklyn*.log.*
[INFO] Exclude: **/target/**
[INFO] Exclude: ignored/**
[INFO] Exclude: LICENSE.md
[INFO] Exclude: **/MANIFEST.MF
[INFO] Exclude: **/test-output/**
[INFO] Exclude: **/*.pem.pub
[INFO] Exclude: **/*.svg
[INFO] Exclude: **/*.crt
[INFO] Exclude: **/*.csr
[INFO] Exclude: **/*.key
[INFO] Exclude: **/*.key.org
[INFO] Exclude: **/*.psd
[INFO] Exclude: **/*.json
[INFO] Exclude: **/*.plxarc
[INFO] Exclude: **/services/brooklyn.location.LocationResolver
[INFO] Exclude: **/src/test/resources/brooklyn/entity/basic/template_with_extra_substitutions.txt
[INFO] Exclude: **/src/main/resources/banner.txt
[INFO] Exclude: **/src/test/resources/ssl/certs/localhost/info.txt
[INFO] Exclude: **/sandbox/examples/src/main/scripts/amis.txt
[INFO] Exclude: docs/**
[INFO] 10 resources included (use -debug for more details)
[INFO] Rat check: Summary of files. Unapproved: 0 unknown: 0 generated: 0 approved: 8 licence.
[INFO] 
[INFO] --- maven-source-plugin:2.3:jar-no-fork (attach-sources) @ brooklyn-examples-parent
---
[INFO] 
[INFO] --- maven-install-plugin:2.5.1:install (default-install) @ brooklyn-examples-parent
---
[INFO] Installing F:\jenkins\jenkins-slave\workspace\incubator-brooklyn-master-windows\examples\pom.xml
to f:\jenkins\jenkins-slave\maven-repositories\0\io\brooklyn\example\brooklyn-examples-parent\0.7.0-SNAPSHOT\brooklyn-examples-parent-0.7.0-SNAPSHOT.pom
[JENKINS] Archiving disabled
[INFO]                                                                         
[INFO] ------------------------------------------------------------------------
[INFO] Skipping Brooklyn Simple Web Cluster Example
[INFO] This project has been banned from the build due to previous failures.
[INFO] ------------------------------------------------------------------------
[INFO]                                                                         
[INFO] ------------------------------------------------------------------------
[INFO] Skipping Brooklyn Global Web Fabric Example
[INFO] This project has been banned from the build due to previous failures.
[INFO] ------------------------------------------------------------------------
[INFO]                                                                         
[INFO] ------------------------------------------------------------------------
[INFO] Skipping Brooklyn Simple Messaging Publish-Subscribe Example
[INFO] This project has been banned from the build due to previous failures.
[INFO] ------------------------------------------------------------------------
[INFO]                                                                         
[INFO] ------------------------------------------------------------------------
[INFO] Skipping Brooklyn NoSQL Cluster Examples
[INFO] This project has been banned from the build due to previous failures.
[INFO] ------------------------------------------------------------------------
[INFO]                                                                         
[INFO] ------------------------------------------------------------------------
[INFO] Skipping Brooklyn QA
[INFO] This project has been banned from the build due to previous failures.
[INFO] ------------------------------------------------------------------------
[INFO] ------------------------------------------------------------------------
[INFO] Reactor Summary:
[INFO] 
[INFO] Brooklyn Parent Project ........................... SUCCESS [29.782s]
[INFO] Brooklyn Utilities to Support Testing (listeners etc)  SUCCESS [23.261s]
[INFO] Brooklyn Logback Includable Configuration ......... SUCCESS [2.778s]
[INFO] Brooklyn Common Utilities ......................... SUCCESS [33.584s]
[INFO] Brooklyn Groovy Utilities ......................... SUCCESS [14.675s]
[INFO] Brooklyn API ...................................... SUCCESS [12.169s]
[INFO] Brooklyn Test Support ............................. SUCCESS [9.753s]
[INFO] CAMP Server Parent Project ........................ SUCCESS [0.399s]
[INFO] CAMP Base ......................................... SUCCESS [11.539s]
[INFO] Brooklyn REST Swagger Apidoc Utilities ............ SUCCESS [9.148s]
[INFO] Brooklyn Logback Configuration .................... SUCCESS [4.982s]
[INFO] CAMP Server ....................................... SUCCESS [21.277s]
[INFO] Brooklyn Core ..................................... SUCCESS [5:47.962s]
[INFO] Brooklyn Policies ................................. FAILURE [2:11.650s]
[INFO] Brooklyn Hazelcast Storage ........................ SUCCESS [12.469s]
[INFO] Brooklyn Jclouds Location Targets ................. SUCCESS [1:00.536s]
[INFO] Brooklyn Secure JMXMP Agent ....................... SUCCESS [29.751s]
[INFO] Brooklyn JMX RMI Agent ............................ SUCCESS [5.895s]
[INFO] Brooklyn Software Base ............................ SKIPPED
[INFO] Brooklyn Network Software Entities ................ SKIPPED
[INFO] Brooklyn OSGi Software Entities ................... SKIPPED
[INFO] Brooklyn Web App Software Entities ................ SKIPPED
[INFO] Brooklyn Messaging Software Entities .............. SKIPPED
[INFO] Brooklyn Database Software Entities ............... SKIPPED
[INFO] Brooklyn NoSQL Data Store Software Entities ....... SKIPPED
[INFO] Brooklyn Monitoring Software Entities ............. SKIPPED
[INFO] Brooklyn CAMP REST API ............................ SKIPPED
[INFO] Brooklyn REST API ................................. SUCCESS [11.554s]
[INFO] Brooklyn REST Server .............................. SKIPPED
[INFO] Brooklyn REST Client .............................. SKIPPED
[INFO] Brooklyn REST JavaScript Web GUI .................. SKIPPED
[INFO] Brooklyn Launcher ................................. SKIPPED
[INFO] Brooklyn Command Line Interface ................... SKIPPED
[INFO] Brooklyn All Things ............................... SKIPPED
[INFO] Brooklyn Distribution ............................. SKIPPED
[INFO] Brooklyn Quick-Start Project Archetype ............ FAILURE [3.333s]
[INFO] Brooklyn Examples Aggregator Project .............. SUCCESS [2.248s]
[INFO] Brooklyn Simple Web Cluster Example ............... SKIPPED
[INFO] Brooklyn Global Web Fabric Example ................ SKIPPED
[INFO] Brooklyn Simple Messaging Publish-Subscribe Example  SKIPPED
[INFO] Brooklyn NoSQL Cluster Examples ................... SKIPPED
[INFO] Brooklyn QA ....................................... SKIPPED
[INFO] ------------------------------------------------------------------------
[INFO] BUILD FAILURE
[INFO] ------------------------------------------------------------------------
[INFO] Total time: 13:13.325s
[INFO] Finished at: Thu Oct 09 06:08:29 PDT 2014
[INFO] Final Memory: 48M/122M
[INFO] ------------------------------------------------------------------------
[JENKINS] Archiving disabled
[JENKINS] Archiving disabled
[JENKINS] Archiving disabled
[JENKINS] Archiving disabled
[JENKINS] Archiving disabled
[JENKINS] Archiving disabled
[JENKINS] Archiving disabled
[JENKINS] Archiving disabled
[JENKINS] Archiving disabled
[JENKINS] Archiving disabled
[JENKINS] Archiving disabled
[JENKINS] Archiving disabled
[JENKINS] Archiving disabled
[JENKINS] Archiving disabled
[JENKINS] Archiving disabled
[JENKINS] Archiving disabled
[JENKINS] Archiving disabled
[JENKINS] Archiving disabled
[JENKINS] Archiving disabled
[JENKINS] Archiving disabled
[JENKINS] Archiving disabled
[JENKINS] Archiving disabled
[JENKINS] Archiving disabled
[JENKINS] Archiving disabled
[JENKINS] Archiving disabled
[JENKINS] Archiving disabled
[JENKINS] Archiving disabled
[JENKINS] Archiving disabled
[JENKINS] Archiving disabled
[JENKINS] Archiving disabled
[JENKINS] Archiving disabled
[JENKINS] Archiving disabled
[JENKINS] Archiving disabled
[JENKINS] Archiving disabled
[JENKINS] Archiving disabled
[JENKINS] Archiving disabled
[JENKINS] Archiving disabled
[JENKINS] Archiving disabled
[JENKINS] Archiving disabled
[JENKINS] Archiving disabled
[JENKINS] Archiving disabled
[JENKINS] Archiving disabled
Waiting for Jenkins to finish collecting data
[ERROR] Failed to execute goal org.apache.maven.plugins:maven-surefire-plugin:2.17:test (default-test)
on project brooklyn-policy: There are test failures.
[ERROR] 
[ERROR] Please refer to F:\jenkins\jenkins-slave\workspace\incubator-brooklyn-master-windows\policy\target\surefire-reports
for the individual test results.
[ERROR] -> [Help 1]
[ERROR] Failed to execute goal org.apache.maven.plugins:maven-archetype-plugin:2.2:integration-test
(default-integration-test) on project brooklyn-archetype-quickstart:
[ERROR] Archetype IT 'integration-test-1' failed: Some content are not equals
[ERROR] -> [Help 2]
[ERROR] 
[ERROR] To see the full stack trace of the errors, re-run Maven with the -e switch.
[ERROR] Re-run Maven using the -X switch to enable full debug logging.
[ERROR] 
[ERROR] For more information about the errors and possible solutions, please read the following
articles:
[ERROR] [Help 1] http://cwiki.apache.org/confluence/display/MAVEN/MojoFailureException
[ERROR] [Help 2] http://cwiki.apache.org/confluence/display/MAVEN/MojoExecutionException
[ERROR] 
[ERROR] After correcting the problems, you can resume the build with the command
[ERROR]   mvn <goals> -rf :brooklyn-policy
channel stopped

Mime
View raw message