brooklyn-dev mailing list archives

Site index · List index
Message view « Date » · « Thread »
Top « Date » · « Thread »
From Apache Jenkins Server <jenk...@builds.apache.org>
Subject Build failed in Jenkins: incubator-brooklyn-master-windows #39
Date Fri, 31 Oct 2014 12:11:31 GMT
See <https://builds.apache.org/job/incubator-brooklyn-master-windows/39/changes>

Changes:

[sam.corbett] Fix rest-server ApplicationResourceIntegrationTest

------------------------------------------
[...truncated 23125 lines...]
2014-10-31 05:11:11,184 INFO  TESTNG PASSED CONFIGURATION: "Surefire test" - @BeforeMethod
brooklyn.entity.webapp.DynamicWebAppFabricTest.setUp() finished in 13 ms
2014-10-31 05:11:11,184 INFO  TESTNG INVOKING: "Surefire test" - brooklyn.entity.webapp.DynamicWebAppFabricTest.testRequestCountAggregationOverClusters()
2014-10-31 05:11:11,225 INFO  Creating entity in fabric DynamicWebAppFabricImpl{id=RXys8opp}
at SimulatedLocation{id=xRLGXrl9, name=SimulatedLocation:xRLG}
2014-10-31 05:11:11,252 INFO  Creating entity in fabric DynamicWebAppFabricImpl{id=RXys8opp}
at SimulatedLocation{id=xfpvR0CI, name=SimulatedLocation:xfpv}
2014-10-31 05:11:11,318 INFO  Resize DynamicWebAppClusterImpl{id=OPMSHHtB} from 0 to 2
2014-10-31 05:11:11,329 INFO  Resize DynamicWebAppClusterImpl{id=bgA6weFh} from 0 to 2
2014-10-31 05:11:11,411 WARN  Setting TestJavaWebAppEntityImpl{id=Bh2nGAbS} on-fire due to
problems when expected running, up=false, not-up-indicators: {service.process.isRunning=The
software process for this entity does not appear to be running}
2014-10-31 05:11:11,420 WARN  Setting TestJavaWebAppEntityImpl{id=yzcwbW1G} on-fire due to
problems when expected running, up=false, not-up-indicators: {service.process.isRunning=The
software process for this entity does not appear to be running}
2014-10-31 05:11:11,580 WARN  Setting TestJavaWebAppEntityImpl{id=sxTQJiXI} on-fire due to
problems when expected running, up=false, not-up-indicators: {service.process.isRunning=The
software process for this entity does not appear to be running}
2014-10-31 05:11:11,595 WARN  Setting TestJavaWebAppEntityImpl{id=dzCv8drI} on-fire due to
problems when expected running, up=false, not-up-indicators: {service.process.isRunning=The
software process for this entity does not appear to be running}
2014-10-31 05:11:11,826 WARN  Service is not up when setting running on DynamicWebAppClusterImpl{id=OPMSHHtB};
delayed 244ms but Sensor: service.isUp (java.lang.Boolean) did not recover from false; not-up-indicators={service-not-up-indicators-from-children-and-members=None
of the entities are up}
2014-10-31 05:11:11,827 WARN  Setting DynamicWebAppClusterImpl{id=OPMSHHtB} on-fire due to
problems when expected running, up=false, problems: {service-lifecycle-indicators-from-children-and-members=Required
entities not healthy: TestJavaWebAppEntityImpl{id=Bh2nGAbS}, TestJavaWebAppEntityImpl{id=sxTQJiXI}}
2014-10-31 05:11:11,832 WARN  Service is not up when setting running on DynamicWebAppClusterImpl{id=bgA6weFh};
delayed 234ms but Sensor: service.isUp (java.lang.Boolean) did not recover from false; not-up-indicators={service-not-up-indicators-from-children-and-members=None
of the entities are up}
2014-10-31 05:11:11,832 WARN  Setting DynamicWebAppClusterImpl{id=bgA6weFh} on-fire due to
problems when expected running, up=false, problems: {service-lifecycle-indicators-from-children-and-members=Required
entities not healthy: TestJavaWebAppEntityImpl{id=dzCv8drI}, TestJavaWebAppEntityImpl{id=yzcwbW1G}}
2014-10-31 05:11:12,038 WARN  Service is not up when setting running on DynamicWebAppFabricImpl{id=RXys8opp};
delayed 204ms but Sensor: service.isUp (java.lang.Boolean) did not recover from false; not-up-indicators={service-not-up-indicators-from-children-and-members=None
of the entities are up}
2014-10-31 05:11:12,038 WARN  Setting DynamicWebAppFabricImpl{id=RXys8opp} on-fire due to
problems when expected running, up=false, problems: {service-lifecycle-indicators-from-children-and-members=Required
entities not healthy: DynamicWebAppClusterImpl{id=OPMSHHtB}, DynamicWebAppClusterImpl{id=bgA6weFh}}
2014-10-31 05:11:12,041 WARN  Setting Application[eu0Oq6aJ] on-fire due to problems when expected
running, up=true, problems: {service-lifecycle-indicators-from-children-and-members=Required
entity not healthy: DynamicWebAppFabricImpl{id=RXys8opp}}
2014-10-31 05:11:12,099 INFO  TESTNG PASSED: "Surefire test" - brooklyn.entity.webapp.DynamicWebAppFabricTest.testRequestCountAggregationOverClusters()
finished in 915 ms
2014-10-31 05:11:12,099 INFO  TESTNG INVOKING CONFIGURATION: "Surefire test" - @AfterMethod
brooklyn.entity.webapp.DynamicWebAppFabricTest.tearDown()
2014-10-31 05:11:12,539 INFO  TESTNG PASSED CONFIGURATION: "Surefire test" - @AfterMethod
brooklyn.entity.webapp.DynamicWebAppFabricTest.tearDown() finished in 440 ms
2014-10-31 05:11:12,540 INFO  TESTNG INVOKING CONFIGURATION: "Surefire test" - @BeforeMethod
brooklyn.entity.webapp.ElasticCustomLocationTest.setUp()
[GC 233158K->27280K(760256K), 0.0175411 secs]
2014-10-31 05:11:12,584 WARN  Task Task[LSM.publish(TestJavaWebAppEntityImpl{id=Shi8nT9X}.Sensor:
service.state (brooklyn.entity.basic.Lifecycle)=stopping @ 1414757471140);[subscription-delivery-entity-KW56FROA[DynamicWebAppFabricImpl{id=KW56FROA}]]:k9kISyFu]
is being finalized before completion
2014-10-31 05:11:12,584 WARN  Task Task[LSM.publish(TestJavaWebAppEntityImpl{id=Shi8nT9X}.Sensor:
service.state (brooklyn.entity.basic.Lifecycle)=stopping @ 1414757471140);[subscription-delivery-entity-KW56FROA[DynamicWebAppFabricImpl{id=KW56FROA}]]:cDHYOI2m]
is being finalized before completion
2014-10-31 05:11:12,584 WARN  Task Task[LSM.publish(TestJavaWebAppEntityImpl{id=Shi8nT9X}.Sensor:
service.state (brooklyn.entity.basic.Lifecycle)=stopping @ 1414757471140);[subscription-delivery-entity-KW56FROA[DynamicWebAppFabricImpl{id=KW56FROA}]]:loIFVGVU]
is being finalized before completion
2014-10-31 05:11:12,585 WARN  Task Task[LSM.publish(TestJavaWebAppEntityImpl{id=Shi8nT9X}.Sensor:
service.isUp (java.lang.Boolean)=false @ 1414757471140);[subscription-delivery-entity-KW56FROA[DynamicWebAppFabricImpl{id=KW56FROA}]]:f35ePKkX]
is being finalized before completion
2014-10-31 05:11:12,585 WARN  Task Task[LSM.publish(TestJavaWebAppEntityImpl{id=Shi8nT9X}.Sensor:
service.isUp (java.lang.Boolean)=false @ 1414757471140);[subscription-delivery-entity-KW56FROA[DynamicWebAppFabricImpl{id=KW56FROA}]]:htnrMbio]
is being finalized before completion
2014-10-31 05:11:12,585 WARN  Task Task[LSM.publish(TestJavaWebAppEntityImpl{id=Shi8nT9X}.Sensor:
service.isUp (java.lang.Boolean)=false @ 1414757471140);[subscription-delivery-entity-KW56FROA[DynamicWebAppFabricImpl{id=KW56FROA}]]:Wumci9Qj]
is being finalized before completion
2014-10-31 05:11:12,585 WARN  Task Task[LSM.publish(TestJavaWebAppEntityImpl{id=Shi8nT9X}.Sensor:
service.isUp (java.lang.Boolean)=false @ 1414757471140);[subscription-delivery-entity-KW56FROA[DynamicWebAppFabricImpl{id=KW56FROA}]]:BjxNu9Ev]
is being finalized before completion
2014-10-31 05:11:12,585 WARN  Task Task[LSM.publish(TestJavaWebAppEntityImpl{id=Shi8nT9X}.Sensor:
service.state (brooklyn.entity.basic.Lifecycle)=stopped @ 1414757471140);[subscription-delivery-entity-KW56FROA[DynamicWebAppFabricImpl{id=KW56FROA}]]:UpLxbWl1]
is being finalized before completion
2014-10-31 05:11:12,585 WARN  Task Task[LSM.publish(TestJavaWebAppEntityImpl{id=Shi8nT9X}.Sensor:
service.state (brooklyn.entity.basic.Lifecycle)=stopped @ 1414757471140);[subscription-delivery-entity-KW56FROA[DynamicWebAppFabricImpl{id=KW56FROA}]]:uD4fSfLS]
is being finalized before completion
2014-10-31 05:11:12,585 WARN  Task Task[LSM.publish(TestJavaWebAppEntityImpl{id=Shi8nT9X}.Sensor:
service.state (brooklyn.entity.basic.Lifecycle)=stopped @ 1414757471140);[subscription-delivery-entity-KW56FROA[DynamicWebAppFabricImpl{id=KW56FROA}]]:WJPk3FJq]
is being finalized before completion
2014-10-31 05:11:12,586 WARN  Task Task[LSM.publish(TestJavaWebAppEntityImpl{id=Shi8nT9X}.Sensor:
service.state (brooklyn.entity.basic.Lifecycle)=stopped @ 1414757471140);[subscription-delivery-entity-KW56FROA[DynamicWebAppFabricImpl{id=KW56FROA}]]:g3oC2DJb]
is being finalized before completion
2014-10-31 05:11:12,586 WARN  Task Task[LSM.publish(DynamicWebAppFabricImpl{id=KW56FROA}.Sensor:
service.state.expected (brooklyn.entity.basic.Lifecycle$Transition)=stopped @ 1414757471142
/ Fri Oct 31 05:11:11 PDT 2014 @ 1414757471142);[subscription-delivery-entity-KW56FROA[DynamicWebAppFabricImpl{id=KW56FROA}]]:cjUfmGEX]
is being finalized before completion
2014-10-31 05:11:12,586 WARN  Task Task[LSM.publish(DynamicWebAppFabricImpl{id=KW56FROA}.Sensor:
service.isUp (java.lang.Boolean)=false @ 1414757471142);[subscription-delivery-entity-KW56FROA[DynamicWebAppFabricImpl{id=KW56FROA}]]:NxEahCxL]
is being finalized before completion
2014-10-31 05:11:12,586 WARN  Task Task[LSM.publish(DynamicWebAppFabricImpl{id=KW56FROA}.Sensor:
service.notUp.indicators (java.util.Map)={service-not-up-indicators-from-children-and-members=None
of the entities are up} @ 1414757471142);[subscription-delivery-entity-KW56FROA[DynamicWebAppFabricImpl{id=KW56FROA}]]:AgyzmgyE]
is being finalized before completion
2014-10-31 05:11:12,586 WARN  Task Task[LSM.publish(DynamicWebAppFabricImpl{id=KW56FROA}.Sensor:
entity.children.removed (brooklyn.entity.Entity)=TestJavaWebAppEntityImpl{id=Nq5aTpeJ} @ 1414757471144);[subscription-delivery-entity-KW56FROA[DynamicWebAppFabricImpl{id=KW56FROA}]]:wmYcwSEG]
is being finalized before completion
2014-10-31 05:11:12,586 WARN  Task Task[LSM.publish(DynamicWebAppFabricImpl{id=KW56FROA}.Sensor:
entity.children.removed (brooklyn.entity.Entity)=TestJavaWebAppEntityImpl{id=Nq5aTpeJ} @ 1414757471144);[subscription-delivery-entity-KW56FROA[DynamicWebAppFabricImpl{id=KW56FROA}]]:EslOSNUB]
is being finalized before completion
2014-10-31 05:11:12,587 WARN  Task Task[LSM.publish(DynamicWebAppFabricImpl{id=KW56FROA}.Sensor:
group.members.removed (brooklyn.entity.Entity)=TestJavaWebAppEntityImpl{id=Nq5aTpeJ} @ 1414757471144);[subscription-delivery-entity-KW56FROA[DynamicWebAppFabricImpl{id=KW56FROA}]]:fBNlVHSx]
is being finalized before completion
2014-10-31 05:11:12,587 WARN  Task Task[LSM.publish(DynamicWebAppFabricImpl{id=KW56FROA}.Sensor:
group.members.removed (brooklyn.entity.Entity)=TestJavaWebAppEntityImpl{id=Nq5aTpeJ} @ 1414757471144);[subscription-delivery-entity-KW56FROA[DynamicWebAppFabricImpl{id=KW56FROA}]]:A2ARTkZZ]
is being finalized before completion
2014-10-31 05:11:12,587 WARN  Task Task[LSM.publish(DynamicWebAppFabricImpl{id=KW56FROA}.Sensor:
group.members.removed (brooklyn.entity.Entity)=TestJavaWebAppEntityImpl{id=Nq5aTpeJ} @ 1414757471144);[subscription-delivery-entity-KW56FROA[DynamicWebAppFabricImpl{id=KW56FROA}]]:bcdKQFet]
is being finalized before completion
2014-10-31 05:11:12,587 WARN  Task Task[LSM.publish(DynamicWebAppFabricImpl{id=KW56FROA}.Sensor:
group.members.removed (brooklyn.entity.Entity)=TestJavaWebAppEntityImpl{id=Nq5aTpeJ} @ 1414757471144);[subscription-delivery-entity-KW56FROA[DynamicWebAppFabricImpl{id=KW56FROA}]]:LFCZi1aN]
is being finalized before completion
2014-10-31 05:11:12,587 WARN  Task Task[LSM.publish(DynamicWebAppFabricImpl{id=KW56FROA}.Sensor:
group.members.removed (brooklyn.entity.Entity)=TestJavaWebAppEntityImpl{id=Nq5aTpeJ} @ 1414757471144);[subscription-delivery-entity-KW56FROA[DynamicWebAppFabricImpl{id=KW56FROA}]]:PG6VgHxU]
is being finalized before completion
2014-10-31 05:11:12,587 WARN  Task Task[LSM.publish(DynamicWebAppFabricImpl{id=KW56FROA}.Sensor:
group.members.removed (brooklyn.entity.Entity)=TestJavaWebAppEntityImpl{id=Nq5aTpeJ} @ 1414757471144);[subscription-delivery-entity-KW56FROA[DynamicWebAppFabricImpl{id=KW56FROA}]]:CNXChNUv]
is being finalized before completion
2014-10-31 05:11:12,587 WARN  Task Task[LSM.publish(DynamicWebAppFabricImpl{id=KW56FROA}.Sensor:
group.members.removed (brooklyn.entity.Entity)=TestJavaWebAppEntityImpl{id=Nq5aTpeJ} @ 1414757471144);[subscription-delivery-entity-KW56FROA[DynamicWebAppFabricImpl{id=KW56FROA}]]:rF3ccUVs]
is being finalized before completion
2014-10-31 05:11:12,587 WARN  Task Task[LSM.publish(DynamicWebAppFabricImpl{id=KW56FROA}.Sensor:
group.members.removed (brooklyn.entity.Entity)=TestJavaWebAppEntityImpl{id=Nq5aTpeJ} @ 1414757471144);[subscription-delivery-entity-KW56FROA[DynamicWebAppFabricImpl{id=KW56FROA}]]:KIxQxd3y]
is being finalized before completion
2014-10-31 05:11:12,588 WARN  Task Task[LSM.publish(DynamicWebAppFabricImpl{id=KW56FROA}.Sensor:
entity.children.removed (brooklyn.entity.Entity)=TestJavaWebAppEntityImpl{id=Shi8nT9X} @ 1414757471145);[subscription-delivery-entity-KW56FROA[DynamicWebAppFabricImpl{id=KW56FROA}]]:CkAVHiWB]
is being finalized before completion
2014-10-31 05:11:12,588 WARN  Task Task[LSM.publish(DynamicWebAppFabricImpl{id=KW56FROA}.Sensor:
entity.children.removed (brooklyn.entity.Entity)=TestJavaWebAppEntityImpl{id=Shi8nT9X} @ 1414757471145);[subscription-delivery-entity-KW56FROA[DynamicWebAppFabricImpl{id=KW56FROA}]]:GQeRUPXG]
is being finalized before completion
2014-10-31 05:11:12,588 WARN  Task Task[LSM.publish(DynamicWebAppFabricImpl{id=KW56FROA}.Sensor:
group.members.removed (brooklyn.entity.Entity)=TestJavaWebAppEntityImpl{id=Shi8nT9X} @ 1414757471145);[subscription-delivery-entity-KW56FROA[DynamicWebAppFabricImpl{id=KW56FROA}]]:ONRHEcvV]
is being finalized before completion
2014-10-31 05:11:12,588 WARN  Task Task[LSM.publish(DynamicWebAppFabricImpl{id=KW56FROA}.Sensor:
group.members.removed (brooklyn.entity.Entity)=TestJavaWebAppEntityImpl{id=Shi8nT9X} @ 1414757471145);[subscription-delivery-entity-KW56FROA[DynamicWebAppFabricImpl{id=KW56FROA}]]:oN82p8dw]
is being finalized before completion
2014-10-31 05:11:12,588 WARN  Task Task[LSM.publish(DynamicWebAppFabricImpl{id=KW56FROA}.Sensor:
group.members.removed (brooklyn.entity.Entity)=TestJavaWebAppEntityImpl{id=Shi8nT9X} @ 1414757471145);[subscription-delivery-entity-KW56FROA[DynamicWebAppFabricImpl{id=KW56FROA}]]:gela7t1t]
is being finalized before completion
2014-10-31 05:11:12,588 WARN  Task Task[LSM.publish(DynamicWebAppFabricImpl{id=KW56FROA}.Sensor:
group.members.removed (brooklyn.entity.Entity)=TestJavaWebAppEntityImpl{id=Shi8nT9X} @ 1414757471145);[subscription-delivery-entity-KW56FROA[DynamicWebAppFabricImpl{id=KW56FROA}]]:qweuTp2P]
is being finalized before completion
2014-10-31 05:11:12,588 WARN  Task Task[LSM.publish(DynamicWebAppFabricImpl{id=KW56FROA}.Sensor:
group.members.removed (brooklyn.entity.Entity)=TestJavaWebAppEntityImpl{id=Shi8nT9X} @ 1414757471145);[subscription-delivery-entity-KW56FROA[DynamicWebAppFabricImpl{id=KW56FROA}]]:uZ2LoHew]
is being finalized before completion
2014-10-31 05:11:12,588 WARN  Task Task[LSM.publish(DynamicWebAppFabricImpl{id=KW56FROA}.Sensor:
group.members.removed (brooklyn.entity.Entity)=TestJavaWebAppEntityImpl{id=Shi8nT9X} @ 1414757471145);[subscription-delivery-entity-KW56FROA[DynamicWebAppFabricImpl{id=KW56FROA}]]:aVZlIbQd]
is being finalized before completion
2014-10-31 05:11:12,589 WARN  Task Task[LSM.publish(DynamicWebAppFabricImpl{id=KW56FROA}.Sensor:
group.members.removed (brooklyn.entity.Entity)=TestJavaWebAppEntityImpl{id=Shi8nT9X} @ 1414757471145);[subscription-delivery-entity-KW56FROA[DynamicWebAppFabricImpl{id=KW56FROA}]]:hC5RDOPY]
is being finalized before completion
2014-10-31 05:11:12,589 WARN  Task Task[LSM.publish(DynamicWebAppFabricImpl{id=KW56FROA}.Sensor:
group.members.removed (brooklyn.entity.Entity)=TestJavaWebAppEntityImpl{id=Shi8nT9X} @ 1414757471145);[subscription-delivery-entity-KW56FROA[DynamicWebAppFabricImpl{id=KW56FROA}]]:V27jMEaR]
is being finalized before completion
[GC 236748K->27160K(760256K), 0.0101206 secs]
[GC 236952K->27951K(760256K), 0.0115498 secs]
2014-10-31 05:11:13,273 INFO  TESTNG PASSED CONFIGURATION: "Surefire test" - @BeforeMethod
brooklyn.entity.webapp.ElasticCustomLocationTest.setUp() finished in 733 ms
2014-10-31 05:11:13,274 INFO  TESTNG INVOKING: "Surefire test" - brooklyn.entity.webapp.ElasticCustomLocationTest.testElasticClusterCreatesTestEntity()
2014-10-31 05:11:13,277 WARN  Deprecated legacy compatibility, using factory (init will not
be invoked): MockWebService{id=tmkznHKA}
2014-10-31 05:11:13,278 INFO  TESTNG PASSED: "Surefire test" - brooklyn.entity.webapp.ElasticCustomLocationTest.testElasticClusterCreatesTestEntity()
finished in 4 ms
2014-10-31 05:11:13,278 INFO  TESTNG INVOKING CONFIGURATION: "Surefire test" - @AfterMethod
brooklyn.entity.webapp.ElasticCustomLocationTest.tearDown()
2014-10-31 05:11:13,395 INFO  TESTNG PASSED CONFIGURATION: "Surefire test" - @AfterMethod
brooklyn.entity.webapp.ElasticCustomLocationTest.tearDown() finished in 117 ms
2014-10-31 05:11:13,419 INFO  TESTNG 
===============================================
    Surefire test
    Tests run: 34, Failures: 1, Skips: 0
===============================================
Tests run: 34, Failures: 1, Errors: 0, Skipped: 0, Time elapsed: 120.36 sec <<< FAILURE!
- in TestSuite
testSetsServiceUpIfMemberIsUp(brooklyn.entity.webapp.DynamicWebAppClusterTest)  Time elapsed:
1.692 sec  <<< FAILURE!
java.lang.AssertionError: expected [true] but found [false]
	at org.testng.Assert.fail(Assert.java:94)
	at org.testng.Assert.failNotEquals(Assert.java:494)
	at org.testng.Assert.assertEquals(Assert.java:123)
	at org.testng.Assert.assertEquals(Assert.java:165)
	at brooklyn.test.EntityTestUtils.assertAttributeEquals(EntityTestUtils.java:54)
	at brooklyn.test.EntityTestUtils$1.run(EntityTestUtils.java:69)
	at brooklyn.test.Asserts$RunnableAdapter.call(Asserts.java:472)
	at brooklyn.test.Asserts.succeedsEventually(Asserts.java:264)
	at brooklyn.test.Asserts.succeedsEventually(Asserts.java:189)
	at brooklyn.test.EntityTestUtils.assertAttributeEqualsEventually(EntityTestUtils.java:67)
	at brooklyn.entity.webapp.DynamicWebAppClusterTest.testSetsServiceUpIfMemberIsUp(DynamicWebAppClusterTest.java:115)


Results :

Failed tests: 
  DynamicWebAppClusterTest.testSetsServiceUpIfMemberIsUp:115 expected [true] but found [false]

Tests run: 34, Failures: 1, Errors: 0, Skipped: 0

[JENKINS] Recording test results
[JENKINS] Archiving disabled
[INFO]                                                                         
[INFO] ------------------------------------------------------------------------
[INFO] Skipping Brooklyn NoSQL Data Store Software Entities
[INFO] This project has been banned from the build due to previous failures.
[INFO] ------------------------------------------------------------------------
[INFO]                                                                         
[INFO] ------------------------------------------------------------------------
[INFO] Skipping Brooklyn CAMP REST API
[INFO] This project has been banned from the build due to previous failures.
[INFO] ------------------------------------------------------------------------
[INFO]                                                                         
[INFO] ------------------------------------------------------------------------
[INFO] Skipping Brooklyn REST Server
[INFO] This project has been banned from the build due to previous failures.
[INFO] ------------------------------------------------------------------------
[INFO]                                                                         
[INFO] ------------------------------------------------------------------------
[INFO] Skipping Brooklyn REST Client
[INFO] This project has been banned from the build due to previous failures.
[INFO] ------------------------------------------------------------------------
[INFO]                                                                         
[INFO] ------------------------------------------------------------------------
[INFO] Skipping Brooklyn REST JavaScript Web GUI
[INFO] This project has been banned from the build due to previous failures.
[INFO] ------------------------------------------------------------------------
[INFO]                                                                         
[INFO] ------------------------------------------------------------------------
[INFO] Skipping Brooklyn Launcher
[INFO] This project has been banned from the build due to previous failures.
[INFO] ------------------------------------------------------------------------
[INFO]                                                                         
[INFO] ------------------------------------------------------------------------
[INFO] Skipping Brooklyn Command Line Interface
[INFO] This project has been banned from the build due to previous failures.
[INFO] ------------------------------------------------------------------------
[INFO]                                                                         
[INFO] ------------------------------------------------------------------------
[INFO] Skipping Brooklyn All Things
[INFO] This project has been banned from the build due to previous failures.
[INFO] ------------------------------------------------------------------------
[INFO]                                                                         
[INFO] ------------------------------------------------------------------------
[INFO] Skipping Brooklyn Distribution
[INFO] This project has been banned from the build due to previous failures.
[INFO] ------------------------------------------------------------------------
[INFO]                                                                         
[INFO] ------------------------------------------------------------------------
[INFO] Skipping Brooklyn Simple Web Cluster Example
[INFO] This project has been banned from the build due to previous failures.
[INFO] ------------------------------------------------------------------------
[INFO]                                                                         
[INFO] ------------------------------------------------------------------------
[INFO] Skipping Brooklyn Global Web Fabric Example
[INFO] This project has been banned from the build due to previous failures.
[INFO] ------------------------------------------------------------------------
[INFO]                                                                         
[INFO] ------------------------------------------------------------------------
[INFO] Skipping Brooklyn Simple Messaging Publish-Subscribe Example
[INFO] This project has been banned from the build due to previous failures.
[INFO] ------------------------------------------------------------------------
[INFO]                                                                         
[INFO] ------------------------------------------------------------------------
[INFO] Skipping Brooklyn NoSQL Cluster Examples
[INFO] This project has been banned from the build due to previous failures.
[INFO] ------------------------------------------------------------------------
[INFO]                                                                         
[INFO] ------------------------------------------------------------------------
[INFO] Skipping Brooklyn QA
[INFO] This project has been banned from the build due to previous failures.
[INFO] ------------------------------------------------------------------------
[INFO] ------------------------------------------------------------------------
[INFO] Reactor Summary:
[INFO] 
[INFO] Brooklyn Parent Project ........................... SUCCESS [20.317s]
[INFO] Brooklyn Utilities to Support Testing (listeners etc)  SUCCESS [15.012s]
[INFO] Brooklyn Logback Includable Configuration ......... SUCCESS [2.351s]
[INFO] Brooklyn Common Utilities ......................... SUCCESS [33.055s]
[INFO] Brooklyn Groovy Utilities ......................... SUCCESS [11.516s]
[INFO] Brooklyn API ...................................... SUCCESS [6.625s]
[INFO] Brooklyn Test Support ............................. SUCCESS [11.265s]
[INFO] CAMP Server Parent Project ........................ SUCCESS [0.172s]
[INFO] CAMP Base ......................................... SUCCESS [11.281s]
[INFO] Brooklyn Core ..................................... SUCCESS [4:11.869s]
[INFO] Brooklyn Policies ................................. SUCCESS [4:24.307s]
[INFO] Brooklyn Jclouds Location Targets ................. SUCCESS [53.159s]
[INFO] Brooklyn Secure JMXMP Agent ....................... SUCCESS [23.716s]
[INFO] Brooklyn JMX RMI Agent ............................ SUCCESS [5.775s]
[INFO] Brooklyn Software Base ............................ SUCCESS [1:17.992s]
[INFO] Brooklyn Web App Software Entities ................ FAILURE [2:29.356s]
[INFO] Brooklyn NoSQL Data Store Software Entities ....... SKIPPED
[INFO] Brooklyn CAMP REST API ............................ SKIPPED
[INFO] Brooklyn REST Server .............................. SKIPPED
[INFO] Brooklyn REST Client .............................. SKIPPED
[INFO] Brooklyn REST JavaScript Web GUI .................. SKIPPED
[INFO] Brooklyn Launcher ................................. SKIPPED
[INFO] Brooklyn Command Line Interface ................... SKIPPED
[INFO] Brooklyn All Things ............................... SKIPPED
[INFO] Brooklyn Distribution ............................. SKIPPED
[INFO] Brooklyn Simple Web Cluster Example ............... SKIPPED
[INFO] Brooklyn Global Web Fabric Example ................ SKIPPED
[INFO] Brooklyn Simple Messaging Publish-Subscribe Example  SKIPPED
[INFO] Brooklyn NoSQL Cluster Examples ................... SKIPPED
[INFO] Brooklyn QA ....................................... SKIPPED
[INFO] ------------------------------------------------------------------------
[INFO] BUILD FAILURE
[INFO] ------------------------------------------------------------------------
[INFO] Total time: 15:52.452s
[INFO] Finished at: Fri Oct 31 05:11:15 PDT 2014
[INFO] Final Memory: 46M/134M
[INFO] ------------------------------------------------------------------------
[JENKINS] Archiving disabled
[JENKINS] Archiving disabled
[JENKINS] Archiving disabled
[JENKINS] Archiving disabled
[JENKINS] Archiving disabled
[JENKINS] Archiving disabled
[JENKINS] Archiving disabled
[JENKINS] Archiving disabled
[JENKINS] Archiving disabled
[JENKINS] Archiving disabled
[JENKINS] Archiving disabled
[JENKINS] Archiving disabled
[JENKINS] Archiving disabled
[JENKINS] Archiving disabled
[JENKINS] Archiving disabled
[JENKINS] Archiving disabled
[JENKINS] Archiving disabled
[JENKINS] Archiving disabled
[JENKINS] Archiving disabled
[JENKINS] Archiving disabled
[JENKINS] Archiving disabled
[JENKINS] Archiving disabled
[JENKINS] Archiving disabled
[JENKINS] Archiving disabled
[JENKINS] Archiving disabled
[JENKINS] Archiving disabled
[JENKINS] Archiving disabled
[JENKINS] Archiving disabled
[JENKINS] Archiving disabled
[JENKINS] Archiving disabled
Waiting for Jenkins to finish collecting data
[ERROR] Failed to execute goal org.apache.maven.plugins:maven-surefire-plugin:2.17:test (default-test)
on project brooklyn-software-webapp: There are test failures.
[ERROR] 
[ERROR] Please refer to F:\jenkins\jenkins-slave\workspace\incubator-brooklyn-master-windows\software\webapp\target\surefire-reports
for the individual test results.
[ERROR] -> [Help 1]
[ERROR] 
[ERROR] To see the full stack trace of the errors, re-run Maven with the -e switch.
[ERROR] Re-run Maven using the -X switch to enable full debug logging.
[ERROR] 
[ERROR] For more information about the errors and possible solutions, please read the following
articles:
[ERROR] [Help 1] http://cwiki.apache.org/confluence/display/MAVEN/MojoFailureException
[ERROR] 
[ERROR] After correcting the problems, you can resume the build with the command
[ERROR]   mvn <goals> -rf :brooklyn-software-webapp
channel stopped

Mime
View raw message