brooklyn-dev mailing list archives

Site index · List index
Message view « Date » · « Thread »
Top « Date » · « Thread »
From Apache Jenkins Server <jenk...@builds.apache.org>
Subject Build failed in Jenkins: incubator-brooklyn-master-build #154
Date Mon, 06 Oct 2014 13:09:43 GMT
See <https://builds.apache.org/job/incubator-brooklyn-master-build/154/changes>

Changes:

[aled.sage] Move PerformanceTestUtils from core to usage/test-support

[aled.sage] Adds load tests

------------------------------------------
[...truncated 29358 lines...]
----------
9. ERROR in <https://builds.apache.org/job/incubator-brooklyn-master-build/ws/usage/qa/src/main/java/brooklyn/qa/load/LoadTest.java>
(at line 124)
	@AfterMethod(alwaysRun=true)
	 ^^^^^^^^^^^

[ERROR] no more tokens - could not parse error message: AfterMethod cannot be resolved to
a type
----------
10. ERROR in <https://builds.apache.org/job/incubator-brooklyn-master-build/ws/usage/qa/src/main/java/brooklyn/qa/load/LoadTest.java>
(at line 124)
	@AfterMethod(alwaysRun=true)
	             ^^^^^^^^^

[ERROR] no more tokens - could not parse error message: The attribute alwaysRun is undefined
for the annotation type AfterMethod
----------
11. ERROR in <https://builds.apache.org/job/incubator-brooklyn-master-build/ws/usage/qa/src/main/java/brooklyn/qa/load/LoadTest.java>
(at line 142)
	@Test(groups="Acceptance")
	 ^^^^

[ERROR] no more tokens - could not parse error message: Test cannot be resolved to a type
----------
12. ERROR in <https://builds.apache.org/job/incubator-brooklyn-master-build/ws/usage/qa/src/main/java/brooklyn/qa/load/LoadTest.java>
(at line 142)
	@Test(groups="Acceptance")
	      ^^^^^^

[ERROR] no more tokens - could not parse error message: The attribute groups is undefined
for the annotation type Test
----------
13. ERROR in <https://builds.apache.org/job/incubator-brooklyn-master-build/ws/usage/qa/src/main/java/brooklyn/qa/load/LoadTest.java>
(at line 158)
	assertEquals(app.getAttribute(Startable.SERVICE_UP), (Boolean)true);
	^^^^^^^^^^^^

[ERROR] no more tokens - could not parse error message: The method assertEquals(Boolean, Boolean)
is undefined for the type LoadTest
----------
14. ERROR in <https://builds.apache.org/job/incubator-brooklyn-master-build/ws/usage/qa/src/main/java/brooklyn/qa/load/LoadTest.java>
(at line 172)
	@Test(groups="Acceptance")
	 ^^^^

[ERROR] no more tokens - could not parse error message: Test cannot be resolved to a type
----------
15. ERROR in <https://builds.apache.org/job/incubator-brooklyn-master-build/ws/usage/qa/src/main/java/brooklyn/qa/load/LoadTest.java>
(at line 172)
	@Test(groups="Acceptance")
	      ^^^^^^

[ERROR] no more tokens - could not parse error message: The attribute groups is undefined
for the annotation type Test
----------
16. ERROR in <https://builds.apache.org/job/incubator-brooklyn-master-build/ws/usage/qa/src/main/java/brooklyn/qa/load/LoadTest.java>
(at line 196)
	assertEquals(app.getAttribute(Startable.SERVICE_UP), (Boolean)true);
	^^^^^^^^^^^^

[INFO] 16 errors 
[INFO] -------------------------------------------------------------
[JENKINS] Archiving disabled
[INFO] ------------------------------------------------------------------------
[INFO] Reactor Summary:
[INFO] 
[INFO] Brooklyn Parent Project ........................... SUCCESS [26.985s]
[INFO] Brooklyn Utilities to Support Testing (listeners etc)  SUCCESS [15.552s]
[INFO] Brooklyn Logback Includable Configuration ......... SUCCESS [3.140s]
[INFO] Brooklyn Common Utilities ......................... SUCCESS [18.239s]
[INFO] Brooklyn Groovy Utilities ......................... SUCCESS [11.663s]
[INFO] Brooklyn API ...................................... SUCCESS [5.871s]
[INFO] Brooklyn Test Support ............................. SUCCESS [5.806s]
[INFO] CAMP Server Parent Project ........................ SUCCESS [2.652s]
[INFO] CAMP Base ......................................... SUCCESS [18.271s]
[INFO] Brooklyn REST Swagger Apidoc Utilities ............ SUCCESS [9.070s]
[INFO] Brooklyn Logback Configuration .................... SUCCESS [2.942s]
[INFO] CAMP Server ....................................... SUCCESS [12.206s]
[INFO] Brooklyn Core ..................................... SUCCESS [3:32.535s]
[INFO] Brooklyn Policies ................................. SUCCESS [1:26.507s]
[INFO] Brooklyn Hazelcast Storage ........................ SUCCESS [12.282s]
[INFO] Brooklyn Jclouds Location Targets ................. SUCCESS [42.455s]
[INFO] Brooklyn Secure JMXMP Agent ....................... SUCCESS [29.685s]
[INFO] Brooklyn JMX RMI Agent ............................ SUCCESS [8.983s]
[INFO] Brooklyn Software Base ............................ SUCCESS [48.347s]
[INFO] Brooklyn Network Software Entities ................ SUCCESS [13.026s]
[INFO] Brooklyn OSGi Software Entities ................... SUCCESS [14.739s]
[INFO] Brooklyn Web App Software Entities ................ SUCCESS [59.834s]
[INFO] Brooklyn Messaging Software Entities .............. SUCCESS [20.838s]
[INFO] Brooklyn Database Software Entities ............... SUCCESS [17.954s]
[INFO] Brooklyn NoSQL Data Store Software Entities ....... SUCCESS [20.971s]
[INFO] Brooklyn Monitoring Software Entities ............. SUCCESS [14.479s]
[INFO] Brooklyn CAMP REST API ............................ SUCCESS [57.569s]
[INFO] Brooklyn REST API ................................. SUCCESS [9.814s]
[INFO] Brooklyn REST Server .............................. SUCCESS [1:08.591s]
[INFO] Brooklyn REST Client .............................. SUCCESS [18.414s]
[INFO] Brooklyn REST JavaScript Web GUI .................. SUCCESS [45.280s]
[INFO] Brooklyn Launcher ................................. SUCCESS [1:24.467s]
[INFO] Brooklyn Command Line Interface ................... SUCCESS [27.186s]
[INFO] Brooklyn All Things ............................... SUCCESS [41.793s]
[INFO] Brooklyn Distribution ............................. SUCCESS [38.589s]
[INFO] Brooklyn Downstream Project Parent ................ SUCCESS [0.188s]
[INFO] Brooklyn Simple Web Cluster Example ............... SUCCESS [20.341s]
[INFO] Brooklyn Global Web Fabric Example ................ SUCCESS [9.546s]
[INFO] Brooklyn Simple Messaging Publish-Subscribe Example  SUCCESS [14.902s]
[INFO] Brooklyn NoSQL Cluster Examples ................... SUCCESS [20.880s]
[INFO] Brooklyn QA ....................................... FAILURE [5.670s]
[INFO] ------------------------------------------------------------------------
[INFO] BUILD FAILURE
[INFO] ------------------------------------------------------------------------
[INFO] Total time: 21:11.550s
[INFO] Finished at: Mon Oct 06 13:09:05 UTC 2014
[INFO] Final Memory: 65M/408M
[INFO] ------------------------------------------------------------------------
[JENKINS] Archiving disabled
[JENKINS] Archiving disabled
[JENKINS] Archiving disabled
[JENKINS] Archiving disabled
[JENKINS] Archiving disabled
[JENKINS] Archiving disabled
[JENKINS] Archiving disabled
[JENKINS] Archiving disabled
[JENKINS] Archiving disabled
[JENKINS] Archiving disabled
[JENKINS] Archiving disabled
[JENKINS] Archiving disabled
[JENKINS] Archiving disabled
[JENKINS] Archiving disabled
[JENKINS] Archiving disabled
[JENKINS] Archiving disabled
[JENKINS] Archiving disabled
[JENKINS] Archiving disabled
[JENKINS] Archiving disabled
[JENKINS] Archiving disabled
[JENKINS] Archiving disabled
[JENKINS] Archiving disabled
[JENKINS] Archiving disabled
[JENKINS] Archiving disabled
[JENKINS] Archiving disabled
[JENKINS] Archiving disabled
[JENKINS] Archiving disabled
[JENKINS] Archiving disabled
[JENKINS] Archiving disabled
[JENKINS] Archiving disabled
[JENKINS] Archiving disabled
[JENKINS] Archiving disabled
[JENKINS] Archiving disabled
[JENKINS] Archiving disabled
[JENKINS] Archiving disabled
[JENKINS] Archiving disabled
[JENKINS] Archiving disabled
[JENKINS] Archiving disabled
[JENKINS] Archiving disabled
[JENKINS] Archiving disabled
[JENKINS] Archiving disabled
Waiting for Jenkins to finish collecting data
[ERROR] Failed to execute goal org.apache.maven.plugins:maven-compiler-plugin:3.1:compile
(default-compile) on project brooklyn-qa: Compilation failure: Compilation failure:
[ERROR] no more tokens - could not parse error message: ----------
[ERROR] 1. ERROR in <https://builds.apache.org/job/incubator-brooklyn-master-build/ws/usage/qa/src/main/java/brooklyn/qa/load/LoadTest.java>
(at line 3)
[ERROR] import static org.testng.Assert.assertEquals;
[ERROR] ^^^^^^^^^^
[ERROR] 
[ERROR] no more tokens - could not parse error message: The import org.testng cannot be resolved
[ERROR] ----------
[ERROR] 2. ERROR in <https://builds.apache.org/job/incubator-brooklyn-master-build/ws/usage/qa/src/main/java/brooklyn/qa/load/LoadTest.java>
(at line 15)
[ERROR] import org.testng.annotations.AfterMethod;
[ERROR] ^^^^^^^^^^
[ERROR] 
[ERROR] no more tokens - could not parse error message: The import org.testng cannot be resolved
[ERROR] ----------
[ERROR] 3. ERROR in <https://builds.apache.org/job/incubator-brooklyn-master-build/ws/usage/qa/src/main/java/brooklyn/qa/load/LoadTest.java>
(at line 16)
[ERROR] import org.testng.annotations.BeforeMethod;
[ERROR] ^^^^^^^^^^
[ERROR] 
[ERROR] no more tokens - could not parse error message: The import org.testng cannot be resolved
[ERROR] ----------
[ERROR] 4. ERROR in <https://builds.apache.org/job/incubator-brooklyn-master-build/ws/usage/qa/src/main/java/brooklyn/qa/load/LoadTest.java>
(at line 17)
[ERROR] import org.testng.annotations.Test;
[ERROR] ^^^^^^^^^^
[ERROR] 
[ERROR] no more tokens - could not parse error message: The import org.testng cannot be resolved
[ERROR] ----------
[ERROR] 5. ERROR in <https://builds.apache.org/job/incubator-brooklyn-master-build/ws/usage/qa/src/main/java/brooklyn/qa/load/LoadTest.java>
(at line 28)
[ERROR] import brooklyn.test.PerformanceTestUtils;
[ERROR] ^^^^^^^^^^^^^^^^^^^^^^^^^^^^^^^^^^
[ERROR] 
[ERROR] no more tokens - could not parse error message: The import brooklyn.test.PerformanceTestUtils
cannot be resolved
[ERROR] ----------
[ERROR] 6. ERROR in <https://builds.apache.org/job/incubator-brooklyn-master-build/ws/usage/qa/src/main/java/brooklyn/qa/load/LoadTest.java>
(at line 83)
[ERROR] @BeforeMethod(alwaysRun=true)
[ERROR] ^^^^^^^^^^^^
[ERROR] 
[ERROR] no more tokens - could not parse error message: BeforeMethod cannot be resolved to
a type
[ERROR] ----------
[ERROR] 7. ERROR in <https://builds.apache.org/job/incubator-brooklyn-master-build/ws/usage/qa/src/main/java/brooklyn/qa/load/LoadTest.java>
(at line 83)
[ERROR] @BeforeMethod(alwaysRun=true)
[ERROR] ^^^^^^^^^
[ERROR] 
[ERROR] no more tokens - could not parse error message: The attribute alwaysRun is undefined
for the annotation type BeforeMethod
[ERROR] ----------
[ERROR] 8. ERROR in <https://builds.apache.org/job/incubator-brooklyn-master-build/ws/usage/qa/src/main/java/brooklyn/qa/load/LoadTest.java>
(at line 120)
[ERROR] cpuFuture = PerformanceTestUtils.sampleProcessCpuTime(Duration.ONE_SECOND, "during
testProvisionAppsConcurrently");
[ERROR] ^^^^^^^^^^^^^^^^^^^^
[ERROR] 
[ERROR] no more tokens - could not parse error message: PerformanceTestUtils cannot be resolved
[ERROR] ----------
[ERROR] 9. ERROR in <https://builds.apache.org/job/incubator-brooklyn-master-build/ws/usage/qa/src/main/java/brooklyn/qa/load/LoadTest.java>
(at line 124)
[ERROR] @AfterMethod(alwaysRun=true)
[ERROR] ^^^^^^^^^^^
[ERROR] 
[ERROR] no more tokens - could not parse error message: AfterMethod cannot be resolved to
a type
[ERROR] ----------
[ERROR] 10. ERROR in <https://builds.apache.org/job/incubator-brooklyn-master-build/ws/usage/qa/src/main/java/brooklyn/qa/load/LoadTest.java>
(at line 124)
[ERROR] @AfterMethod(alwaysRun=true)
[ERROR] ^^^^^^^^^
[ERROR] 
[ERROR] no more tokens - could not parse error message: The attribute alwaysRun is undefined
for the annotation type AfterMethod
[ERROR] ----------
[ERROR] 11. ERROR in <https://builds.apache.org/job/incubator-brooklyn-master-build/ws/usage/qa/src/main/java/brooklyn/qa/load/LoadTest.java>
(at line 142)
[ERROR] @Test(groups="Acceptance")
[ERROR] ^^^^
[ERROR] 
[ERROR] no more tokens - could not parse error message: Test cannot be resolved to a type
[ERROR] ----------
[ERROR] 12. ERROR in <https://builds.apache.org/job/incubator-brooklyn-master-build/ws/usage/qa/src/main/java/brooklyn/qa/load/LoadTest.java>
(at line 142)
[ERROR] @Test(groups="Acceptance")
[ERROR] ^^^^^^
[ERROR] 
[ERROR] no more tokens - could not parse error message: The attribute groups is undefined
for the annotation type Test
[ERROR] ----------
[ERROR] 13. ERROR in <https://builds.apache.org/job/incubator-brooklyn-master-build/ws/usage/qa/src/main/java/brooklyn/qa/load/LoadTest.java>
(at line 158)
[ERROR] assertEquals(app.getAttribute(Startable.SERVICE_UP), (Boolean)true);
[ERROR] ^^^^^^^^^^^^
[ERROR] 
[ERROR] no more tokens - could not parse error message: The method assertEquals(Boolean, Boolean)
is undefined for the type LoadTest
[ERROR] ----------
[ERROR] 14. ERROR in <https://builds.apache.org/job/incubator-brooklyn-master-build/ws/usage/qa/src/main/java/brooklyn/qa/load/LoadTest.java>
(at line 172)
[ERROR] @Test(groups="Acceptance")
[ERROR] ^^^^
[ERROR] 
[ERROR] no more tokens - could not parse error message: Test cannot be resolved to a type
[ERROR] ----------
[ERROR] 15. ERROR in <https://builds.apache.org/job/incubator-brooklyn-master-build/ws/usage/qa/src/main/java/brooklyn/qa/load/LoadTest.java>
(at line 172)
[ERROR] @Test(groups="Acceptance")
[ERROR] ^^^^^^
[ERROR] 
[ERROR] no more tokens - could not parse error message: The attribute groups is undefined
for the annotation type Test
[ERROR] ----------
[ERROR] 16. ERROR in <https://builds.apache.org/job/incubator-brooklyn-master-build/ws/usage/qa/src/main/java/brooklyn/qa/load/LoadTest.java>
(at line 196)
[ERROR] assertEquals(app.getAttribute(Startable.SERVICE_UP), (Boolean)true);
[ERROR] ^^^^^^^^^^^^
[ERROR] -> [Help 1]
[ERROR] 
[ERROR] To see the full stack trace of the errors, re-run Maven with the -e switch.
[ERROR] Re-run Maven using the -X switch to enable full debug logging.
[ERROR] 
[ERROR] For more information about the errors and possible solutions, please read the following
articles:
[ERROR] [Help 1] http://cwiki.apache.org/confluence/display/MAVEN/MojoFailureException
[ERROR] 
[ERROR] After correcting the problems, you can resume the build with the command
[ERROR]   mvn <goals> -rf :brooklyn-qa
channel stopped

Mime
View raw message