bookkeeper-issues mailing list archives

Site index · List index
Message view « Date » · « Thread »
Top « Date » · « Thread »
From Apache Jenkins Server <jenk...@builds.apache.org>
Subject Build failed in Jenkins: bookkeeper_release_branch_47_java8 #603
Date Fri, 06 Dec 2019 14:03:16 GMT
See <https://builds.apache.org/job/bookkeeper_release_branch_47_java8/603/display/redirect>

Changes:


------------------------------------------
[...truncated 1.50 MB...]
2019-12-06T14:01:48.528 [INFO] Downloading from central: https://repo.maven.apache.org/maven2/com/twitter/common/stats/0.0.64/stats-0.0.64.jar
2019-12-06T14:01:48.528 [INFO] Downloading from central: https://repo.maven.apache.org/maven2/com/twitter/common/stats-time-series/0.0.36/stats-time-series-0.0.36.jar
2019-12-06T14:01:48.529 [INFO] Downloading from central: https://repo.maven.apache.org/maven2/com/twitter/common/net-http-handlers/0.0.39/net-http-handlers-0.0.39.jar
2019-12-06T14:01:48.529 [INFO] Downloading from central: https://repo.maven.apache.org/maven2/com/twitter/common/stats-jvm/0.0.33/stats-jvm-0.0.33.jar
[JENKINS] Archiving disabled
[JENKINS] Archiving disabled
[JENKINS] Archiving disabled
[JENKINS] Archiving disabled
[JENKINS] Archiving disabled
[JENKINS] Archiving disabled
[JENKINS] Archiving disabled
[JENKINS] Archiving disabled
[JENKINS] Archiving disabled
[JENKINS] Archiving disabled
[JENKINS] Archiving disabled
[JENKINS] Archiving disabled
[JENKINS] Archiving disabled
[JENKINS] Archiving disabled
[JENKINS] Archiving disabled
[JENKINS] Archiving disabled
[JENKINS] Archiving disabled
[JENKINS] Archiving disabled
[JENKINS] Archiving disabled
[JENKINS] Archiving disabled
[JENKINS] Archiving disabled
[JENKINS] Archiving disabled
[JENKINS] Archiving disabled
[JENKINS] Archiving disabled
[JENKINS] Archiving disabled
[JENKINS] Archiving disabled
[JENKINS] Archiving disabled
[JENKINS] Archiving disabled
[JENKINS] Archiving disabled
[JENKINS] Archiving disabled
[JENKINS] Archiving disabled
[JENKINS] Archiving disabled
[JENKINS] Archiving disabled
[JENKINS] Archiving disabled
[JENKINS] Archiving disabled
[JENKINS] Archiving disabled
[JENKINS] Archiving disabled
[JENKINS] Archiving disabled
[JENKINS] Archiving disabled
[JENKINS] Archiving disabled
[JENKINS] Archiving disabled
[JENKINS] Archiving disabled
[JENKINS] Archiving disabled
[JENKINS] Archiving disabled
[JENKINS] Archiving disabled
[JENKINS] Archiving disabled
[JENKINS] Archiving disabled
[JENKINS] Archiving disabled
[JENKINS] Archiving disabled
[JENKINS] Archiving disabled
[JENKINS] Archiving disabled
[JENKINS] Archiving disabled
[JENKINS] Archiving disabled
[JENKINS] Archiving disabled
[JENKINS] Archiving disabled
[JENKINS] Archiving disabled
[JENKINS] Archiving disabled
[JENKINS] Archiving disabled
[JENKINS] Archiving disabled
[JENKINS] Archiving disabled
[JENKINS] Archiving disabled
[JENKINS] Archiving disabled
[JENKINS] Archiving disabled
[JENKINS] Archiving disabled
[JENKINS] Archiving disabled
[JENKINS] Archiving disabled
[JENKINS] Archiving disabled
[JENKINS] Archiving disabled
[JENKINS] Archiving disabled
[JENKINS] Archiving disabled
[JENKINS] Archiving disabled
[JENKINS] Archiving disabled
[JENKINS] Archiving disabled
[JENKINS] Archiving disabled
[JENKINS] Archiving disabled
[JENKINS] Archiving disabled
[JENKINS] Archiving disabled
2019-12-06T14:02:56.974 [INFO] ------------------------------------------------------------------------
2019-12-06T14:02:56.974 [INFO] Reactor Summary for Apache BookKeeper :: Parent 4.7.4-SNAPSHOT:
2019-12-06T14:02:56.974 [INFO] 
2019-12-06T14:02:56.975 [INFO] Apache BookKeeper :: Parent ........................ SUCCESS
[ 13.981 s]
2019-12-06T14:02:56.975 [INFO] Apache BookKeeper :: Build Tools ................... SUCCESS
[  5.945 s]
2019-12-06T14:02:56.975 [INFO] Apache BookKeeper :: Circe Checksum Library ........ SUCCESS
[01:41 min]
2019-12-06T14:02:56.975 [INFO] Apache BookKeeper :: Stats API ..................... SUCCESS
[ 13.223 s]
2019-12-06T14:02:56.975 [INFO] Apache BookKeeper :: Common ........................ SUCCESS
[ 30.407 s]
2019-12-06T14:02:56.975 [INFO] Apache BookKeeper :: Protocols ..................... SUCCESS
[ 20.457 s]
2019-12-06T14:02:56.975 [INFO] Apache BookKeeper :: Http :: Http Server ........... SUCCESS
[  9.017 s]
2019-12-06T14:02:56.976 [INFO] Apache BookKeeper :: Server ........................ SUCCESS
[  01:15 h]
2019-12-06T14:02:56.976 [INFO] Apache BookKeeper :: Tools ......................... SUCCESS
[ 34.942 s]
2019-12-06T14:02:56.976 [INFO] Apache BookKeeper :: Benchmark ..................... SUCCESS
[01:26 min]
2019-12-06T14:02:56.976 [INFO] Apache BookKeeper :: Stats Providers :: Twitter Finagle Stats
SUCCESS [ 10.379 s]
2019-12-06T14:02:56.976 [INFO] Apache BookKeeper :: Stats Providers :: Twitter Science Stats
SUCCESS [ 18.830 s]
2019-12-06T14:02:56.976 [INFO] Apache BookKeeper :: Stats Providers :: Twitter Ostrich Stats
SUCCESS [ 10.676 s]
2019-12-06T14:02:56.976 [INFO] Apache BookKeeper :: Stats Providers :: Codahale Metrics SUCCESS
[ 13.107 s]
2019-12-06T14:02:56.976 [INFO] Apache BookKeeper :: Stats Providers :: Prometheus . SUCCESS
[ 13.154 s]
2019-12-06T14:02:56.976 [INFO] Apache BookKeeper :: Stats Providers ............... SUCCESS
[  1.981 s]
2019-12-06T14:02:56.976 [INFO] Apache BookKeeper :: Bookkeeper Http :: Twitter Http Server
SUCCESS [ 14.925 s]
2019-12-06T14:02:56.976 [INFO] Apache BookKeeper :: Bookkeeper Http :: Vertx Http Server SUCCESS
[ 15.000 s]
2019-12-06T14:02:56.977 [INFO] Apache BookKeeper :: Http .......................... SUCCESS
[  2.142 s]
2019-12-06T14:02:56.977 [INFO] Apache BookKeeper :: Shaded :: Parent .............. SUCCESS
[  2.106 s]
2019-12-06T14:02:56.977 [INFO] Apache BookKeeper :: Shaded :: bookkeeper-server-shaded SUCCESS
[  9.436 s]
2019-12-06T14:02:56.977 [INFO] Apache BookKeeper :: Shaded :: bookkeeper-server-tests-shaded
SUCCESS [  4.719 s]
2019-12-06T14:02:56.977 [INFO] Apache BookKeeper :: DistributedLog :: Parent ...... SUCCESS
[  2.100 s]
2019-12-06T14:02:56.977 [INFO] Apache BookKeeper :: DistributedLog :: Common ...... SUCCESS
[ 15.656 s]
2019-12-06T14:02:56.977 [INFO] Apache BookKeeper :: DistributedLog :: Protocol .... SUCCESS
[ 15.123 s]
2019-12-06T14:02:56.977 [INFO] Apache BookKeeper :: DistributedLog :: Core Library  SUCCESS
[13:45 min]
2019-12-06T14:02:56.977 [INFO] Apache BookKeeper :: Shaded :: distributedlog-core-shaded SUCCESS
[ 21.682 s]
2019-12-06T14:02:56.977 [INFO] Apache BookKeeper :: Tests ......................... SUCCESS
[  2.091 s]
2019-12-06T14:02:56.977 [INFO] Apache BookKeeper :: Tests :: Test Shaded Jars ..... SUCCESS
[  2.060 s]
2019-12-06T14:02:56.978 [INFO] Apache BookKeeper :: Tests :: bookkeeper-server-shaded test
SUCCESS [  6.666 s]
2019-12-06T14:02:56.978 [INFO] Apache BookKeeper :: Tests :: bookkeeper-server-tests-shaded
test SUCCESS [  8.658 s]
2019-12-06T14:02:56.978 [INFO] Apache BookKeeper :: Tests :: distributedlog-core-shaded test
SUCCESS [  8.664 s]
2019-12-06T14:02:56.978 [INFO] Apache BookKeeper :: Tests :: Docker Images ........ SUCCESS
[  2.084 s]
2019-12-06T14:02:56.978 [INFO] Apache BookKeeper :: Tests :: Docker Images :: All Released
Versions SUCCESS [  2.093 s]
2019-12-06T14:02:56.978 [INFO] Apache BookKeeper :: Stream Storage :: Parent ...... SUCCESS
[  2.442 s]
2019-12-06T14:02:56.978 [INFO] Apache BookKeeper :: Stream Storage :: Common Classes for Tests
SUCCESS [  8.077 s]
2019-12-06T14:02:56.978 [INFO] Apache BookKeeper :: Stream Storage :: Common ...... SUCCESS
[ 18.045 s]
2019-12-06T14:02:56.978 [INFO] Apache BookKeeper :: Stream Storage :: Proto ....... SUCCESS
[ 16.530 s]
2019-12-06T14:02:56.978 [INFO] Apache BookKeeper :: Stream Storage :: Storage :: Parent SUCCESS
[  2.128 s]
2019-12-06T14:02:56.979 [INFO] Apache BookKeeper :: Stream Storage :: Storage :: Api SUCCESS
[  5.779 s]
2019-12-06T14:02:56.979 [INFO] Apache BookKeeper :: Stream Storage :: API ......... SUCCESS
[  5.796 s]
2019-12-06T14:02:56.979 [INFO] Apache BookKeeper :: Stream Storage :: Clients :: Parent SUCCESS
[  2.088 s]
2019-12-06T14:02:56.979 [INFO] Apache BookKeeper :: Stream Storage :: Clients :: Java Client
:: Parent SUCCESS [  2.140 s]
2019-12-06T14:02:56.979 [INFO] Apache BookKeeper :: Stream Storage :: Clients :: Java Client
:: Base SUCCESS [ 47.342 s]
2019-12-06T14:02:56.979 [INFO] Apache BookKeeper :: Stream Storage :: State Library SUCCESS
[01:20 min]
2019-12-06T14:02:56.979 [INFO] Apache BookKeeper :: Stream Storage :: Storage :: Impl SUCCESS
[01:08 min]
2019-12-06T14:02:56.979 [INFO] Apache BookKeeper :: Stream Storage :: Clients :: Java Client
:: KV SUCCESS [ 19.295 s]
2019-12-06T14:02:56.979 [INFO] Apache BookKeeper :: Stream Storage :: Clients :: Java Client
SUCCESS [  8.412 s]
2019-12-06T14:02:56.979 [INFO] Apache BookKeeper :: Stream Storage :: Server ...... SUCCESS
[ 13.234 s]
2019-12-06T14:02:56.980 [INFO] Apache BookKeeper :: Dist (Parent) ................. SUCCESS
[  5.361 s]
2019-12-06T14:02:56.980 [INFO] Apache BookKeeper :: Dist (Server) ................. SUCCESS
[ 24.843 s]
2019-12-06T14:02:56.980 [INFO] Apache BookKeeper :: Tests :: Docker Images :: All Versions
SUCCESS [  3.343 s]
2019-12-06T14:02:56.980 [INFO] Apache BookKeeper :: Tests :: Docker Images :: Current Version
SUCCESS [  2.897 s]
2019-12-06T14:02:56.980 [INFO] Apache BookKeeper :: Tests :: Utility module for Arquillian
based integration tests SUCCESS [ 18.112 s]
2019-12-06T14:02:56.980 [INFO] Apache BookKeeper :: Tests :: Common topologies for Docker
based integration tests SUCCESS [ 12.121 s]
2019-12-06T14:02:56.980 [INFO] Apache BookKeeper :: Tests :: Base module for Arquillian based
integration tests SUCCESS [  3.404 s]
2019-12-06T14:02:56.980 [INFO] Apache BookKeeper :: Tests :: Base module for Arquillian based
integration tests using groovy SUCCESS [  4.733 s]
2019-12-06T14:02:56.980 [INFO] Apache BookKeeper :: Tests :: Backward Compatibility SUCCESS
[  2.882 s]
2019-12-06T14:02:56.980 [INFO] Apache BookKeeper :: Tests :: Backward Compatibility :: Test
upgrade between all released versions and current version SUCCESS [  9.743 s]
2019-12-06T14:02:56.981 [INFO] Apache BookKeeper :: Tests :: Backward Compatibility :: Test
upgrade between 4.1.0 and current version SUCCESS [  4.952 s]
2019-12-06T14:02:56.981 [INFO] Apache BookKeeper :: Tests :: Backward Compatibility :: Test
compat between old version and new version of hierarchical ledger manager SUCCESS [  4.950
s]
2019-12-06T14:02:56.981 [INFO] Apache BookKeeper :: Tests :: Backward Compatibility :: Test
upgrade between 4.1.0 and current version (with hostname bookie ID) SUCCESS [  4.836 s]
2019-12-06T14:02:56.981 [INFO] Apache BookKeeper :: Tests :: Backward Compatibility :: Test
recovery does not work when password no in metadata SUCCESS [  5.497 s]
2019-12-06T14:02:56.981 [INFO] Apache BookKeeper :: Tests :: Backward Compatibility :: Test
upgrade 4.1.0 to current in cluster with cookies SUCCESS [  5.297 s]
2019-12-06T14:02:56.981 [INFO] Apache BookKeeper :: Tests :: Backward Compatibility :: Test
old clients working on current server SUCCESS [  4.848 s]
2019-12-06T14:02:56.981 [INFO] Apache BookKeeper :: Tests :: Backward Compatibility :: Test
upgrade between yahoo custom version and current SUCCESS [  6.937 s]
2019-12-06T14:02:56.981 [INFO] Apache BookKeeper :: Tests :: Integration .......... SUCCESS
[  2.123 s]
2019-12-06T14:02:56.981 [INFO] Apache BookKeeper :: Tests :: Integration :: Smoke test SUCCESS
[  5.679 s]
2019-12-06T14:02:56.981 [INFO] Apache BookKeeper :: Tests :: Integration :: Standalone test
SUCCESS [  4.101 s]
2019-12-06T14:02:56.981 [INFO] Apache BookKeeper :: Tests :: Integration :: Cluster test SUCCESS
[  5.252 s]
2019-12-06T14:02:56.981 [INFO] Apache BookKeeper :: Tests :: Bash Scripts Test .... SUCCESS
[  3.351 s]
2019-12-06T14:02:56.982 [INFO] Apache BookKeeper :: Dist (All) .................... SUCCESS
[ 14.990 s]
2019-12-06T14:02:56.982 [INFO] Apache BookKeeper :: microbenchmarks ............... FAILURE
[  2.095 s]
2019-12-06T14:02:56.982 [INFO] Apache BookKeeper :: DistributedLog :: IO :: FileSystem SKIPPED
2019-12-06T14:02:56.982 [INFO] Apache BookKeeper :: DistributedLog :: IO .......... SKIPPED
2019-12-06T14:02:56.982 [INFO] Apache BookKeeper :: Stream Storage :: CLI ......... SKIPPED
2019-12-06T14:02:56.982 [INFO] ------------------------------------------------------------------------
2019-12-06T14:02:56.982 [INFO] BUILD FAILURE
2019-12-06T14:02:56.982 [INFO] ------------------------------------------------------------------------
2019-12-06T14:02:56.982 [INFO] Total time:  01:50 h
2019-12-06T14:02:56.983 [INFO] Finished at: 2019-12-06T14:02:56Z
2019-12-06T14:02:56.983 [INFO] ------------------------------------------------------------------------
Waiting for Jenkins to finish collecting data
2019-12-06T14:02:59.040 [ERROR] Failed to execute goal org.apache.maven.plugins:maven-remote-resources-plugin:1.5:process
(process-resource-bundles) on project microbenchmarks: Failed to resolve dependencies for
one or more projects in the reactor. Reason: Missing:
2019-12-06T14:02:59.040 [ERROR] ----------
2019-12-06T14:02:59.040 [ERROR] 1) com.twitter.common:stats:jar:0.0.64
2019-12-06T14:02:59.040 [ERROR] 
2019-12-06T14:02:59.040 [ERROR] Try downloading the file manually from the project website.
2019-12-06T14:02:59.040 [ERROR] 
2019-12-06T14:02:59.040 [ERROR] Then, install it using the command:
2019-12-06T14:02:59.040 [ERROR] mvn install:install-file -DgroupId=com.twitter.common -DartifactId=stats
-Dversion=0.0.64 -Dpackaging=jar -Dfile=/path/to/file
2019-12-06T14:02:59.040 [ERROR] 
2019-12-06T14:02:59.040 [ERROR] Alternatively, if you host your own repository you can deploy
the file there:
2019-12-06T14:02:59.040 [ERROR] mvn deploy:deploy-file -DgroupId=com.twitter.common -DartifactId=stats
-Dversion=0.0.64 -Dpackaging=jar -Dfile=/path/to/file -Durl=[url] -DrepositoryId=[id]
2019-12-06T14:02:59.040 [ERROR] 
2019-12-06T14:02:59.040 [ERROR] Path to dependency:
2019-12-06T14:02:59.040 [ERROR] 1) org.apache.bookkeeper:microbenchmarks:jar:4.7.4-SNAPSHOT
2019-12-06T14:02:59.040 [ERROR] 2) org.apache.bookkeeper.stats:twitter-science-provider:jar:4.7.4-SNAPSHOT
2019-12-06T14:02:59.040 [ERROR] 3) com.twitter.common:stats:jar:0.0.64
2019-12-06T14:02:59.040 [ERROR] 
2019-12-06T14:02:59.040 [ERROR] 2) com.twitter.common:stats-time-series:jar:0.0.36
2019-12-06T14:02:59.041 [ERROR] 
2019-12-06T14:02:59.041 [ERROR] Try downloading the file manually from the project website.
2019-12-06T14:02:59.041 [ERROR] 
2019-12-06T14:02:59.041 [ERROR] Then, install it using the command:
2019-12-06T14:02:59.041 [ERROR] mvn install:install-file -DgroupId=com.twitter.common -DartifactId=stats-time-series
-Dversion=0.0.36 -Dpackaging=jar -Dfile=/path/to/file
2019-12-06T14:02:59.041 [ERROR] 
2019-12-06T14:02:59.041 [ERROR] Alternatively, if you host your own repository you can deploy
the file there:
2019-12-06T14:02:59.041 [ERROR] mvn deploy:deploy-file -DgroupId=com.twitter.common -DartifactId=stats-time-series
-Dversion=0.0.36 -Dpackaging=jar -Dfile=/path/to/file -Durl=[url] -DrepositoryId=[id]
2019-12-06T14:02:59.041 [ERROR] 
2019-12-06T14:02:59.041 [ERROR] Path to dependency:
2019-12-06T14:02:59.041 [ERROR] 1) org.apache.bookkeeper:microbenchmarks:jar:4.7.4-SNAPSHOT
2019-12-06T14:02:59.041 [ERROR] 2) org.apache.bookkeeper.stats:twitter-science-provider:jar:4.7.4-SNAPSHOT
2019-12-06T14:02:59.041 [ERROR] 3) com.twitter.common:stats-time-series:jar:0.0.36
2019-12-06T14:02:59.041 [ERROR] 
2019-12-06T14:02:59.041 [ERROR] 3) com.twitter.common:stats-jvm:jar:0.0.33
2019-12-06T14:02:59.041 [ERROR] 
2019-12-06T14:02:59.041 [ERROR] Try downloading the file manually from the project website.
2019-12-06T14:02:59.041 [ERROR] 
2019-12-06T14:02:59.041 [ERROR] Then, install it using the command:
2019-12-06T14:02:59.041 [ERROR] mvn install:install-file -DgroupId=com.twitter.common -DartifactId=stats-jvm
-Dversion=0.0.33 -Dpackaging=jar -Dfile=/path/to/file
2019-12-06T14:02:59.042 [ERROR] 
2019-12-06T14:02:59.042 [ERROR] Alternatively, if you host your own repository you can deploy
the file there:
2019-12-06T14:02:59.042 [ERROR] mvn deploy:deploy-file -DgroupId=com.twitter.common -DartifactId=stats-jvm
-Dversion=0.0.33 -Dpackaging=jar -Dfile=/path/to/file -Durl=[url] -DrepositoryId=[id]
2019-12-06T14:02:59.042 [ERROR] 
2019-12-06T14:02:59.042 [ERROR] Path to dependency:
2019-12-06T14:02:59.042 [ERROR] 1) org.apache.bookkeeper:microbenchmarks:jar:4.7.4-SNAPSHOT
2019-12-06T14:02:59.042 [ERROR] 2) org.apache.bookkeeper.stats:twitter-science-provider:jar:4.7.4-SNAPSHOT
2019-12-06T14:02:59.042 [ERROR] 3) com.twitter.common:stats-jvm:jar:0.0.33
2019-12-06T14:02:59.042 [ERROR] 
2019-12-06T14:02:59.042 [ERROR] 4) com.twitter.common:net-http-handlers:jar:0.0.39
2019-12-06T14:02:59.042 [ERROR] 
2019-12-06T14:02:59.042 [ERROR] Try downloading the file manually from the project website.
2019-12-06T14:02:59.042 [ERROR] 
2019-12-06T14:02:59.042 [ERROR] Then, install it using the command:
2019-12-06T14:02:59.042 [ERROR] mvn install:install-file -DgroupId=com.twitter.common -DartifactId=net-http-handlers
-Dversion=0.0.39 -Dpackaging=jar -Dfile=/path/to/file
2019-12-06T14:02:59.042 [ERROR] 
2019-12-06T14:02:59.042 [ERROR] Alternatively, if you host your own repository you can deploy
the file there:
2019-12-06T14:02:59.042 [ERROR] mvn deploy:deploy-file -DgroupId=com.twitter.common -DartifactId=net-http-handlers
-Dversion=0.0.39 -Dpackaging=jar -Dfile=/path/to/file -Durl=[url] -DrepositoryId=[id]
2019-12-06T14:02:59.042 [ERROR] 
2019-12-06T14:02:59.042 [ERROR] Path to dependency:
2019-12-06T14:02:59.042 [ERROR] 1) org.apache.bookkeeper:microbenchmarks:jar:4.7.4-SNAPSHOT
2019-12-06T14:02:59.043 [ERROR] 2) org.apache.bookkeeper.stats:twitter-science-provider:jar:4.7.4-SNAPSHOT
2019-12-06T14:02:59.043 [ERROR] 3) com.twitter.common:net-http-handlers:jar:0.0.39
2019-12-06T14:02:59.043 [ERROR] 
2019-12-06T14:02:59.043 [ERROR] ----------
2019-12-06T14:02:59.043 [ERROR] 4 required artifacts are missing.
2019-12-06T14:02:59.043 [ERROR] 
2019-12-06T14:02:59.043 [ERROR] for artifact:
2019-12-06T14:02:59.043 [ERROR] org.apache.bookkeeper:microbenchmarks:jar:4.7.4-SNAPSHOT
2019-12-06T14:02:59.043 [ERROR] 
2019-12-06T14:02:59.043 [ERROR] from the specified remote repositories:
2019-12-06T14:02:59.043 [ERROR] Nexus (http://repository.apache.org/snapshots, releases=false,
snapshots=true),
2019-12-06T14:02:59.043 [ERROR] central (https://repo.maven.apache.org/maven2, releases=true,
snapshots=false)
2019-12-06T14:02:59.044 [ERROR] -> [Help 1]
2019-12-06T14:02:59.044 [ERROR] 
2019-12-06T14:02:59.044 [ERROR] To see the full stack trace of the errors, re-run Maven with
the -e switch.
2019-12-06T14:02:59.044 [ERROR] Re-run Maven using the -X switch to enable full debug logging.
2019-12-06T14:02:59.044 [ERROR] 
2019-12-06T14:02:59.044 [ERROR] For more information about the errors and possible solutions,
please read the following articles:
2019-12-06T14:02:59.044 [ERROR] [Help 1] http://cwiki.apache.org/confluence/display/MAVEN/MojoExecutionException
2019-12-06T14:02:59.045 [ERROR] 
2019-12-06T14:02:59.045 [ERROR] After correcting the problems, you can resume the build with
the command
2019-12-06T14:02:59.045 [ERROR]   mvn <goals> -rf :microbenchmarks
channel stopped

Mime
View raw message