bookkeeper-distributedlog-dev mailing list archives

Site index · List index
Message view « Date » · « Thread »
Top « Date » · « Thread »
From Apache Jenkins Server <jenk...@builds.apache.org>
Subject Build failed in Jenkins: distributedlog-nightly-build #90
Date Tue, 18 Oct 2016 08:44:41 GMT
See <https://builds.apache.org/job/distributedlog-nightly-build/90/>

------------------------------------------
[...truncated 148 lines...]
[WARNING] <https://builds.apache.org/job/distributedlog-nightly-build/ws/distributedlog-core/src/test/java/com/twitter/distributedlog/TestDistributedLogConfiguration.java>:[113,44]
getBKClientReadTimeout() in com.twitter.distributedlog.DistributedLogConfiguration has been
deprecated
[WARNING] <https://builds.apache.org/job/distributedlog-nightly-build/ws/distributedlog-core/src/test/java/com/twitter/distributedlog/TestDistributedLogConfiguration.java>:[121,44]
getBKClientReadTimeout() in com.twitter.distributedlog.DistributedLogConfiguration has been
deprecated
[WARNING] <https://builds.apache.org/job/distributedlog-nightly-build/ws/distributedlog-core/src/test/java/com/twitter/distributedlog/bk/TestLedgerAllocator.java>:[365,33]
isThrow() in com.twitter.util.Future has been deprecated
[INFO] 
[INFO] --- maven-surefire-plugin:2.9:test (default-test) @ distributedlog-core ---
[INFO] Surefire report directory: <https://builds.apache.org/job/distributedlog-nightly-build/ws/distributedlog-core/target/surefire-reports>

-------------------------------------------------------
 T E S T S
-------------------------------------------------------

-------------------------------------------------------
 T E S T S
-------------------------------------------------------
Running com.twitter.distributedlog.TestBKDistributedLogManager
Tests run: 30, Failures: 0, Errors: 13, Skipped: 0, Time elapsed: 918.649 sec <<<
FAILURE!
Running com.twitter.distributedlog.limiter.TestRequestLimiter
Tests run: 1, Failures: 0, Errors: 0, Skipped: 0, Time elapsed: 0.159 sec
Running com.twitter.distributedlog.TestDistributedLogConfiguration
Tests run: 5, Failures: 0, Errors: 0, Skipped: 0, Time elapsed: 0.294 sec
Running com.twitter.distributedlog.TestLogSegmentsZK
Tests run: 4, Failures: 0, Errors: 0, Skipped: 0, Time elapsed: 36.814 sec
Running com.twitter.distributedlog.bk.TestLedgerAllocator
Tests run: 9, Failures: 0, Errors: 0, Skipped: 2, Time elapsed: 24.97 sec
Running com.twitter.distributedlog.bk.TestLedgerAllocatorPool
Tests run: 6, Failures: 0, Errors: 0, Skipped: 0, Time elapsed: 60.13 sec
Running com.twitter.distributedlog.TestAppendOnlyStreamWriter
Tests run: 8, Failures: 0, Errors: 5, Skipped: 0, Time elapsed: 338.371 sec <<< FAILURE!
Running com.twitter.distributedlog.TestSequenceID
Tests run: 5, Failures: 0, Errors: 0, Skipped: 0, Time elapsed: 55.451 sec
Running com.twitter.distributedlog.zk.TestZKVersionedSetOp
Tests run: 2, Failures: 0, Errors: 0, Skipped: 0, Time elapsed: 0.272 sec
Running com.twitter.distributedlog.zk.TestZKWatcherManager
Tests run: 1, Failures: 0, Errors: 0, Skipped: 0, Time elapsed: 0.161 sec
Running com.twitter.distributedlog.zk.TestZKTransaction
Tests run: 2, Failures: 0, Errors: 0, Skipped: 0, Time elapsed: 0.52 sec
Running com.twitter.distributedlog.impl.TestZKLogSegmentMetadataStore
Tests run: 19, Failures: 0, Errors: 0, Skipped: 0, Time elapsed: 19.866 sec
Running com.twitter.distributedlog.impl.TestZKNamespaceWatcher
Tests run: 2, Failures: 0, Errors: 0, Skipped: 0, Time elapsed: 41.17 sec
Running com.twitter.distributedlog.impl.TestZKLogSegmentFilters
Tests run: 1, Failures: 0, Errors: 0, Skipped: 0, Time elapsed: 0.253 sec
Running com.twitter.distributedlog.impl.federated.TestFederatedZKLogMetadataStore
Tests run: 11, Failures: 0, Errors: 0, Skipped: 0, Time elapsed: 67.245 sec
Running com.twitter.distributedlog.impl.metadata.TestZKLogMetadata
Tests run: 1, Failures: 0, Errors: 0, Skipped: 0, Time elapsed: 0.186 sec
Running com.twitter.distributedlog.impl.metadata.TestZKLogMetadataForWriter
Tests run: 13, Failures: 0, Errors: 0, Skipped: 0, Time elapsed: 11.6 sec
Running com.twitter.distributedlog.impl.metadata.TestZKLogMetadataForWriterUtilFunctions
Tests run: 9, Failures: 0, Errors: 0, Skipped: 0, Time elapsed: 0.221 sec
Running com.twitter.distributedlog.impl.TestZKLogMetadataStore
Tests run: 3, Failures: 0, Errors: 0, Skipped: 0, Time elapsed: 8.539 sec
Running com.twitter.distributedlog.TestWriteLimiter
Tests run: 10, Failures: 0, Errors: 0, Skipped: 0, Time elapsed: 0.166 sec
Running com.twitter.distributedlog.TestTruncate
Running com.twitter.distributedlog.TestAppendOnlyStreamReader
Tests run: 5, Failures: 0, Errors: 5, Skipped: 0, Time elapsed: 314.868 sec <<< FAILURE!
Running com.twitter.distributedlog.TestNonBlockingReadsMultiReader
Tests run: 1, Failures: 0, Errors: 1, Skipped: 0, Time elapsed: 69.33 sec <<< FAILURE!
Running com.twitter.distributedlog.util.TestConfUtils
Tests run: 1, Failures: 0, Errors: 0, Skipped: 0, Time elapsed: 0.274 sec
Running com.twitter.distributedlog.util.TestTimeSequencer
Tests run: 1, Failures: 0, Errors: 0, Skipped: 0, Time elapsed: 0.278 sec
Running com.twitter.distributedlog.util.TestFutureUtils
Tests run: 1, Failures: 0, Errors: 0, Skipped: 0, Time elapsed: 0.604 sec
Running com.twitter.distributedlog.util.TestDLUtils
Tests run: 13, Failures: 0, Errors: 0, Skipped: 0, Time elapsed: 0.215 sec
Running com.twitter.distributedlog.util.TestPermitManager
Tests run: 2, Failures: 0, Errors: 0, Skipped: 0, Time elapsed: 0.24 sec
Running com.twitter.distributedlog.util.TestUtils
Tests run: 2, Failures: 0, Errors: 0, Skipped: 0, Time elapsed: 3.562 sec
Running com.twitter.distributedlog.util.TestSafeQueueingFuturePool
Tests run: 5, Failures: 0, Errors: 0, Skipped: 0, Time elapsed: 0.709 sec
Running com.twitter.distributedlog.TestBKLogSegmentWriter
Tests run: 10, Failures: 0, Errors: 0, Skipped: 0, Time elapsed: 32.989 sec
Running com.twitter.distributedlog.namespace.TestDistributedLogNamespaceBuilder
Tests run: 10, Failures: 0, Errors: 0, Skipped: 0, Time elapsed: 11.953 sec
Running com.twitter.distributedlog.TestRollLogSegments
Tests run: 5, Failures: 0, Errors: 4, Skipped: 0, Time elapsed: 76.463 sec <<< FAILURE!
Running com.twitter.distributedlog.TestDLMTestUtil
Tests run: 1, Failures: 0, Errors: 0, Skipped: 0, Time elapsed: 0.804 sec
Running com.twitter.distributedlog.selector.TestLogRecordSelectors
Tests run: 4, Failures: 0, Errors: 0, Skipped: 0, Time elapsed: 0.182 sec
Running com.twitter.distributedlog.TestEntry
Tests run: 4, Failures: 0, Errors: 0, Skipped: 0, Time elapsed: 0.634 sec
Running com.twitter.distributedlog.TestFailureAndRecovery
Tests run: 5, Failures: 0, Errors: 0, Skipped: 0, Time elapsed: 42.826 sec
Running com.twitter.distributedlog.TestLogSegmentCreation
Tests run: 1, Failures: 0, Errors: 0, Skipped: 0, Time elapsed: 16.746 sec
Running com.twitter.distributedlog.TestEnvelopedEntry
Tests run: 2, Failures: 0, Errors: 0, Skipped: 0, Time elapsed: 0.227 sec
Running com.twitter.distributedlog.admin.TestDistributedLogAdmin
Tests run: 1, Failures: 0, Errors: 0, Skipped: 1, Time elapsed: 8.026 sec
Running com.twitter.distributedlog.admin.TestDLCK
Tests run: 1, Failures: 0, Errors: 0, Skipped: 0, Time elapsed: 25.979 sec
Running com.twitter.distributedlog.TestLogSegmentMetadata
Tests run: 6, Failures: 0, Errors: 0, Skipped: 0, Time elapsed: 2.341 sec
Running com.twitter.distributedlog.TestReadUtils
Running com.twitter.distributedlog.logsegment.TestRollingPolicy
Tests run: 2, Failures: 0, Errors: 0, Skipped: 0, Time elapsed: 0.264 sec
Running com.twitter.distributedlog.logsegment.TestLogSegmentCache
Tests run: 6, Failures: 0, Errors: 0, Skipped: 0, Time elapsed: 0.324 sec
Running com.twitter.distributedlog.TestZooKeeperClient
Tests run: 12, Failures: 0, Errors: 1, Skipped: 2, Time elapsed: 11.817 sec <<< FAILURE!
Running com.twitter.distributedlog.TestBKLogReadHandler
Running com.twitter.distributedlog.config.TestConfigurationSubscription
Tests run: 4, Failures: 0, Errors: 0, Skipped: 0, Time elapsed: 0.829 sec
Running com.twitter.distributedlog.config.TestDynamicDistributedLogConfiguration
Tests run: 7, Failures: 0, Errors: 0, Skipped: 0, Time elapsed: 0.282 sec
Running com.twitter.distributedlog.config.TestDynamicConfigurationFactory
Tests run: 3, Failures: 0, Errors: 0, Skipped: 0, Time elapsed: 2.433 sec
Running com.twitter.distributedlog.config.TestConcurrentBaseConfiguration
Tests run: 1, Failures: 0, Errors: 0, Skipped: 0, Time elapsed: 0.364 sec
Running com.twitter.distributedlog.TestAsyncReaderWriter
Running com.twitter.distributedlog.TestLedgerHandleCache
Tests run: 10, Failures: 0, Errors: 0, Skipped: 0, Time elapsed: 8.578 sec
Running com.twitter.distributedlog.TestAsyncBulkWrite
Tests run: 6, Failures: 0, Errors: 0, Skipped: 0, Time elapsed: 35.355 sec
Running com.twitter.distributedlog.lock.TestDistributedLock
Tests run: 14, Failures: 0, Errors: 0, Skipped: 0, Time elapsed: 47.698 sec
Running com.twitter.distributedlog.lock.TestZKSessionLock
Tests run: 29, Failures: 1, Errors: 0, Skipped: 0, Time elapsed: 39.388 sec <<< FAILURE!
Running com.twitter.distributedlog.TestInterleavedReaders
Running com.twitter.distributedlog.feature.TestDynamicConfigurationFeatureProvider
Tests run: 3, Failures: 0, Errors: 0, Skipped: 1, Time elapsed: 0.756 sec
Running com.twitter.distributedlog.feature.TestConfigurationFeatureProvider
Tests run: 1, Failures: 0, Errors: 0, Skipped: 0, Time elapsed: 0.204 sec
Running com.twitter.distributedlog.TestReadAhead
Tests run: 2, Failures: 0, Errors: 0, Skipped: 0, Time elapsed: 33.981 sec
Running com.twitter.distributedlog.tools.TestDistributedLogTool
Tests run: 12, Failures: 0, Errors: 1, Skipped: 0, Time elapsed: 92.684 sec <<< FAILURE!
Running com.twitter.distributedlog.rate.TestMovingAverageRate
Tests run: 2, Failures: 0, Errors: 0, Skipped: 0, Time elapsed: 0.419 sec
Running com.twitter.distributedlog.TestBKSyncLogReader
Tests run: 6, Failures: 0, Errors: 4, Skipped: 0, Time elapsed: 262.889 sec <<< FAILURE!
Running com.twitter.distributedlog.TestNonBlockingReads
Tests run: 1, Failures: 0, Errors: 0, Skipped: 1, Time elapsed: 0.043 sec
Running com.twitter.distributedlog.TestBKDistributedLogNamespace
Tests run: 9, Failures: 0, Errors: 0, Skipped: 0, Time elapsed: 43.58 sec
Running com.twitter.distributedlog.TestAsyncReaderLock
Tests run: 11, Failures: 0, Errors: 0, Skipped: 0, Time elapsed: 93.472 sec
Running com.twitter.distributedlog.net.TestNetUtils
Tests run: 3, Failures: 0, Errors: 0, Skipped: 0, Time elapsed: 0.173 sec
Running com.twitter.distributedlog.net.TestDNSResolver
Tests run: 3, Failures: 0, Errors: 0, Skipped: 0, Time elapsed: 0.234 sec
Running com.twitter.distributedlog.acl.TestZKAccessControlManager
Tests run: 1, Failures: 0, Errors: 0, Skipped: 0, Time elapsed: 4.607 sec
Running com.twitter.distributedlog.acl.TestZKAccessControl
Tests run: 5, Failures: 0, Errors: 0, Skipped: 0, Time elapsed: 3.516 sec
Running com.twitter.distributedlog.metadata.TestDLMetadata
Tests run: 7, Failures: 0, Errors: 0, Skipped: 0, Time elapsed: 5.534 sec
Running com.twitter.distributedlog.metadata.TestZkMetadataResolver
Tests run: 5, Failures: 0, Errors: 0, Skipped: 0, Time elapsed: 5.698 sec
Running com.twitter.distributedlog.metadata.TestLogSegmentMetadataStoreUpdater
Tests run: 3, Failures: 0, Errors: 0, Skipped: 0, Time elapsed: 3.935 sec
Running com.twitter.distributedlog.TestBKLogWriteHandler
Tests run: 1, Failures: 0, Errors: 0, Skipped: 0, Time elapsed: 8.427 sec

Results :

Failed tests:   testLockWhenSiblingUseDifferentLockId3(com.twitter.distributedlog.lock.TestZKSessionLock):
expected:<EXPIRED> but was:<CLAIMED>

Tests in error: 
  testNumberOfTransactions(com.twitter.distributedlog.TestBKDistributedLogManager): test timed
out after 60000 milliseconds
  testContinuousReaders(com.twitter.distributedlog.TestBKDistributedLogManager): test timed
out after 60000 milliseconds
  testMarkEndOfStream(com.twitter.distributedlog.TestBKDistributedLogManager): test timed
out after 60000 milliseconds
  testMarkEndOfStreamOnEmptyStream(com.twitter.distributedlog.TestBKDistributedLogManager):
test timed out after 60000 milliseconds
  testMarkEndOfStreamOnClosedStream(com.twitter.distributedlog.TestBKDistributedLogManager):
test timed out after 60000 milliseconds
  deleteDuringRead(com.twitter.distributedlog.TestBKDistributedLogManager): test timed out
after 60000 milliseconds
  testImmediateFlush(com.twitter.distributedlog.TestBKDistributedLogManager): test timed out
after 60000 milliseconds
  testTruncationValidation(com.twitter.distributedlog.TestBKDistributedLogManager): test timed
out after 60000 milliseconds
  testSimpleRead(com.twitter.distributedlog.TestBKDistributedLogManager): test timed out after
60000 milliseconds
  testNumberOfTransactionsWithInprogressAtEnd(com.twitter.distributedlog.TestBKDistributedLogManager):
test timed out after 60000 milliseconds
  testContinuousReaderBulk(com.twitter.distributedlog.TestBKDistributedLogManager): test timed
out after 60000 milliseconds
  testContinuousReadersWithEmptyLedgers(com.twitter.distributedlog.TestBKDistributedLogManager):
test timed out after 60000 milliseconds
  testNonPartitionedWrites(com.twitter.distributedlog.TestBKDistributedLogManager): test timed
out after 60000 milliseconds
  testPositionUpdatesOnlyAfterWriteCompletion(com.twitter.distributedlog.TestAppendOnlyStreamWriter):
test timed out after 60000 milliseconds
  testBasicReadAndWriteBehavior(com.twitter.distributedlog.TestAppendOnlyStreamWriter): test
timed out after 60000 milliseconds
  testNoOffsetGapAfterSegmentWriterFailure(com.twitter.distributedlog.TestAppendOnlyStreamWriter):
test timed out after 60000 milliseconds
  testOffsetGapAfterSegmentWriterFailure(com.twitter.distributedlog.TestAppendOnlyStreamWriter):
test timed out after 60000 milliseconds
  testWriteFutureDoesNotCompleteUntilWritePersisted(com.twitter.distributedlog.TestAppendOnlyStreamWriter):
test timed out after 60000 milliseconds
  testSkipToSkipsBytesWithLargerLogRecords(com.twitter.distributedlog.TestAppendOnlyStreamReader):
test timed out after 60000 milliseconds
  testSkipToSkipsBytesUntilEndOfStream(com.twitter.distributedlog.TestAppendOnlyStreamReader):
test timed out after 60000 milliseconds
  testSkipToreturnsFalseIfPositionDoesNotExistYetForUnSealedStream(com.twitter.distributedlog.TestAppendOnlyStreamReader):
test timed out after 60000 milliseconds
  testSkipToForNoPositionChange(com.twitter.distributedlog.TestAppendOnlyStreamReader): test
timed out after 60000 milliseconds
  testSkipToSkipsBytesWithImmediateFlush(com.twitter.distributedlog.TestAppendOnlyStreamReader):
test timed out after 60000 milliseconds
  testMultiReaders(com.twitter.distributedlog.TestNonBlockingReadsMultiReader): test timed
out after 60000 milliseconds
  testUnableToRollLogSegments(com.twitter.distributedlog.TestRollLogSegments): test timed
out after 60000 milliseconds
  testRollingLogSegments(com.twitter.distributedlog.TestRollLogSegments): Induced Exception
at:FP_StartLogSegmentBeforeLedgerCreate
  testLastDLSNInRollingLogSegments(com.twitter.distributedlog.TestRollLogSegments): Induced
Exception at:FP_StartLogSegmentBeforeLedgerCreate
  testCaughtUpReaderOnLogSegmentRolling(com.twitter.distributedlog.TestRollLogSegments): Induced
Exception at:FP_StartLogSegmentBeforeLedgerCreate
  testZooKeeperReconnection(com.twitter.distributedlog.TestZooKeeperClient): Problem connecting
to servers: 127.0.0.1:16125
  testWriteControlRecord(com.twitter.distributedlog.TestAsyncReaderWriter): test timed out
after 60000 milliseconds
  testInterleavedReadersWithRollingEdge(com.twitter.distributedlog.TestInterleavedReaders):
test timed out after 60000 milliseconds
  testInterleavedReadersWithRolling(com.twitter.distributedlog.TestInterleavedReaders): test
timed out after 60000 milliseconds
  testInterleavedReadersWithCleanup(com.twitter.distributedlog.TestInterleavedReaders): test
timed out after 60000 milliseconds
  testToolTruncateStream(com.twitter.distributedlog.tools.TestDistributedLogTool): test timed
out after 60000 milliseconds
  testReadRecordsWhenReadAheadCatchingUp(com.twitter.distributedlog.TestBKSyncLogReader):
test timed out after 60000 milliseconds
  testReadRecordsWhenReadAheadCatchingUp2(com.twitter.distributedlog.TestBKSyncLogReader):
test timed out after 60000 milliseconds
  testDeletingLogWhileReading(com.twitter.distributedlog.TestBKSyncLogReader): test timed
out after 60000 milliseconds
  testReadingFromEmptyLog(com.twitter.distributedlog.TestBKSyncLogReader): test timed out
after 60000 milliseconds

Tests run: 392, Failures: 1, Errors: 34, Skipped: 7

[JENKINS] Recording test results
[INFO] ------------------------------------------------------------------------
[INFO] Reactor Summary:
[INFO] 
[INFO] Apache DistributedLog :: Parent .................... SUCCESS [ 29.027 s]
[INFO] Apache DistributedLog :: Protocol .................. SUCCESS [01:02 min]
[INFO] Apache DistributedLog :: Core Library .............. FAILURE [  01:28 h]
[INFO] Apache DistributedLog :: Proxy Client .............. SKIPPED
[INFO] Apache DistributedLog :: Proxy Service ............. SKIPPED
[INFO] Apache DistributedLog :: Benchmark ................. SKIPPED
[INFO] Apache DistributedLog :: Tutorials :: Basics ....... SKIPPED
[INFO] Apache DistributedLog :: Tutorials :: Messaging Tutorial SKIPPED
[INFO] Apache DistributedLog :: Tutorials :: Kafka Tutorial SKIPPED
[INFO] Apache DistributedLog :: Tutorials :: MapReduce Tutorial SKIPPED
[INFO] Apache DistributedLog :: Tutorials ................. SKIPPED
[INFO] ------------------------------------------------------------------------
[INFO] BUILD FAILURE
[INFO] ------------------------------------------------------------------------
[INFO] Total time: 01:30 h
[INFO] Finished at: 2016-10-18T08:42:05+00:00
[INFO] Final Memory: 48M/811M
[INFO] ------------------------------------------------------------------------
[ERROR] Failed to execute goal org.apache.maven.plugins:maven-surefire-plugin:2.9:test (default-test)
on project distributedlog-core: Failure or timeout -> [Help 1]
[ERROR] 
[ERROR] To see the full stack trace of the errors, re-run Maven with the -e switch.
[ERROR] Re-run Maven using the -X switch to enable full debug logging.
[ERROR] 
[ERROR] For more information about the errors and possible solutions, please read the following
articles:
[ERROR] [Help 1] http://cwiki.apache.org/confluence/display/MAVEN/MojoExecutionException
[ERROR] 
[ERROR] After correcting the problems, you can resume the build with the command
[ERROR]   mvn <goals> -rf :distributedlog-core
[JENKINS] Archiving <https://builds.apache.org/job/distributedlog-nightly-build/ws/distributedlog-core/pom.xml>
to com.twitter/distributedlog-core/0.4.0-incubating-SNAPSHOT/distributedlog-core-0.4.0-incubating-SNAPSHOT.pom
[JENKINS] Archiving <https://builds.apache.org/job/distributedlog-nightly-build/ws/distributedlog-tutorials/distributedlog-mapreduce/pom.xml>
to com.twitter/distributedlog-mapreduce/0.4.0-incubating-SNAPSHOT/distributedlog-mapreduce-0.4.0-incubating-SNAPSHOT.pom
[JENKINS] Archiving <https://builds.apache.org/job/distributedlog-nightly-build/ws/distributedlog-client/pom.xml>
to com.twitter/distributedlog-client/0.4.0-incubating-SNAPSHOT/distributedlog-client-0.4.0-incubating-SNAPSHOT.pom
[JENKINS] Archiving <https://builds.apache.org/job/distributedlog-nightly-build/ws/distributedlog-benchmark/pom.xml>
to com.twitter/distributedlog-benchmark/0.4.0-incubating-SNAPSHOT/distributedlog-benchmark-0.4.0-incubating-SNAPSHOT.pom
[JENKINS] Archiving <https://builds.apache.org/job/distributedlog-nightly-build/ws/distributedlog-tutorials/distributedlog-messaging/pom.xml>
to com.twitter/distributedlog-messaging/0.4.0-incubating-SNAPSHOT/distributedlog-messaging-0.4.0-incubating-SNAPSHOT.pom
[JENKINS] Archiving <https://builds.apache.org/job/distributedlog-nightly-build/ws/distributedlog-tutorials/distributedlog-kafka/pom.xml>
to com.twitter/distributedlog-kafka/0.4.0-incubating-SNAPSHOT/distributedlog-kafka-0.4.0-incubating-SNAPSHOT.pom
[JENKINS] Archiving <https://builds.apache.org/job/distributedlog-nightly-build/ws/pom.xml>
to com.twitter/distributedlog/0.4.0-incubating-SNAPSHOT/distributedlog-0.4.0-incubating-SNAPSHOT.pom
[JENKINS] Archiving <https://builds.apache.org/job/distributedlog-nightly-build/ws/distributedlog-service/pom.xml>
to com.twitter/distributedlog-service/0.4.0-incubating-SNAPSHOT/distributedlog-service-0.4.0-incubating-SNAPSHOT.pom
[JENKINS] Archiving <https://builds.apache.org/job/distributedlog-nightly-build/ws/distributedlog-tutorials/distributedlog-basic/pom.xml>
to com.twitter/distributedlog-basic/0.4.0-incubating-SNAPSHOT/distributedlog-basic-0.4.0-incubating-SNAPSHOT.pom
[JENKINS] Archiving <https://builds.apache.org/job/distributedlog-nightly-build/ws/distributedlog-protocol/pom.xml>
to com.twitter/distributedlog-protocol/0.4.0-incubating-SNAPSHOT/distributedlog-protocol-0.4.0-incubating-SNAPSHOT.pom
[JENKINS] Archiving <https://builds.apache.org/job/distributedlog-nightly-build/ws/distributedlog-protocol/target/distributedlog-protocol-0.4.0-incubating-SNAPSHOT.jar>
to com.twitter/distributedlog-protocol/0.4.0-incubating-SNAPSHOT/distributedlog-protocol-0.4.0-incubating-SNAPSHOT.jar
[JENKINS] Archiving <https://builds.apache.org/job/distributedlog-nightly-build/ws/distributedlog-tutorials/pom.xml>
to com.twitter/distributedlog-tutorials/0.4.0-incubating-SNAPSHOT/distributedlog-tutorials-0.4.0-incubating-SNAPSHOT.pom
channel stopped

Mime
View raw message