bigtop-user mailing list archives

Site index · List index
Message view « Date » · « Thread »
Top « Date » · « Thread »
From "Ravichandran, Divya" <divya.ravichand...@hpe.com>
Subject FW: RPM packaging for Phoenix-4.7 Hbase 0.98
Date Wed, 24 Aug 2016 22:42:03 GMT


From: Ravichandran, Divya
Sent: Wednesday, August 24, 2016 6:32 PM
To: 'user@bigtop.apache.org' <user@bigtop.apache.org>
Subject: RPM packaging for Phoenix-4.7 Hbase 0.98

Hi,

I have made changes to bigtop.bom file to use hbase 0.98 and also to the top level pom.xml
file to pull hbase 0.98.
Is it possible to build with hbase 0.98 in the first place?

And ran ./gradlew phoenix-rpm

This gives us the following compilation errors:
                                                                                         
                                                                   de.java: Recompile with
-Xlint:unchecked for details.
22:04:28.065 [QUIET] [system.out] [INFO] 8 warnings
22:04:28.065 [QUIET] [system.out] [INFO] -------------------------------------------------------------
22:04:28.065 [QUIET] [system.out] [INFO] -------------------------------------------------------------
22:04:28.065 [QUIET] [system.out] [ERROR] COMPILATION ERROR :
22:04:28.065 [QUIET] [system.out] [INFO] -------------------------------------------------------------
22:04:28.065 [QUIET] [system.out] [ERROR] /usr/src/btdivtemp/bigtop/build/phoenix/rpm/BUILD/phoenix-4.7.0-HBase-0.98-src/phoenix-core/src/main/java/org/apache/phoenix/execute/DelegateHTable.java:[276,5]
method does not override or implement a method from a supertype
22:04:28.065 [QUIET] [system.out] [ERROR] /usr/src/btdivtemp/bigtop/build/phoenix/rpm/BUILD/phoenix-4.7.0-HBase-0.98-src/phoenix-core/src/main/java/org/apache/phoenix/execute/DelegateHTable.java:[279,24]
cannot find symbol
22:04:28.065 [QUIET] [system.out]   symbol:   method checkAndMutate(byte[],byte[],byte[],org.apache.hadoop.hbase.filter.CompareFilter.CompareOp,byte[],org.apache.hadoop.hbase.client.RowMutations)
22:04:28.065 [QUIET] [system.out]   location: variable delegate of type org.apache.hadoop.hbase.client.HTableInterface
22:04:28.065 [QUIET] [system.out] [ERROR] /usr/src/btdivtemp/bigtop/build/phoenix/rpm/BUILD/phoenix-4.7.0-HBase-0.98-src/phoenix-core/src/main/java/org/apache/phoenix/iterate/TableResultIterator.java:[151,112]
cannot find symbol
22:04:28.065 [QUIET] [system.out]   symbol:   method renewLease()
22:04:28.065 [QUIET] [system.out]   location: class org.apache.hadoop.hbase.client.AbstractClientScanner
22:04:28.065 [QUIET] [system.out] [ERROR] /usr/src/btdivtemp/bigtop/build/phoenix/rpm/BUILD/phoenix-4.7.0-HBase-0.98-src/phoenix-core/src/main/java/org/apache/phoenix/schema/stats/StatisticsCollectorFactory.java:[76,44]
cannot find symbol
22:04:28.065 [QUIET] [system.out]   symbol:   method getRegionInfo()
22:04:28.065 [QUIET] [system.out]   location: variable env of type org.apache.hadoop.hbase.coprocessor.RegionCoprocessorEnvironment
22:04:28.065 [QUIET] [system.out] [ERROR] /usr/src/btdivtemp/bigtop/build/phoenix/rpm/BUILD/phoenix-4.7.0-HBase-0.98-src/phoenix-core/src/main/java/org/apache/hadoop/hbase/regionserver/LocalIndexSplitter.java:[98,23]
cannot find symbol
22:04:28.065 [QUIET] [system.out]   symbol:   variable useZKForAssignment
22:04:28.065 [QUIET] [system.out]   location: variable st of type org.apache.hadoop.hbase.regionserver.SplitTransaction
22:04:28.065 [QUIET] [system.out] [ERROR] /usr/src/btdivtemp/bigtop/build/phoenix/rpm/BUILD/phoenix-4.7.0-HBase-0.98-src/phoenix-core/src/main/java/org/apache/hadoop/hbase/regionserver/LocalIndexSplitter.java:[112,21]
cannot find symbol
22:04:28.066 [QUIET] [system.out]   symbol:   method runAsLoginUser(<anonymous java.security.PrivilegedExceptionAction<java.lang.Void>>)
22:04:28.066 [QUIET] [system.out]   location: class org.apache.hadoop.hbase.security.User
22:04:28.066 [QUIET] [system.out] [ERROR] /usr/src/btdivtemp/bigtop/build/phoenix/rpm/BUILD/phoenix-4.7.0-HBase-0.98-src/phoenix-core/src/main/java/org/apache/phoenix/index/PhoenixTransactionalIndexer.java:[201,97]
cannot find symbol
22:04:28.066 [QUIET] [system.out]   symbol:   method getRegionInfo()
22:04:28.066 [QUIET] [system.out]   location: variable env of type org.apache.hadoop.hbase.coprocessor.RegionCoprocessorEnvironment
22:04:28.066 [QUIET] [system.out] [INFO] 7 errors
22:04:28.066 [QUIET] [system.out] [INFO] -------------------------------------------------------------
22:04:28.066 [QUIET] [system.out] [INFO] ------------------------------------------------------------------------
22:04:28.066 [QUIET] [system.out] [INFO] Reactor Summary:
22:04:28.066 [QUIET] [system.out] [INFO]
22:04:28.066 [QUIET] [system.out] [INFO] Apache Phoenix .....................................
SUCCESS [  2.385 s]
22:04:28.066 [QUIET] [system.out] [INFO] Phoenix Core .......................................
FAILURE [ 23.255 s]
22:04:28.066 [QUIET] [system.out] [INFO] Phoenix - Flume ....................................
SKIPPED
22:04:28.066 [QUIET] [system.out] [INFO] Phoenix - Pig ......................................
SKIPPED
22:04:28.066 [QUIET] [system.out] [INFO] Phoenix Query Server Client ........................
SKIPPED
22:04:28.066 [QUIET] [system.out] [INFO] Phoenix Query Server ...............................
SKIPPED
22:04:28.066 [QUIET] [system.out] [INFO] Phoenix - Pherf ....................................
SKIPPED
22:04:28.066 [QUIET] [system.out] [INFO] Phoenix - Spark ....................................
SKIPPED
22:04:28.066 [QUIET] [system.out] [INFO] Phoenix Assembly ...................................
SKIPPED
22:04:28.066 [QUIET] [system.out] [INFO] Phoenix - Tracing Web Application ..................
SKIPPED
22:04:28.066 [QUIET] [system.out] [INFO] ------------------------------------------------------------------------
22:04:28.066 [QUIET] [system.out] [INFO] BUILD FAILURE
22:04:28.066 [QUIET] [system.out] [INFO] ------------------------------------------------------------------------
22:04:28.066 [QUIET] [system.out] [INFO] Total time: 26.067 s
22:04:28.073 [QUIET] [system.out] [INFO] Finished at: 2016-08-24T22:04:28+00:00
22:04:28.411 [QUIET] [system.out] [INFO] Final Memory: 52M/373M
22:04:28.411 [QUIET] [system.out] [INFO] ------------------------------------------------------------------------
22:04:28.411 [QUIET] [system.out] [ERROR] Failed to execute goal org.apache.maven.plugins:maven-compiler-plugin:3.0:compile
(default-compile) on project phoenix-core: Compilation failure: Compilation failure:
22:04:28.411 [QUIET] [system.out] [ERROR] /usr/src/btdivtemp/bigtop/build/phoenix/rpm/BUILD/phoenix-4.7.0-HBase-0.98-src/phoenix-core/src/main/java/org/apache/phoenix/execute/DelegateHTable.java:[276,5]
method does not override or implement a method from a supertype
22:04:28.411 [QUIET] [system.out] [ERROR] /usr/src/btdivtemp/bigtop/build/phoenix/rpm/BUILD/phoenix-4.7.0-HBase-0.98-src/phoenix-core/src/main/java/org/apache/phoenix/execute/DelegateHTable.java:[279,24]
cannot find symbol


Any idea if these config changes are correct?


Thanks,
Divya


Mime
View raw message