bigtop-ci mailing list archives

Site index · List index
Message view « Date » · « Thread »
Top « Date » · « Thread »
From Apache Jenkins Server <jenk...@builds.apache.org>
Subject Failed: BIGTOP- RAT Check #731
Date Fri, 13 Mar 2020 14:21:24 GMT
Build: https://builds.apache.org/job/PreCommit-BIGTOP-github-pr-build/731/

###################################################################################
########################## LAST 60 LINES OF THE CONSOLE ###########################
[...truncated 1.15 KB...]
 > git checkout -b master origin/master
  Opening connection
    Done: 0
  Counting objects
    Done: 35
  Finding sources
    Done: 35
  Getting sizes
    Done: 33
  Compressing objects
    Done: 63202
  Writing objects
    Done: 35
  remote: Resolving deltas
  remote: Updating references
Merging refs/tags/changes/731
 > git rev-parse refs/tags/changes/731^{commit} # timeout=10
 > git merge 81b991b1281e5846cdc7f8b8650de0b364ee9c50 # timeout=10
 > git rev-parse master^{commit} # timeout=10
Checking out Revision 81b991b1281e5846cdc7f8b8650de0b364ee9c50 (master)
 > git config core.sparsecheckout # timeout=10
 > git checkout -f 81b991b1281e5846cdc7f8b8650de0b364ee9c50
Commit message: "fixed role assingment, kms kerberos configs and bugs in kerberos module."
 > git rev-parse origin/master^{commit} # timeout=10
 > git rev-list --no-walk 73f45a8b9f8c5bf1a7801de04d0c33f55bc8be65 # timeout=10
No emails were triggered.
Setting JDK_1_8_LATEST__HOME=/home/jenkins/tools/java/latest1.8
[PreCommit-BIGTOP-github-pr-build] $ /bin/bash /tmp/jenkins2390860773570451432.sh
> Task :rat FAILED

FAILURE: Build failed with an exception.

* What went wrong:
Execution failed for task ':rat'.
> Found 31 files with unapproved/unknown licenses. See file:/home/jenkins/jenkins-slave/workspace/PreCommit-BIGTOP-github-pr-build/build/reports/rat/index.html

* Try:
Run with --stacktrace option to get the stack trace. Run with --info or --debug option to
get more log output. Run with --scan to get full insights.

* Get more help at https://help.gradle.org

BUILD FAILED in 15s
1 actionable task: 1 executed
Build step 'Execute shell' marked build as failure
[htmlpublisher] Archiving HTML reports...
Setting JDK_1_8_LATEST__HOME=/home/jenkins/tools/java/latest1.8
[htmlpublisher] Archiving at PROJECT level /home/jenkins/jenkins-slave/workspace/PreCommit-BIGTOP-github-pr-build/build/reports/rat
to /x1/jenkins/jenkins-home/jobs/PreCommit-BIGTOP-github-pr-build/htmlreports/HTML_20Report
Setting JDK_1_8_LATEST__HOME=/home/jenkins/tools/java/latest1.8
[description-setter] Could not determine description.
Putting comment on the pull request
Setting JDK_1_8_LATEST__HOME=/home/jenkins/tools/java/latest1.8
Setting JDK_1_8_LATEST__HOME=/home/jenkins/tools/java/latest1.8
Email was triggered for: Failure - Any
Sending email for trigger: Failure - Any
Setting JDK_1_8_LATEST__HOME=/home/jenkins/tools/java/latest1.8
Setting JDK_1_8_LATEST__HOME=/home/jenkins/tools/java/latest1.8
Setting JDK_1_8_LATEST__HOME=/home/jenkins/tools/java/latest1.8
Setting JDK_1_8_LATEST__HOME=/home/jenkins/tools/java/latest1.8
Setting JDK_1_8_LATEST__HOME=/home/jenkins/tools/java/latest1.8



###################################################################################
############################## FAILED TESTS (if any) ##############################
No tests ran.
Mime
View raw message