bigtop-ci mailing list archives

Site index · List index
Message view « Date » · « Thread »
Top « Date » · « Thread »
From Apache Jenkins Server <jenk...@builds.apache.org>
Subject Failed: BIGTOP- RAT Check #734
Date Sun, 15 Mar 2020 07:18:44 GMT
Build: https://builds.apache.org/job/PreCommit-BIGTOP-github-pr-build/734/

###################################################################################
########################## LAST 60 LINES OF THE CONSOLE ###########################
Started by user evansye
Running as SYSTEM
[EnvInject] - Loading node environment variables.
Building remotely on H16 (Hadoop) in workspace /home/jenkins/jenkins-slave/workspace/PreCommit-BIGTOP-github-pr-build
No credentials specified
 > git rev-parse --is-inside-work-tree # timeout=10
Fetching changes from the remote Git repository
 > git config remote.origin.url git://github.com/apache/bigtop.git # timeout=10
Cleaning workspace
 > git rev-parse --verify HEAD # timeout=10
Resetting working tree
 > git reset --hard # timeout=10
 > git clean -fdx # timeout=10
Fetching upstream changes from git://github.com/apache/bigtop.git
 > git --version # timeout=10
 > git fetch --tags --progress -- git://github.com/apache/bigtop.git +refs/heads/*:refs/remotes/origin/*
 > git rev-parse refs/remotes/origin/master^{commit} # timeout=10
 > git rev-parse refs/remotes/origin/origin/master^{commit} # timeout=10
Checking out Revision acec07ac92777da34b26cb87edcb762ab245beab (refs/remotes/origin/master)
 > git config core.sparsecheckout # timeout=10
 > git checkout -f acec07ac92777da34b26cb87edcb762ab245beab
Commit message: "Merge pull request #612 from iwasakims/BIGTOP-3322"
First time build. Skipping changelog.
No emails were triggered.
Setting JDK_1_8_LATEST__HOME=/home/jenkins/tools/java/latest1.8
[PreCommit-BIGTOP-github-pr-build] $ /bin/bash /tmp/jenkins8987448117042631232.sh
> Task :rat FAILED

FAILURE: Build failed with an exception.

* What went wrong:
Execution failed for task ':rat'.
> Found 31 files with unapproved/unknown licenses. See file:/home/jenkins/jenkins-slave/workspace/PreCommit-BIGTOP-github-pr-build/build/reports/rat/index.html

* Try:
Run with --stacktrace option to get the stack trace. Run with --info or --debug option to
get more log output. Run with --scan to get full insights.

* Get more help at https://help.gradle.org

BUILD FAILED in 10s
1 actionable task: 1 executed
Build step 'Execute shell' marked build as failure
[htmlpublisher] Archiving HTML reports...
Setting JDK_1_8_LATEST__HOME=/home/jenkins/tools/java/latest1.8
[htmlpublisher] Archiving at PROJECT level /home/jenkins/jenkins-slave/workspace/PreCommit-BIGTOP-github-pr-build/build/reports/rat
to /x1/jenkins/jenkins-home/jobs/PreCommit-BIGTOP-github-pr-build/htmlreports/HTML_20Report
Setting JDK_1_8_LATEST__HOME=/home/jenkins/tools/java/latest1.8
[description-setter] Could not determine description.
Setting JDK_1_8_LATEST__HOME=/home/jenkins/tools/java/latest1.8
Setting JDK_1_8_LATEST__HOME=/home/jenkins/tools/java/latest1.8
Email was triggered for: Failure - Any
Sending email for trigger: Failure - Any
Setting JDK_1_8_LATEST__HOME=/home/jenkins/tools/java/latest1.8
Setting JDK_1_8_LATEST__HOME=/home/jenkins/tools/java/latest1.8
Setting JDK_1_8_LATEST__HOME=/home/jenkins/tools/java/latest1.8
Setting JDK_1_8_LATEST__HOME=/home/jenkins/tools/java/latest1.8
Setting JDK_1_8_LATEST__HOME=/home/jenkins/tools/java/latest1.8



###################################################################################
############################## FAILED TESTS (if any) ##############################
No tests ran.
Mime
View raw message