bigtop-ci mailing list archives

Site index · List index
Message view « Date » · « Thread »
Top « Date » · « Thread »
From Apache Jenkins Server <jenk...@builds.apache.org>
Subject Build failed in Jenkins: Bigtop-trunk-test-execution #2392
Date Fri, 15 Mar 2019 16:30:23 GMT
See <https://builds.apache.org/job/Bigtop-trunk-test-execution/2392/display/redirect?page=changes>

Changes:

[github] BIGTOP-3191. Old Gradle version causes Kafka 2.1.1 build failed (#498)

------------------------------------------
Started by an SCM change
[EnvInject] - Loading node environment variables.
Building remotely on ubuntu-eu2 (ubuntu trusty) in workspace <https://builds.apache.org/job/Bigtop-trunk-test-execution/ws/>
No credentials specified
 > git rev-parse --is-inside-work-tree # timeout=10
Fetching changes from the remote Git repository
 > git config remote.origin.url https://git-wip-us.apache.org/repos/asf/bigtop.git # timeout=10
Fetching upstream changes from https://git-wip-us.apache.org/repos/asf/bigtop.git
 > git --version # timeout=10
 > git fetch --tags --progress https://git-wip-us.apache.org/repos/asf/bigtop.git +refs/heads/*:refs/remotes/origin/*
 > git rev-parse origin/master^{commit} # timeout=10
Checking out Revision c4b5cf6c7d18245f96fc8adecfb34daee210d814 (origin/master)
 > git config core.sparsecheckout # timeout=10
 > git checkout -f c4b5cf6c7d18245f96fc8adecfb34daee210d814
Commit message: "BIGTOP-3191. Old Gradle version causes Kafka 2.1.1 build failed (#498)"
 > git rev-list --no-walk dffa0b78b7980d3ecc61e78f0a76e3ea931339ec # timeout=10
[Bigtop-trunk-test-execution] $ /home/jenkins/tools/maven/latest3/bin/mvn -f bigtop-tests/test-execution/pom.xml
clean
[INFO] Scanning for projects...
[ERROR] [ERROR] Some problems were encountered while processing the POMs:
[ERROR] Malformed POM <https://builds.apache.org/job/Bigtop-trunk-test-execution/ws/bigtop-tests/test-execution/pom.xml>:
Unrecognised tag: 'failsafeVersion' (position: START_TAG seen ...</modelVersion>\n 
<failsafeVersion>... @21:20)  @ <https://builds.apache.org/job/Bigtop-trunk-test-execution/ws/bigtop-tests/test-execution/pom.xml,>
line 21, column 20
 @ 
[ERROR] The build could not read 1 project -> [Help 1]
[ERROR]   
[ERROR]   The project org.apache.bigtop.itest:bigtop-test-execution:1.3.1-SNAPSHOT (<https://builds.apache.org/job/Bigtop-trunk-test-execution/ws/bigtop-tests/test-execution/pom.xml)>
has 1 error
[ERROR]     Malformed POM <https://builds.apache.org/job/Bigtop-trunk-test-execution/ws/bigtop-tests/test-execution/pom.xml>:
Unrecognised tag: 'failsafeVersion' (position: START_TAG seen ...</modelVersion>\n 
<failsafeVersion>... @21:20)  @ <https://builds.apache.org/job/Bigtop-trunk-test-execution/ws/bigtop-tests/test-execution/pom.xml,>
line 21, column 20 -> [Help 2]
[ERROR] 
[ERROR] To see the full stack trace of the errors, re-run Maven with the -e switch.
[ERROR] Re-run Maven using the -X switch to enable full debug logging.
[ERROR] 
[ERROR] For more information about the errors and possible solutions, please read the following
articles:
[ERROR] [Help 1] http://cwiki.apache.org/confluence/display/MAVEN/ProjectBuildingException
[ERROR] [Help 2] http://cwiki.apache.org/confluence/display/MAVEN/ModelParseException
Build step 'Invoke top-level Maven targets' marked build as failure

Mime
View raw message