bigtop-ci mailing list archives

Site index · List index
Message view « Date » · « Thread »
Top « Date » · « Thread »
From Apache Jenkins Server <jenk...@builds.apache.org>
Subject Build failed in Jenkins: Bigtop-trunk-iTest #3050
Date Wed, 19 Jul 2017 20:24:51 GMT
See <https://builds.apache.org/job/Bigtop-trunk-iTest/3050/display/redirect?page=changes>

Changes:

[konstantin_boudnik] BIGTOP-2841: Fix bigtop/slaves-ubuntu-16.04-aarch64 build failure

------------------------------------------
Started by an SCM change
[EnvInject] - Loading node environment variables.
Building remotely on qnode2 (ubuntu) in workspace <https://builds.apache.org/job/Bigtop-trunk-iTest/ws/>
 > git rev-parse --is-inside-work-tree # timeout=10
Fetching changes from the remote Git repository
 > git config remote.origin.url https://git-wip-us.apache.org/repos/asf/bigtop.git # timeout=10
Fetching upstream changes from https://git-wip-us.apache.org/repos/asf/bigtop.git
 > git --version # timeout=10
 > git fetch --tags --progress https://git-wip-us.apache.org/repos/asf/bigtop.git +refs/heads/*:refs/remotes/origin/*
 > git rev-parse origin/master^{commit} # timeout=10
Checking out Revision 3bdfb7d3a8cb2aaa8b7e3aa06f71b13c02fa68fd (origin/master)
Commit message: "BIGTOP-2841: Fix bigtop/slaves-ubuntu-16.04-aarch64 build failure"
 > git config core.sparsecheckout # timeout=10
 > git checkout -f 3bdfb7d3a8cb2aaa8b7e3aa06f71b13c02fa68fd
 > git rev-list 047dd8d8e3878a273fe6c15143614e3e39c56ac3 # timeout=10
[Bigtop-trunk-iTest] $ /bin/bash -xe /tmp/jenkins3606692134637122524.sh
+ export JAVA_HOME=/home/hudson/tools/java/latest
+ JAVA_HOME=/home/hudson/tools/java/latest
+ export PATH=/home/hudson/tools/java/latest/bin:/home/jenkins/tools/maven/apache-maven-3.0.4/bin:/home/jenkins/tools/java/latest1.7/bin:/usr/local/sbin:/usr/local/bin:/usr/sbin:/usr/bin:/sbin:/bin:/usr/games:/usr/local/games
+ PATH=/home/hudson/tools/java/latest/bin:/home/jenkins/tools/maven/apache-maven-3.0.4/bin:/home/jenkins/tools/java/latest1.7/bin:/usr/local/sbin:/usr/local/bin:/usr/sbin:/usr/bin:/sbin:/bin:/usr/games:/usr/local/games
+ env
BUILD_URL=https://builds.apache.org/job/Bigtop-trunk-iTest/3050/
XDG_SESSION_ID=9518
POM_GROUPID=org.apache.bigtop.itest
HUDSON_SERVER_COOKIE=f4ebd1e6b0d976e8
SHELL=/bin/bash
SSH_CLIENT=62.210.60.235 55124 22
BUILD_TAG=jenkins-Bigtop-trunk-iTest-3050
POM_DISPLAYNAME=iTest: system and integration testing in the cloud
GIT_PREVIOUS_COMMIT=047dd8d8e3878a273fe6c15143614e3e39c56ac3
ROOT_BUILD_CAUSE=SCMTRIGGER
WORKSPACE=<https://builds.apache.org/job/Bigtop-trunk-iTest/ws/>
JOB_URL=https://builds.apache.org/job/Bigtop-trunk-iTest/
RUN_CHANGES_DISPLAY_URL=https://builds.apache.org/job/Bigtop-trunk-iTest/3050/display/redirect?page=changes
USER=jenkins
POM_ARTIFACTID=itest-common
GIT_AUTHOR_NAME=jenkins
GIT_COMMITTER_NAME=jenkins
MAVEN_OPTS=-Xmx2g -Xms256m
NLSPATH=/usr/dt/lib/nls/msg/%L/%N.cat
GIT_COMMIT=3bdfb7d3a8cb2aaa8b7e3aa06f71b13c02fa68fd
JENKINS_HOME=/x1/jenkins/jenkins-home
MAIL=/var/mail/jenkins
MAVEN_HOME=/home/jenkins/tools/maven/apache-maven-3.0.4
ROOT_BUILD_CAUSE_SCMTRIGGER=true
PATH=/home/hudson/tools/java/latest/bin:/home/jenkins/tools/maven/apache-maven-3.0.4/bin:/home/jenkins/tools/java/latest1.7/bin:/usr/local/sbin:/usr/local/bin:/usr/sbin:/usr/bin:/sbin:/bin:/usr/games:/usr/local/games
BUILD_CAUSE_SCMTRIGGER=true
RUN_DISPLAY_URL=https://builds.apache.org/job/Bigtop-trunk-iTest/3050/display/redirect
GIT_COMMITTER_EMAIL=builds@apache.org
PWD=<https://builds.apache.org/job/Bigtop-trunk-iTest/ws/>
JAVA_HOME=/home/hudson/tools/java/latest
HUDSON_URL=https://builds.apache.org/
LANG=en_US.UTF-8
JOB_NAME=Bigtop-trunk-iTest
POM_VERSION=1.3.0-SNAPSHOT
XFILESEARCHPATH=/usr/dt/app-defaults/%L/Dt
BUILD_DISPLAY_NAME=#3050
BUILD_CAUSE=SCMTRIGGER
BUILD_ID=3050
JENKINS_URL=https://builds.apache.org/
JOB_BASE_NAME=Bigtop-trunk-iTest
GIT_PREVIOUS_SUCCESSFUL_COMMIT=ed2f124f91e165277ef85baebff0cd54d74b77e6
POM_PACKAGING=jar
HOME=/home/jenkins
SHLVL=2
M2_HOME=/home/jenkins/tools/maven/apache-maven-3.0.4
GIT_BRANCH=origin/master
EXECUTOR_NUMBER=1
JENKINS_SERVER_COOKIE=f4ebd1e6b0d976e8
GIT_URL=https://git-wip-us.apache.org/repos/asf/bigtop.git
NODE_LABELS=qnode2 ubuntu
LOGNAME=jenkins
SSH_CONNECTION=62.210.60.235 55124 10.6.8.227 22
HUDSON_HOME=/x1/jenkins/jenkins-home
NODE_NAME=qnode2
BUILD_NUMBER=3050
JOB_DISPLAY_URL=https://builds.apache.org/job/Bigtop-trunk-iTest/display/redirect
XDG_RUNTIME_DIR=/run/user/9997
HUDSON_COOKIE=ebc36fbd-da46-4d5b-a0c9-ef5e6ce73e00
GIT_AUTHOR_EMAIL=builds@apache.org
_=/usr/bin/env
Parsing POMs
Established TCP socket on 46261
maven3-agent.jar already up to date
maven3-interceptor.jar already up to date
maven3-interceptor-commons.jar already up to date
[bigtop-test-framework] $ /home/jenkins/tools/java/latest1.7/bin/java -Xmx2g -Xms256m -cp
/home/jenkins/jenkins-slave/maven3-agent.jar:/home/jenkins/tools/maven/apache-maven-3.0.4/boot/plexus-classworlds-2.4.jar
org.jvnet.hudson.maven3.agent.Maven3Main /home/jenkins/tools/maven/apache-maven-3.0.4 /home/jenkins/jenkins-slave/slave.jar
/home/jenkins/jenkins-slave/maven3-interceptor.jar /home/jenkins/jenkins-slave/maven3-interceptor-commons.jar
46261
<===[JENKINS REMOTING CAPACITY]===>   channel started
ERROR: ================================================================================
ERROR: Invalid project setup: jenkins/security/MasterToSlaveCallable : Unsupported major.minor
version 52.0
ERROR: [JENKINS-18403][JENKINS-28294] JDK 'JDK 1.7 (latest)' not supported to run Maven projects.
ERROR: Maven projects have to be launched with a Java version greater or equal to the minimum
version required by the master.
ERROR: Use the Maven JDK Toolchains (plugin) to build your maven project with an older JDK.
ERROR: Retrying with slave Java and setting compile/test properties to point to /home/jenkins/tools/java/latest1.7.
ERROR: ================================================================================
Established TCP socket on 43863
maven3-agent.jar already up to date
maven3-interceptor.jar already up to date
maven3-interceptor-commons.jar already up to date
[bigtop-test-framework] $ /usr/local/asfpackages/java/jdk1.8.0_131/jre/bin/java -Xmx2g -Xms256m
-cp /home/jenkins/jenkins-slave/maven3-agent.jar:/home/jenkins/tools/maven/apache-maven-3.0.4/boot/plexus-classworlds-2.4.jar
org.jvnet.hudson.maven3.agent.Maven3Main /home/jenkins/tools/maven/apache-maven-3.0.4 /home/jenkins/jenkins-slave/slave.jar
/home/jenkins/jenkins-slave/maven3-interceptor.jar /home/jenkins/jenkins-slave/maven3-interceptor-commons.jar
43863
<===[JENKINS REMOTING CAPACITY]===>   channel started
Executing Maven:  -B -f <https://builds.apache.org/job/Bigtop-trunk-iTest/ws/bigtop-test-framework/pom.xml>
-Dmaven.repo.local=/home/jenkins/jenkins-slave/maven-repositories/1 clean deploy -DskipITs
[INFO] Scanning for projects...
[INFO]                                                                         
[INFO] ------------------------------------------------------------------------
[INFO] Building iTest: system and integration testing in the cloud 1.3.0-SNAPSHOT
[INFO] ------------------------------------------------------------------------
[INFO] 
[INFO] --- maven-clean-plugin:2.4.1:clean (default-clean) @ itest-common ---
[INFO] Deleting <https://builds.apache.org/job/Bigtop-trunk-iTest/ws/bigtop-test-framework/target>
[INFO] 
[INFO] --- groovy-eclipse-compiler:2.9.2-01:add-groovy-build-paths (default-add-groovy-build-paths)
@ itest-common ---
[INFO] Adding /src/main/groovy to the list of source folders
[INFO] Adding /src/test/groovy to the list of test source folders
[INFO] 
[INFO] --- maven-remote-resources-plugin:1.1:process (default) @ itest-common ---
[INFO] Setting property: classpath.resource.loader.class => 'org.codehaus.plexus.velocity.ContextClassLoaderResourceLoader'.
[INFO] Setting property: velocimacro.messages.on => 'false'.
[INFO] Setting property: resource.loader => 'classpath'.
[INFO] Setting property: resource.manager.logwhenfound => 'false'.
[INFO] 
[INFO] --- maven-resources-plugin:2.4:resources (default-resources) @ itest-common ---
[INFO] Using 'UTF-8' encoding to copy filtered resources.
[INFO] skip non existing resourceDirectory <https://builds.apache.org/job/Bigtop-trunk-iTest/ws/bigtop-test-framework/src/main/resources>
[INFO] Copying 3 resources
[INFO] 
[INFO] --- maven-compiler-plugin:3.1:compile (default-compile) @ itest-common ---
[INFO] Changes detected - recompiling the module!
[INFO] Using Groovy-Eclipse compiler to compile both Java and Groovy files
[INFO] Found location </home/jenkins/jenkins-slave/maven-repositories/1/org/codehaus/groovy/groovy-eclipse-batch/2.4.3-01/groovy-eclipse-batch-2.4.3-01.jar>
for className <org.eclipse.jdt.internal.compiler.batch.Main>
[INFO] no javaAgentClass seems to be set
[INFO] Compiling in a forked process using /home/jenkins/jenkins-slave/maven-repositories/1/org/codehaus/groovy/groovy-eclipse-batch/2.4.3-01/groovy-eclipse-batch-2.4.3-01.jar
[INFO] -------------------------------------------------------------
[ERROR] COMPILATION ERROR : 
[INFO] -------------------------------------------------------------
[ERROR] Failure executing groovy-eclipse compiler:
javac: invalid flag: -jar
Usage: javac <options> <source files>
use -help for a list of possible options

[INFO] 1 error
[INFO] -------------------------------------------------------------
[INFO] ------------------------------------------------------------------------
[INFO] BUILD FAILURE
[INFO] ------------------------------------------------------------------------
[INFO] Total time: 6.211s
[INFO] Finished at: Wed Jul 19 20:24:49 UTC 2017
[INFO] Final Memory: 17M/309M
[INFO] ------------------------------------------------------------------------
Waiting for Jenkins to finish collecting data[ERROR] Failed to execute goal org.apache.maven.plugins:maven-compiler-plugin:3.1:compile
(default-compile) on project itest-common: Compilation failure
[ERROR] Failure executing groovy-eclipse compiler:
[ERROR] javac: invalid flag: -jar
[ERROR] Usage: javac <options> <source files>
[ERROR] use -help for a list of possible options
[ERROR] -> [Help 1]
[ERROR] 
[ERROR] To see the full stack trace of the errors, re-run Maven with the -e switch.
[ERROR] Re-run Maven using the -X switch to enable full debug logging.
[ERROR] 
[ERROR] For more information about the errors and possible solutions, please read the following
articles:
[ERROR] [Help 1] http://cwiki.apache.org/confluence/display/MAVEN/MojoFailureException

[JENKINS] Archiving <https://builds.apache.org/job/Bigtop-trunk-iTest/ws/bigtop-test-framework/pom.xml>
to org.apache.bigtop.itest/itest-common/1.3.0-SNAPSHOT/itest-common-1.3.0-SNAPSHOT.pom
Sending e-mails to: ci@bigtop.apache.org
channel stopped

Mime
View raw message