bigtop-ci mailing list archives

Site index · List index
Message view « Date » · « Thread »
Top « Date » · « Thread »
From Apache Jenkins Server <jenk...@builds.apache.org>
Subject Build failed in Jenkins: Bigtop-trunk-testartifacts #2545
Date Mon, 27 Mar 2017 05:59:58 GMT
See <https://builds.apache.org/job/Bigtop-trunk-testartifacts/2545/display/redirect?page=changes>

Changes:

[rvs] BIGTOP-2706 Exclude hadoop dependencies from apex packaging for 3.5.0

------------------------------------------
[...truncated 26.45 KB...]
[INFO] No tests to run.

[JENKINS] Recording test results[INFO] 
[INFO] --- maven-install-plugin:2.3:install (default-install) @ httpfs-smoke ---
[INFO] Installing <https://builds.apache.org/job/Bigtop-trunk-testartifacts/ws/bigtop-tests/test-artifacts/httpfs/target/httpfs-smoke-1.2.0-SNAPSHOT.jar>
to /home/jenkins/jenkins-slave/maven-repositories/1/org/apache/bigtop/itest/httpfs-smoke/1.2.0-SNAPSHOT/httpfs-smoke-1.2.0-SNAPSHOT.jar
[INFO] Installing <https://builds.apache.org/job/Bigtop-trunk-testartifacts/ws/bigtop-tests/test-artifacts/httpfs/pom.xml>
to /home/jenkins/jenkins-slave/maven-repositories/1/org/apache/bigtop/itest/httpfs-smoke/1.2.0-SNAPSHOT/httpfs-smoke-1.2.0-SNAPSHOT.pom

[INFO] 
[INFO] --- maven-deploy-plugin:2.5:deploy (default-deploy) @ httpfs-smoke ---
[INFO] Downloading: https://repository.apache.org/content/repositories/snapshots/org/apache/bigtop/itest/httpfs-smoke/1.2.0-SNAPSHOT/maven-metadata.xml
[INFO] Downloaded: https://repository.apache.org/content/repositories/snapshots/org/apache/bigtop/itest/httpfs-smoke/1.2.0-SNAPSHOT/maven-metadata.xml
(791 B at 1.4 KB/sec)
[INFO] Uploading: https://repository.apache.org/content/repositories/snapshots/org/apache/bigtop/itest/httpfs-smoke/1.2.0-SNAPSHOT/httpfs-smoke-1.2.0-20170327.055919-379.jar
[INFO] Uploaded: https://repository.apache.org/content/repositories/snapshots/org/apache/bigtop/itest/httpfs-smoke/1.2.0-SNAPSHOT/httpfs-smoke-1.2.0-20170327.055919-379.jar
(16 KB at 16.8 KB/sec)
[INFO] Uploading: https://repository.apache.org/content/repositories/snapshots/org/apache/bigtop/itest/httpfs-smoke/1.2.0-SNAPSHOT/httpfs-smoke-1.2.0-20170327.055919-379.pom
[INFO] Uploaded: https://repository.apache.org/content/repositories/snapshots/org/apache/bigtop/itest/httpfs-smoke/1.2.0-SNAPSHOT/httpfs-smoke-1.2.0-20170327.055919-379.pom
(2 KB at 2.1 KB/sec)
[INFO] Downloading: https://repository.apache.org/content/repositories/snapshots/org/apache/bigtop/itest/httpfs-smoke/maven-metadata.xml
[INFO] Downloaded: https://repository.apache.org/content/repositories/snapshots/org/apache/bigtop/itest/httpfs-smoke/maven-metadata.xml
(395 B at 0.7 KB/sec)
[INFO] Uploading: https://repository.apache.org/content/repositories/snapshots/org/apache/bigtop/itest/httpfs-smoke/1.2.0-SNAPSHOT/maven-metadata.xml
[INFO] Uploaded: https://repository.apache.org/content/repositories/snapshots/org/apache/bigtop/itest/httpfs-smoke/1.2.0-SNAPSHOT/maven-metadata.xml
(791 B at 0.9 KB/sec)
[INFO] Uploading: https://repository.apache.org/content/repositories/snapshots/org/apache/bigtop/itest/httpfs-smoke/maven-metadata.xml
[INFO] Uploaded: https://repository.apache.org/content/repositories/snapshots/org/apache/bigtop/itest/httpfs-smoke/maven-metadata.xml
(395 B at 0.5 KB/sec)
[INFO]                                                                         
[INFO] ------------------------------------------------------------------------
[INFO] Building ooziesmoke 1.2.0-SNAPSHOT
[INFO] ------------------------------------------------------------------------
[INFO] 
[INFO] --- maven-clean-plugin:2.4.1:clean (default-clean) @ oozie-smoke ---
[INFO] Deleting <https://builds.apache.org/job/Bigtop-trunk-testartifacts/ws/bigtop-tests/test-artifacts/oozie/target>
[INFO] 
[INFO] --- groovy-eclipse-compiler:2.9.2-01:add-groovy-build-paths (default-add-groovy-build-paths)
@ oozie-smoke ---
[INFO] Adding /src/main/groovy to the list of source folders
[INFO] Adding /src/test/groovy to the list of test source folders
[INFO] 
[INFO] --- maven-remote-resources-plugin:1.1:process (default) @ oozie-smoke ---
[INFO] 
[INFO] --- maven-resources-plugin:2.4.3:resources (default-resources) @ oozie-smoke ---
[INFO] Using 'UTF-8' encoding to copy filtered resources.
[INFO] skip non existing resourceDirectory <https://builds.apache.org/job/Bigtop-trunk-testartifacts/ws/bigtop-tests/test-artifacts/oozie/src/main/resources>
[INFO] Copying 3 resources
[INFO] 
[INFO] --- maven-compiler-plugin:3.1:compile (default-compile) @ oozie-smoke ---
[INFO] Changes detected - recompiling the module!
[INFO] Using Groovy-Eclipse compiler to compile both Java and Groovy files
[INFO] 
[INFO] --- maven-resources-plugin:2.4.3:testResources (default-testResources) @ oozie-smoke
---
[INFO] Using 'UTF-8' encoding to copy filtered resources.
[INFO] skip non existing resourceDirectory <https://builds.apache.org/job/Bigtop-trunk-testartifacts/ws/bigtop-tests/test-artifacts/oozie/src/test/resources>
[INFO] Copying 3 resources
[INFO] 
[INFO] --- maven-compiler-plugin:3.1:testCompile (default-testCompile) @ oozie-smoke ---
[INFO] No sources to compile
[INFO] 
[INFO] --- maven-surefire-plugin:2.7:test (default-test) @ oozie-smoke ---
[INFO] Tests are skipped.
[INFO] 
[INFO] --- maven-jar-plugin:2.2:jar (default-jar) @ oozie-smoke ---
[INFO] Building jar: <https://builds.apache.org/job/Bigtop-trunk-testartifacts/ws/bigtop-tests/test-artifacts/oozie/target/oozie-smoke-1.2.0-SNAPSHOT.jar>
[INFO] 
[INFO] --- maven-failsafe-plugin:2.7.1:integration-test (integration-test) @ oozie-smoke ---
[INFO] No tests to run.
[JENKINS] Recording test results[INFO] 
[INFO] --- maven-failsafe-plugin:2.7.1:verify (verify) @ oozie-smoke ---
[INFO] No tests to run.

[JENKINS] Recording test results[INFO] 
[INFO] --- maven-install-plugin:2.3:install (default-install) @ oozie-smoke ---
[INFO] Installing <https://builds.apache.org/job/Bigtop-trunk-testartifacts/ws/bigtop-tests/test-artifacts/oozie/target/oozie-smoke-1.2.0-SNAPSHOT.jar>
to /home/jenkins/jenkins-slave/maven-repositories/1/org/apache/bigtop/itest/oozie-smoke/1.2.0-SNAPSHOT/oozie-smoke-1.2.0-SNAPSHOT.jar
[INFO] Installing <https://builds.apache.org/job/Bigtop-trunk-testartifacts/ws/bigtop-tests/test-artifacts/oozie/pom.xml>
to /home/jenkins/jenkins-slave/maven-repositories/1/org/apache/bigtop/itest/oozie-smoke/1.2.0-SNAPSHOT/oozie-smoke-1.2.0-SNAPSHOT.pom

[INFO] 
[INFO] --- maven-deploy-plugin:2.5:deploy (default-deploy) @ oozie-smoke ---
[INFO] Downloading: https://repository.apache.org/content/repositories/snapshots/org/apache/bigtop/itest/oozie-smoke/1.2.0-SNAPSHOT/maven-metadata.xml
[INFO] Downloaded: https://repository.apache.org/content/repositories/snapshots/org/apache/bigtop/itest/oozie-smoke/1.2.0-SNAPSHOT/maven-metadata.xml
(790 B at 1.4 KB/sec)
[INFO] Uploading: https://repository.apache.org/content/repositories/snapshots/org/apache/bigtop/itest/oozie-smoke/1.2.0-SNAPSHOT/oozie-smoke-1.2.0-20170327.055926-379.jar
[INFO] Uploaded: https://repository.apache.org/content/repositories/snapshots/org/apache/bigtop/itest/oozie-smoke/1.2.0-SNAPSHOT/oozie-smoke-1.2.0-20170327.055926-379.jar
(15 KB at 10.4 KB/sec)
[INFO] Uploading: https://repository.apache.org/content/repositories/snapshots/org/apache/bigtop/itest/oozie-smoke/1.2.0-SNAPSHOT/oozie-smoke-1.2.0-20170327.055926-379.pom
[INFO] Uploaded: https://repository.apache.org/content/repositories/snapshots/org/apache/bigtop/itest/oozie-smoke/1.2.0-SNAPSHOT/oozie-smoke-1.2.0-20170327.055926-379.pom
(2 KB at 1.2 KB/sec)
[INFO] Downloading: https://repository.apache.org/content/repositories/snapshots/org/apache/bigtop/itest/oozie-smoke/maven-metadata.xml
[INFO] Downloaded: https://repository.apache.org/content/repositories/snapshots/org/apache/bigtop/itest/oozie-smoke/maven-metadata.xml
(445 B at 0.8 KB/sec)
[INFO] Uploading: https://repository.apache.org/content/repositories/snapshots/org/apache/bigtop/itest/oozie-smoke/1.2.0-SNAPSHOT/maven-metadata.xml
[INFO] Uploaded: https://repository.apache.org/content/repositories/snapshots/org/apache/bigtop/itest/oozie-smoke/1.2.0-SNAPSHOT/maven-metadata.xml
(790 B at 0.9 KB/sec)
[INFO] Uploading: https://repository.apache.org/content/repositories/snapshots/org/apache/bigtop/itest/oozie-smoke/maven-metadata.xml
[INFO] Uploaded: https://repository.apache.org/content/repositories/snapshots/org/apache/bigtop/itest/oozie-smoke/maven-metadata.xml
(445 B at 0.5 KB/sec)
[INFO]                                                                         
[INFO] ------------------------------------------------------------------------
[INFO] Building hbasesmoke 1.2.0-SNAPSHOT
[INFO] ------------------------------------------------------------------------
[INFO] 
[INFO] --- maven-clean-plugin:2.4.1:clean (default-clean) @ hbase-smoke ---
[INFO] Deleting <https://builds.apache.org/job/Bigtop-trunk-testartifacts/ws/bigtop-tests/test-artifacts/hbase/target>
[INFO] 
[INFO] --- groovy-eclipse-compiler:2.9.2-01:add-groovy-build-paths (default-add-groovy-build-paths)
@ hbase-smoke ---
[INFO] Adding /src/main/groovy to the list of source folders
[INFO] Adding /src/test/groovy to the list of test source folders
[INFO] 
[INFO] --- maven-remote-resources-plugin:1.1:process (default) @ hbase-smoke ---
[INFO] 
[INFO] --- maven-resources-plugin:2.4.3:resources (default-resources) @ hbase-smoke ---
[INFO] Using 'UTF-8' encoding to copy filtered resources.
[INFO] Copying 2 resources
[INFO] Copying 3 resources
[INFO] 
[INFO] --- maven-compiler-plugin:3.1:compile (default-compile) @ hbase-smoke ---
[INFO] Changes detected - recompiling the module!
[INFO] Using Groovy-Eclipse compiler to compile both Java and Groovy files
[INFO] -------------------------------------------------------------
[ERROR] COMPILATION ERROR : 
[INFO] -------------------------------------------------------------
[ERROR] <https://builds.apache.org/job/Bigtop-trunk-testartifacts/ws/bigtop-tests/test-artifacts/hbase/src/main/groovy/org/apache/bigtop/itest/hbase/system/TestMoveRootMetaRegions.java>:[29,8]
1. ERROR in <https://builds.apache.org/job/Bigtop-trunk-testartifacts/ws/bigtop-tests/test-artifacts/hbase/src/main/groovy/org/apache/bigtop/itest/hbase/system/TestMoveRootMetaRegions.java>
(at line 29)
	import org.apache.hadoop.hbase.catalog.CatalogTracker;
	       ^^^^^^^^^^^^^^^^^^^^^^^^^^^^^^^
The import org.apache.hadoop.hbase.catalog cannot be resolved

[ERROR] <https://builds.apache.org/job/Bigtop-trunk-testartifacts/ws/bigtop-tests/test-artifacts/hbase/src/main/groovy/org/apache/bigtop/itest/hbase/system/TestMoveRootMetaRegions.java>:[79,16]
2. ERROR in <https://builds.apache.org/job/Bigtop-trunk-testartifacts/ws/bigtop-tests/test-artifacts/hbase/src/main/groovy/org/apache/bigtop/itest/hbase/system/TestMoveRootMetaRegions.java>
(at line 79)
	private static CatalogTracker ct;
	               ^^^^^^^^^^^^^^
CatalogTracker cannot be resolved to a type

[ERROR] <https://builds.apache.org/job/Bigtop-trunk-testartifacts/ws/bigtop-tests/test-artifacts/hbase/src/main/groovy/org/apache/bigtop/itest/hbase/system/TestMoveRootMetaRegions.java>:[98,1]
3. ERROR in <https://builds.apache.org/job/Bigtop-trunk-testartifacts/ws/bigtop-tests/test-artifacts/hbase/src/main/groovy/org/apache/bigtop/itest/hbase/system/TestMoveRootMetaRegions.java>
(at line 98)
	ct = new CatalogTracker(admin.getConfiguration());
	^^
CatalogTracker cannot be resolved to a type

[ERROR] <https://builds.apache.org/job/Bigtop-trunk-testartifacts/ws/bigtop-tests/test-artifacts/hbase/src/main/groovy/org/apache/bigtop/itest/hbase/system/TestMoveRootMetaRegions.java>:[98,10]
4. ERROR in <https://builds.apache.org/job/Bigtop-trunk-testartifacts/ws/bigtop-tests/test-artifacts/hbase/src/main/groovy/org/apache/bigtop/itest/hbase/system/TestMoveRootMetaRegions.java>
(at line 98)
	ct = new CatalogTracker(admin.getConfiguration());
	         ^^^^^^^^^^^^^^
CatalogTracker cannot be resolved to a type

[ERROR] <https://builds.apache.org/job/Bigtop-trunk-testartifacts/ws/bigtop-tests/test-artifacts/hbase/src/main/groovy/org/apache/bigtop/itest/hbase/system/TestMoveRootMetaRegions.java>:[99,1]
5. ERROR in <https://builds.apache.org/job/Bigtop-trunk-testartifacts/ws/bigtop-tests/test-artifacts/hbase/src/main/groovy/org/apache/bigtop/itest/hbase/system/TestMoveRootMetaRegions.java>
(at line 99)
	ct.start();
	^^
CatalogTracker cannot be resolved to a type

[ERROR] <https://builds.apache.org/job/Bigtop-trunk-testartifacts/ws/bigtop-tests/test-artifacts/hbase/src/main/groovy/org/apache/bigtop/itest/hbase/system/TestMoveRootMetaRegions.java>:[108,1]
6. ERROR in <https://builds.apache.org/job/Bigtop-trunk-testartifacts/ws/bigtop-tests/test-artifacts/hbase/src/main/groovy/org/apache/bigtop/itest/hbase/system/TestMoveRootMetaRegions.java>
(at line 108)
	ct.stop();
	^^
CatalogTracker cannot be resolved to a type

[ERROR] <https://builds.apache.org/job/Bigtop-trunk-testartifacts/ws/bigtop-tests/test-artifacts/hbase/src/main/groovy/org/apache/bigtop/itest/hbase/system/TestMoveRootMetaRegions.java>:[112,8]
7. ERROR in <https://builds.apache.org/job/Bigtop-trunk-testartifacts/ws/bigtop-tests/test-artifacts/hbase/src/main/groovy/org/apache/bigtop/itest/hbase/system/TestMoveRootMetaRegions.java>
(at line 112)
	return ct.waitForMeta(meta_timeout_ms);
	       ^^
CatalogTracker cannot be resolved to a type

[ERROR] Found 7 errors and 0 warnings.
[INFO] 8 errors 
[INFO] -------------------------------------------------------------
[INFO] ------------------------------------------------------------------------
[INFO] Reactor Summary:
[INFO] 
[INFO] bigtop-smokes ...................................... SUCCESS [  8.352 s]
[INFO] hadoopsmoke ........................................ SUCCESS [ 11.734 s]
[INFO] packagesmoke ....................................... SUCCESS [ 10.784 s]
[INFO] httpfssmokes ....................................... SUCCESS [  5.665 s]
[INFO] ooziesmoke ......................................... SUCCESS [  7.335 s]
[INFO] hbasesmoke ......................................... FAILURE [  4.216 s]
[INFO] flumesmoke ......................................... SKIPPED
[INFO] sqoopsmokes ........................................ SKIPPED
[INFO] mahoutsmoke ........................................ SKIPPED
[INFO] giraphsmoke ........................................ SKIPPED
[INFO] huesmoke ........................................... SKIPPED
[INFO] solrsmoke .......................................... SKIPPED
[INFO] crunchsmoke ........................................ SKIPPED
[INFO] datafusmoke ........................................ SKIPPED
[INFO] io-longevity ....................................... SKIPPED
[INFO] hcatalogsmoke ...................................... SKIPPED
[INFO] sparksmoke ......................................... SKIPPED
[INFO] phoenixsmoke ....................................... SKIPPED
[INFO] fatjar ............................................. SKIPPED
[INFO] ------------------------------------------------------------------------
[INFO] BUILD FAILURE
[INFO] ------------------------------------------------------------------------
[INFO] Total time: 55.727 s
[INFO] Finished at: 2017-03-27T05:59:39+00:00
[INFO] Final Memory: 52M/710M
[INFO] ------------------------------------------------------------------------
Waiting for Jenkins to finish collecting data
[ERROR] Failed to execute goal org.apache.maven.plugins:maven-compiler-plugin:3.1:compile
(default-compile) on project hbase-smoke: Compilation failure: Compilation failure:
[ERROR] <https://builds.apache.org/job/Bigtop-trunk-testartifacts/ws/bigtop-tests/test-artifacts/hbase/src/main/groovy/org/apache/bigtop/itest/hbase/system/TestMoveRootMetaRegions.java>:[29,8]
1. ERROR in <https://builds.apache.org/job/Bigtop-trunk-testartifacts/ws/bigtop-tests/test-artifacts/hbase/src/main/groovy/org/apache/bigtop/itest/hbase/system/TestMoveRootMetaRegions.java>
(at line 29)
[ERROR] import org.apache.hadoop.hbase.catalog.CatalogTracker;
[ERROR] ^^^^^^^^^^^^^^^^^^^^^^^^^^^^^^^
[ERROR] The import org.apache.hadoop.hbase.catalog cannot be resolved
[ERROR] 
[ERROR] <https://builds.apache.org/job/Bigtop-trunk-testartifacts/ws/bigtop-tests/test-artifacts/hbase/src/main/groovy/org/apache/bigtop/itest/hbase/system/TestMoveRootMetaRegions.java>:[79,16]
2. ERROR in <https://builds.apache.org/job/Bigtop-trunk-testartifacts/ws/bigtop-tests/test-artifacts/hbase/src/main/groovy/org/apache/bigtop/itest/hbase/system/TestMoveRootMetaRegions.java>
(at line 79)
[ERROR] private static CatalogTracker ct;
[ERROR] ^^^^^^^^^^^^^^
[ERROR] CatalogTracker cannot be resolved to a type
[ERROR] 
[ERROR] <https://builds.apache.org/job/Bigtop-trunk-testartifacts/ws/bigtop-tests/test-artifacts/hbase/src/main/groovy/org/apache/bigtop/itest/hbase/system/TestMoveRootMetaRegions.java>:[98,1]
3. ERROR in <https://builds.apache.org/job/Bigtop-trunk-testartifacts/ws/bigtop-tests/test-artifacts/hbase/src/main/groovy/org/apache/bigtop/itest/hbase/system/TestMoveRootMetaRegions.java>
(at line 98)
[ERROR] ct = new CatalogTracker(admin.getConfiguration());
[ERROR] ^^
[ERROR] CatalogTracker cannot be resolved to a type
[ERROR] 
[ERROR] <https://builds.apache.org/job/Bigtop-trunk-testartifacts/ws/bigtop-tests/test-artifacts/hbase/src/main/groovy/org/apache/bigtop/itest/hbase/system/TestMoveRootMetaRegions.java>:[98,10]
4. ERROR in <https://builds.apache.org/job/Bigtop-trunk-testartifacts/ws/bigtop-tests/test-artifacts/hbase/src/main/groovy/org/apache/bigtop/itest/hbase/system/TestMoveRootMetaRegions.java>
(at line 98)
[ERROR] ct = new CatalogTracker(admin.getConfiguration());
[ERROR] ^^^^^^^^^^^^^^
[ERROR] CatalogTracker cannot be resolved to a type
[ERROR] 
[ERROR] <https://builds.apache.org/job/Bigtop-trunk-testartifacts/ws/bigtop-tests/test-artifacts/hbase/src/main/groovy/org/apache/bigtop/itest/hbase/system/TestMoveRootMetaRegions.java>:[99,1]
5. ERROR in <https://builds.apache.org/job/Bigtop-trunk-testartifacts/ws/bigtop-tests/test-artifacts/hbase/src/main/groovy/org/apache/bigtop/itest/hbase/system/TestMoveRootMetaRegions.java>
(at line 99)
[ERROR] ct.start();
[ERROR] ^^
[ERROR] CatalogTracker cannot be resolved to a type
[ERROR] 
[ERROR] <https://builds.apache.org/job/Bigtop-trunk-testartifacts/ws/bigtop-tests/test-artifacts/hbase/src/main/groovy/org/apache/bigtop/itest/hbase/system/TestMoveRootMetaRegions.java>:[108,1]
6. ERROR in <https://builds.apache.org/job/Bigtop-trunk-testartifacts/ws/bigtop-tests/test-artifacts/hbase/src/main/groovy/org/apache/bigtop/itest/hbase/system/TestMoveRootMetaRegions.java>
(at line 108)
[ERROR] ct.stop();
[ERROR] ^^
[ERROR] CatalogTracker cannot be resolved to a type
[ERROR] 
[ERROR] <https://builds.apache.org/job/Bigtop-trunk-testartifacts/ws/bigtop-tests/test-artifacts/hbase/src/main/groovy/org/apache/bigtop/itest/hbase/system/TestMoveRootMetaRegions.java>:[112,8]
7. ERROR in <https://builds.apache.org/job/Bigtop-trunk-testartifacts/ws/bigtop-tests/test-artifacts/hbase/src/main/groovy/org/apache/bigtop/itest/hbase/system/TestMoveRootMetaRegions.java>
(at line 112)
[ERROR] return ct.waitForMeta(meta_timeout_ms);
[ERROR] ^^
[ERROR] CatalogTracker cannot be resolved to a type
[ERROR] 
[ERROR] Found 7 errors and 0 warnings.
[ERROR] -> [Help 1]
[ERROR] 
[ERROR] To see the full stack trace of the errors, re-run Maven with the -e switch.
[ERROR] Re-run Maven using the -X switch to enable full debug logging.
[ERROR] 
[ERROR] For more information about the errors and possible solutions, please read the following
articles:
[ERROR] [Help 1] http://cwiki.apache.org/confluence/display/MAVEN/MojoFailureException
[ERROR] 
[ERROR] After correcting the problems, you can resume the build with the command
[ERROR]   mvn <goals> -rf :hbase-smoke
[JENKINS] Archiving <https://builds.apache.org/job/Bigtop-trunk-testartifacts/ws/bigtop-tests/test-artifacts/solr/pom.xml>
to org.apache.bigtop.itest/solr-smoke/1.2.0-SNAPSHOT/solr-smoke-1.2.0-SNAPSHOT.pom
[JENKINS] Archiving <https://builds.apache.org/job/Bigtop-trunk-testartifacts/ws/bigtop-tests/test-artifacts/hadoop/pom.xml>
to org.apache.bigtop.itest/hadoop-smoke/1.2.0-SNAPSHOT/hadoop-smoke-1.2.0-SNAPSHOT.pom
[JENKINS] Archiving <https://builds.apache.org/job/Bigtop-trunk-testartifacts/ws/bigtop-tests/test-artifacts/hadoop/target/hadoop-smoke-1.2.0-SNAPSHOT.jar>
to org.apache.bigtop.itest/hadoop-smoke/1.2.0-20170327.055901-379/hadoop-smoke-1.2.0-20170327.055901-379.jar
Compressed 461.18 KB of artifacts by 34.7% relative to #2544
[JENKINS] Archiving <https://builds.apache.org/job/Bigtop-trunk-testartifacts/ws/bigtop-tests/test-artifacts/flume/pom.xml>
to org.apache.bigtop.itest/flume-smoke/1.2.0-SNAPSHOT/flume-smoke-1.2.0-SNAPSHOT.pom
[JENKINS] Archiving <https://builds.apache.org/job/Bigtop-trunk-testartifacts/ws/bigtop-tests/test-artifacts/giraph/pom.xml>
to org.apache.bigtop.itest/giraph-smoke/1.2.0-SNAPSHOT/giraph-smoke-1.2.0-SNAPSHOT.pom
[JENKINS] Archiving <https://builds.apache.org/job/Bigtop-trunk-testartifacts/ws/bigtop-tests/test-artifacts/hue/pom.xml>
to org.apache.bigtop.itest/hue-smoke/1.2.0-SNAPSHOT/hue-smoke-1.2.0-SNAPSHOT.pom
[JENKINS] Archiving <https://builds.apache.org/job/Bigtop-trunk-testartifacts/ws/bigtop-tests/test-artifacts/crunch/pom.xml>
to org.apache.bigtop.itest/crunch-smoke/1.2.0-SNAPSHOT/crunch-smoke-1.2.0-SNAPSHOT.pom
[JENKINS] Archiving <https://builds.apache.org/job/Bigtop-trunk-testartifacts/ws/bigtop-tests/test-artifacts/fatjar/pom.xml>
to org.apache.bigtop.itest/fat-smoke/1.2.0-SNAPSHOT/fat-smoke-1.2.0-SNAPSHOT.pom
[JENKINS] Archiving <https://builds.apache.org/job/Bigtop-trunk-testartifacts/ws/bigtop-tests/test-artifacts/hbase/pom.xml>
to org.apache.bigtop.itest/hbase-smoke/1.2.0-SNAPSHOT/hbase-smoke-1.2.0-SNAPSHOT.pom
[JENKINS] Archiving <https://builds.apache.org/job/Bigtop-trunk-testartifacts/ws/bigtop-tests/test-artifacts/mahout/pom.xml>
to org.apache.bigtop.itest/mahout-smoke/1.2.0-SNAPSHOT/mahout-smoke-1.2.0-SNAPSHOT.pom
[JENKINS] Archiving <https://builds.apache.org/job/Bigtop-trunk-testartifacts/ws/bigtop-tests/test-artifacts/spark/pom.xml>
to org.apache.bigtop.itest/spark-smoke/1.2.0-SNAPSHOT/spark-smoke-1.2.0-SNAPSHOT.pom
[JENKINS] Archiving <https://builds.apache.org/job/Bigtop-trunk-testartifacts/ws/bigtop-tests/test-artifacts/oozie/pom.xml>
to org.apache.bigtop.itest/oozie-smoke/1.2.0-SNAPSHOT/oozie-smoke-1.2.0-SNAPSHOT.pom
[JENKINS] Archiving <https://builds.apache.org/job/Bigtop-trunk-testartifacts/ws/bigtop-tests/test-artifacts/oozie/target/oozie-smoke-1.2.0-SNAPSHOT.jar>
to org.apache.bigtop.itest/oozie-smoke/1.2.0-20170327.055926-379/oozie-smoke-1.2.0-20170327.055926-379.jar
[JENKINS] Archiving <https://builds.apache.org/job/Bigtop-trunk-testartifacts/ws/bigtop-tests/test-artifacts/package/pom.xml>
to org.apache.bigtop.itest/package-smoke/1.2.0-SNAPSHOT/package-smoke-1.2.0-SNAPSHOT.pom
[JENKINS] Archiving <https://builds.apache.org/job/Bigtop-trunk-testartifacts/ws/bigtop-tests/test-artifacts/package/target/package-smoke-1.2.0-SNAPSHOT.jar>
to org.apache.bigtop.itest/package-smoke/1.2.0-20170327.055912-379/package-smoke-1.2.0-20170327.055912-379.jar
[JENKINS] Archiving <https://builds.apache.org/job/Bigtop-trunk-testartifacts/ws/bigtop-tests/test-artifacts/sqoop/pom.xml>
to org.apache.bigtop.itest/sqoop-smoke/1.2.0-SNAPSHOT/sqoop-smoke-1.2.0-SNAPSHOT.pom
[JENKINS] Archiving <https://builds.apache.org/job/Bigtop-trunk-testartifacts/ws/bigtop-tests/test-artifacts/datafu/pom.xml>
to org.apache.bigtop.itest/datafu-smoke/1.2.0-SNAPSHOT/datafu-smoke-1.2.0-SNAPSHOT.pom
[JENKINS] Archiving <https://builds.apache.org/job/Bigtop-trunk-testartifacts/ws/bigtop-tests/test-artifacts/pom.xml>
to org.apache.bigtop.itest/bigtop-smokes/1.2.0-SNAPSHOT/bigtop-smokes-1.2.0-SNAPSHOT.pom
[JENKINS] Archiving <https://builds.apache.org/job/Bigtop-trunk-testartifacts/ws/bigtop-tests/test-artifacts/longevity/pom.xml>
to org.apache.bigtop.itest/io-longevity/1.2.0-SNAPSHOT/io-longevity-1.2.0-SNAPSHOT.pom
[JENKINS] Archiving <https://builds.apache.org/job/Bigtop-trunk-testartifacts/ws/bigtop-tests/test-artifacts/phoenix/pom.xml>
to org.apache.bigtop.itest/phoenix-smoke/1.2.0-SNAPSHOT/phoenix-smoke-1.2.0-SNAPSHOT.pom
[JENKINS] Archiving <https://builds.apache.org/job/Bigtop-trunk-testartifacts/ws/bigtop-tests/test-artifacts/hcatalog/pom.xml>
to org.apache.bigtop.itest/hcatalog-smoke/1.2.0-SNAPSHOT/hcatalog-smoke-1.2.0-SNAPSHOT.pom
[JENKINS] Archiving <https://builds.apache.org/job/Bigtop-trunk-testartifacts/ws/bigtop-tests/test-artifacts/httpfs/pom.xml>
to org.apache.bigtop.itest/httpfs-smoke/1.2.0-SNAPSHOT/httpfs-smoke-1.2.0-SNAPSHOT.pom
[JENKINS] Archiving <https://builds.apache.org/job/Bigtop-trunk-testartifacts/ws/bigtop-tests/test-artifacts/httpfs/target/httpfs-smoke-1.2.0-SNAPSHOT.jar>
to org.apache.bigtop.itest/httpfs-smoke/1.2.0-20170327.055919-379/httpfs-smoke-1.2.0-20170327.055919-379.jar
Sending e-mails to: ci@bigtop.apache.org
channel stopped

Mime
View raw message