bigtop-ci mailing list archives

Site index · List index
Message view « Date » · « Thread »
Top « Date » · « Thread »
From Apache Jenkins Server <jenk...@builds.apache.org>
Subject Build failed in Jenkins: Bigtop-trunk-testartifacts » hbasesmoke #2512
Date Wed, 22 Mar 2017 06:07:35 GMT
See <https://builds.apache.org/job/Bigtop-trunk-testartifacts/org.apache.bigtop.itest$hbase-smoke/2512/display/redirect>

------------------------------------------
[INFO]                                                                         
[INFO] ------------------------------------------------------------------------
[INFO] Building hbasesmoke 1.2.0-SNAPSHOT
[INFO] ------------------------------------------------------------------------
[INFO] Downloading: https://repo.maven.apache.org/maven2/org/apache/hbase/hbase-common/1.1.3/hbase-common-1.1.3.pom
[INFO] Downloaded: https://repo.maven.apache.org/maven2/org/apache/hbase/hbase-common/1.1.3/hbase-common-1.1.3.pom
(16 KB at 975.5 KB/sec)
[INFO] Downloading: https://repo.maven.apache.org/maven2/org/apache/hbase/hbase/1.1.3/hbase-1.1.3.pom
[INFO] Downloaded: https://repo.maven.apache.org/maven2/org/apache/hbase/hbase/1.1.3/hbase-1.1.3.pom
(95 KB at 4488.2 KB/sec)
[INFO] Downloading: https://repo.maven.apache.org/maven2/org/apache/hbase/hbase-protocol/1.1.3/hbase-protocol-1.1.3.pom
[INFO] Downloaded: https://repo.maven.apache.org/maven2/org/apache/hbase/hbase-protocol/1.1.3/hbase-protocol-1.1.3.pom
(9 KB at 541.5 KB/sec)
[INFO] Downloading: https://repo.maven.apache.org/maven2/org/apache/hbase/hbase-annotations/1.1.3/hbase-annotations-1.1.3.pom
[INFO] Downloaded: https://repo.maven.apache.org/maven2/org/apache/hbase/hbase-annotations/1.1.3/hbase-annotations-1.1.3.pom
(2 KB at 104.6 KB/sec)
[INFO] Downloading: https://repo.maven.apache.org/maven2/org/apache/hbase/hbase-server/1.1.3/hbase-server-1.1.3.pom
[INFO] Downloaded: https://repo.maven.apache.org/maven2/org/apache/hbase/hbase-server/1.1.3/hbase-server-1.1.3.pom
(32 KB at 1845.8 KB/sec)
[INFO] Downloading: https://repo.maven.apache.org/maven2/org/apache/hbase/hbase-procedure/1.1.3/hbase-procedure-1.1.3.pom
[INFO] Downloaded: https://repo.maven.apache.org/maven2/org/apache/hbase/hbase-procedure/1.1.3/hbase-procedure-1.1.3.pom
(6 KB at 367.8 KB/sec)
[INFO] Downloading: https://repo.maven.apache.org/maven2/org/apache/hbase/hbase-client/1.1.3/hbase-client-1.1.3.pom
[INFO] Downloaded: https://repo.maven.apache.org/maven2/org/apache/hbase/hbase-client/1.1.3/hbase-client-1.1.3.pom
(12 KB at 694.5 KB/sec)
[INFO] Downloading: https://repo.maven.apache.org/maven2/org/apache/hbase/hbase-prefix-tree/1.1.3/hbase-prefix-tree-1.1.3.pom
[INFO] Downloaded: https://repo.maven.apache.org/maven2/org/apache/hbase/hbase-prefix-tree/1.1.3/hbase-prefix-tree-1.1.3.pom
(7 KB at 433.3 KB/sec)
[INFO] Downloading: https://repo.maven.apache.org/maven2/org/apache/hbase/hbase-hadoop-compat/1.1.3/hbase-hadoop-compat-1.1.3.pom
[INFO] Downloaded: https://repo.maven.apache.org/maven2/org/apache/hbase/hbase-hadoop-compat/1.1.3/hbase-hadoop-compat-1.1.3.pom
(6 KB at 340.5 KB/sec)
[INFO] Downloading: https://repo.maven.apache.org/maven2/org/apache/hbase/hbase-hadoop2-compat/1.1.3/hbase-hadoop2-compat-1.1.3.pom
[INFO] Downloaded: https://repo.maven.apache.org/maven2/org/apache/hbase/hbase-hadoop2-compat/1.1.3/hbase-hadoop2-compat-1.1.3.pom
(8 KB at 483.6 KB/sec)
[INFO] Downloading: https://repo.maven.apache.org/maven2/org/slf4j/slf4j-api/1.7.2/slf4j-api-1.7.2.pom
[INFO] Downloaded: https://repo.maven.apache.org/maven2/org/slf4j/slf4j-api/1.7.2/slf4j-api-1.7.2.pom
(3 KB at 175.1 KB/sec)
[INFO] Downloading: https://repo.maven.apache.org/maven2/org/jamon/jamon-runtime/2.3.1/jamon-runtime-2.3.1.pom
[INFO] Downloaded: https://repo.maven.apache.org/maven2/org/jamon/jamon-runtime/2.3.1/jamon-runtime-2.3.1.pom
(2 KB at 119.2 KB/sec)
[INFO] Downloading: https://repo.maven.apache.org/maven2/org/jamon/jamon-project/1.0.2/jamon-project-1.0.2.pom
[INFO] Downloaded: https://repo.maven.apache.org/maven2/org/jamon/jamon-project/1.0.2/jamon-project-1.0.2.pom
(9 KB at 558.5 KB/sec)
[INFO] Downloading: https://repo.maven.apache.org/maven2/com/lmax/disruptor/3.3.0/disruptor-3.3.0.pom
[INFO] Downloaded: https://repo.maven.apache.org/maven2/com/lmax/disruptor/3.3.0/disruptor-3.3.0.pom
(2 KB at 107.6 KB/sec)
[INFO] Downloading: https://repo.maven.apache.org/maven2/org/apache/hbase/hbase-common/1.1.3/hbase-common-1.1.3.jar
[INFO] Downloading: https://repo.maven.apache.org/maven2/org/apache/hbase/hbase-protocol/1.1.3/hbase-protocol-1.1.3.jar
[INFO] Downloading: https://repo.maven.apache.org/maven2/org/apache/hbase/hbase-annotations/1.1.3/hbase-annotations-1.1.3.jar
[INFO] Downloading: https://repo.maven.apache.org/maven2/org/apache/hbase/hbase-common/1.1.3/hbase-common-1.1.3-tests.jar
[INFO] Downloading: https://repo.maven.apache.org/maven2/org/apache/hbase/hbase-server/1.1.3/hbase-server-1.1.3.jar
[INFO] Downloaded: https://repo.maven.apache.org/maven2/org/apache/hbase/hbase-annotations/1.1.3/hbase-annotations-1.1.3.jar
(21 KB at 1014.9 KB/sec)
[INFO] Downloading: https://repo.maven.apache.org/maven2/org/apache/hbase/hbase-procedure/1.1.3/hbase-procedure-1.1.3.jar
[INFO] Downloaded: https://repo.maven.apache.org/maven2/org/apache/hbase/hbase-common/1.1.3/hbase-common-1.1.3.jar
(524 KB at 13768.3 KB/sec)
[INFO] Downloading: https://repo.maven.apache.org/maven2/org/apache/hbase/hbase-client/1.1.3/hbase-client-1.1.3.jar
[INFO] Downloaded: https://repo.maven.apache.org/maven2/org/apache/hbase/hbase-procedure/1.1.3/hbase-procedure-1.1.3.jar
(105 KB at 2430.4 KB/sec)
[INFO] Downloading: https://repo.maven.apache.org/maven2/org/apache/hbase/hbase-prefix-tree/1.1.3/hbase-prefix-tree-1.1.3.jar
[INFO] Downloaded: https://repo.maven.apache.org/maven2/org/apache/hbase/hbase-common/1.1.3/hbase-common-1.1.3-tests.jar
(209 KB at 4632.5 KB/sec)
[INFO] Downloading: https://repo.maven.apache.org/maven2/org/apache/hbase/hbase-hadoop-compat/1.1.3/hbase-hadoop-compat-1.1.3.jar
[INFO] Downloaded: https://repo.maven.apache.org/maven2/org/apache/hbase/hbase-hadoop-compat/1.1.3/hbase-hadoop-compat-1.1.3.jar
(36 KB at 540.6 KB/sec)
[INFO] Downloading: https://repo.maven.apache.org/maven2/org/apache/hbase/hbase-hadoop2-compat/1.1.3/hbase-hadoop2-compat-1.1.3.jar
[INFO] Downloaded: https://repo.maven.apache.org/maven2/org/apache/hbase/hbase-prefix-tree/1.1.3/hbase-prefix-tree-1.1.3.jar
(100 KB at 1509.8 KB/sec)
[INFO] Downloading: https://repo.maven.apache.org/maven2/org/jamon/jamon-runtime/2.3.1/jamon-runtime-2.3.1.jar
[INFO] Downloaded: https://repo.maven.apache.org/maven2/org/jamon/jamon-runtime/2.3.1/jamon-runtime-2.3.1.jar
(21 KB at 245.8 KB/sec)
[INFO] Downloading: https://repo.maven.apache.org/maven2/com/lmax/disruptor/3.3.0/disruptor-3.3.0.jar
[INFO] Downloaded: https://repo.maven.apache.org/maven2/org/apache/hbase/hbase-hadoop2-compat/1.1.3/hbase-hadoop2-compat-1.1.3.jar
(90 KB at 1005.4 KB/sec)
[INFO] Downloading: https://repo.maven.apache.org/maven2/org/apache/hbase/hbase-server/1.1.3/hbase-server-1.1.3-tests.jar
[INFO] Downloaded: https://repo.maven.apache.org/maven2/org/apache/hbase/hbase-client/1.1.3/hbase-client-1.1.3.jar
(1228 KB at 12272.4 KB/sec)
[INFO] Downloaded: https://repo.maven.apache.org/maven2/com/lmax/disruptor/3.3.0/disruptor-3.3.0.jar
(78 KB at 754.5 KB/sec)
[INFO] Downloaded: https://repo.maven.apache.org/maven2/org/apache/hbase/hbase-server/1.1.3/hbase-server-1.1.3.jar
(3919 KB at 19788.2 KB/sec)
[INFO] Downloaded: https://repo.maven.apache.org/maven2/org/apache/hbase/hbase-protocol/1.1.3/hbase-protocol-1.1.3.jar
(4141 KB at 16696.7 KB/sec)
[INFO] Downloaded: https://repo.maven.apache.org/maven2/org/apache/hbase/hbase-server/1.1.3/hbase-server-1.1.3-tests.jar
(7271 KB at 18594.3 KB/sec)
[INFO] 
[INFO] --- maven-clean-plugin:2.4.1:clean (default-clean) @ hbase-smoke ---
[INFO] Deleting <https://builds.apache.org/job/Bigtop-trunk-testartifacts/org.apache.bigtop.itest$hbase-smoke/ws/target>
[INFO] 
[INFO] --- groovy-eclipse-compiler:2.9.2-01:add-groovy-build-paths (default-add-groovy-build-paths)
@ hbase-smoke ---
[INFO] Adding /src/main/groovy to the list of source folders
[INFO] Adding /src/test/groovy to the list of test source folders
[INFO] 
[INFO] --- maven-remote-resources-plugin:1.1:process (default) @ hbase-smoke ---
[INFO] 
[INFO] --- maven-resources-plugin:2.4.3:resources (default-resources) @ hbase-smoke ---
[INFO] Using 'UTF-8' encoding to copy filtered resources.
[INFO] Copying 2 resources
[INFO] Copying 3 resources
[INFO] 
[INFO] --- maven-compiler-plugin:3.1:compile (default-compile) @ hbase-smoke ---
[INFO] Changes detected - recompiling the module!
[INFO] Using Groovy-Eclipse compiler to compile both Java and Groovy files
[INFO] -------------------------------------------------------------
[ERROR] COMPILATION ERROR : 
[INFO] -------------------------------------------------------------
[ERROR] <https://builds.apache.org/job/Bigtop-trunk-testartifacts/org.apache.bigtop.itest$hbase-smoke/ws/src/main/groovy/org/apache/bigtop/itest/hbase/system/TestMoveRootMetaRegions.java>:[29,8]
1. ERROR in <https://builds.apache.org/job/Bigtop-trunk-testartifacts/org.apache.bigtop.itest$hbase-smoke/ws/src/main/groovy/org/apache/bigtop/itest/hbase/system/TestMoveRootMetaRegions.java>
(at line 29)
	import org.apache.hadoop.hbase.catalog.CatalogTracker;
	       ^^^^^^^^^^^^^^^^^^^^^^^^^^^^^^^
The import org.apache.hadoop.hbase.catalog cannot be resolved

[ERROR] <https://builds.apache.org/job/Bigtop-trunk-testartifacts/org.apache.bigtop.itest$hbase-smoke/ws/src/main/groovy/org/apache/bigtop/itest/hbase/system/TestMoveRootMetaRegions.java>:[79,16]
2. ERROR in <https://builds.apache.org/job/Bigtop-trunk-testartifacts/org.apache.bigtop.itest$hbase-smoke/ws/src/main/groovy/org/apache/bigtop/itest/hbase/system/TestMoveRootMetaRegions.java>
(at line 79)
	private static CatalogTracker ct;
	               ^^^^^^^^^^^^^^
CatalogTracker cannot be resolved to a type

[ERROR] <https://builds.apache.org/job/Bigtop-trunk-testartifacts/org.apache.bigtop.itest$hbase-smoke/ws/src/main/groovy/org/apache/bigtop/itest/hbase/system/TestMoveRootMetaRegions.java>:[98,1]
3. ERROR in <https://builds.apache.org/job/Bigtop-trunk-testartifacts/org.apache.bigtop.itest$hbase-smoke/ws/src/main/groovy/org/apache/bigtop/itest/hbase/system/TestMoveRootMetaRegions.java>
(at line 98)
	ct = new CatalogTracker(admin.getConfiguration());
	^^
CatalogTracker cannot be resolved to a type

[ERROR] <https://builds.apache.org/job/Bigtop-trunk-testartifacts/org.apache.bigtop.itest$hbase-smoke/ws/src/main/groovy/org/apache/bigtop/itest/hbase/system/TestMoveRootMetaRegions.java>:[98,10]
4. ERROR in <https://builds.apache.org/job/Bigtop-trunk-testartifacts/org.apache.bigtop.itest$hbase-smoke/ws/src/main/groovy/org/apache/bigtop/itest/hbase/system/TestMoveRootMetaRegions.java>
(at line 98)
	ct = new CatalogTracker(admin.getConfiguration());
	         ^^^^^^^^^^^^^^
CatalogTracker cannot be resolved to a type

[ERROR] <https://builds.apache.org/job/Bigtop-trunk-testartifacts/org.apache.bigtop.itest$hbase-smoke/ws/src/main/groovy/org/apache/bigtop/itest/hbase/system/TestMoveRootMetaRegions.java>:[99,1]
5. ERROR in <https://builds.apache.org/job/Bigtop-trunk-testartifacts/org.apache.bigtop.itest$hbase-smoke/ws/src/main/groovy/org/apache/bigtop/itest/hbase/system/TestMoveRootMetaRegions.java>
(at line 99)
	ct.start();
	^^
CatalogTracker cannot be resolved to a type

[ERROR] <https://builds.apache.org/job/Bigtop-trunk-testartifacts/org.apache.bigtop.itest$hbase-smoke/ws/src/main/groovy/org/apache/bigtop/itest/hbase/system/TestMoveRootMetaRegions.java>:[108,1]
6. ERROR in <https://builds.apache.org/job/Bigtop-trunk-testartifacts/org.apache.bigtop.itest$hbase-smoke/ws/src/main/groovy/org/apache/bigtop/itest/hbase/system/TestMoveRootMetaRegions.java>
(at line 108)
	ct.stop();
	^^
CatalogTracker cannot be resolved to a type

[ERROR] <https://builds.apache.org/job/Bigtop-trunk-testartifacts/org.apache.bigtop.itest$hbase-smoke/ws/src/main/groovy/org/apache/bigtop/itest/hbase/system/TestMoveRootMetaRegions.java>:[112,8]
7. ERROR in <https://builds.apache.org/job/Bigtop-trunk-testartifacts/org.apache.bigtop.itest$hbase-smoke/ws/src/main/groovy/org/apache/bigtop/itest/hbase/system/TestMoveRootMetaRegions.java>
(at line 112)
	return ct.waitForMeta(meta_timeout_ms);
	       ^^
CatalogTracker cannot be resolved to a type

[ERROR] Found 7 errors and 0 warnings.
[INFO] 8 errors 
[INFO] -------------------------------------------------------------

Mime
View raw message