bigtop-ci mailing list archives

Site index · List index
Message view « Date » · « Thread »
Top « Date » · « Thread »
From Apache Jenkins Server <jenk...@builds.apache.org>
Subject Build failed in Jenkins: Bigtop-trunk-iTest #2654
Date Tue, 30 Aug 2016 17:57:21 GMT
See <https://builds.apache.org/job/Bigtop-trunk-iTest/2654/changes>

Changes:

[kevin.monroe] BIGTOP-2525: committer test: add myself to team-list.xml

------------------------------------------
Started by an SCM change
[EnvInject] - Loading node environment variables.
Building remotely on jenkins-test-8d5 (Ubuntu ubuntu jenkins-cloud-8GB jenkins-cloud-4GB cloud-slave)
in workspace <https://builds.apache.org/job/Bigtop-trunk-iTest/ws/>
Cloning the remote Git repository
Cloning repository https://git-wip-us.apache.org/repos/asf/bigtop.git
 > git init <https://builds.apache.org/job/Bigtop-trunk-iTest/ws/> # timeout=10
Fetching upstream changes from https://git-wip-us.apache.org/repos/asf/bigtop.git
 > git --version # timeout=10
 > git -c core.askpass=true fetch --tags --progress https://git-wip-us.apache.org/repos/asf/bigtop.git
+refs/heads/*:refs/remotes/origin/*
 > git config remote.origin.url https://git-wip-us.apache.org/repos/asf/bigtop.git # timeout=10
 > git config --add remote.origin.fetch +refs/heads/*:refs/remotes/origin/* # timeout=10
 > git config remote.origin.url https://git-wip-us.apache.org/repos/asf/bigtop.git # timeout=10
Fetching upstream changes from https://git-wip-us.apache.org/repos/asf/bigtop.git
 > git -c core.askpass=true fetch --tags --progress https://git-wip-us.apache.org/repos/asf/bigtop.git
+refs/heads/*:refs/remotes/origin/*
 > git rev-parse origin/master^{commit} # timeout=10
Checking out Revision fad92c953c2e0c66402442099d9c8bf5c39bb2bc (origin/master)
 > git config core.sparsecheckout # timeout=10
 > git checkout -f fad92c953c2e0c66402442099d9c8bf5c39bb2bc
 > git rev-list f4541c221d0928d50d40ad311013852befb74345 # timeout=10
[Bigtop-trunk-iTest] $ /bin/bash -xe /tmp/hudson5700323186401006429.sh
+ export JAVA_HOME=/home/hudson/tools/java/latest
+ JAVA_HOME=/home/hudson/tools/java/latest
+ export PATH=/home/hudson/tools/java/latest/bin:/home/jenkins/tools/maven/apache-maven-3.0.4/bin:/home/jenkins/tools/java/latest1.6/bin:/usr/local/sbin:/usr/local/bin:/usr/sbin:/usr/bin:/sbin:/bin:/usr/games:/usr/local/games
+ PATH=/home/hudson/tools/java/latest/bin:/home/jenkins/tools/maven/apache-maven-3.0.4/bin:/home/jenkins/tools/java/latest1.6/bin:/usr/local/sbin:/usr/local/bin:/usr/sbin:/usr/bin:/sbin:/bin:/usr/games:/usr/local/games
+ env
BUILD_URL=https://builds.apache.org/job/Bigtop-trunk-iTest/2654/
XDG_SESSION_ID=2
POM_GROUPID=org.apache.bigtop.itest
HUDSON_SERVER_COOKIE=f4ebd1e6b0d976e8
SHELL=/bin/bash
SSH_CLIENT=140.211.11.14 51012 22
BUILD_TAG=jenkins-Bigtop-trunk-iTest-2654
POM_DISPLAYNAME=iTest: system and integration testing in the cloud
GIT_PREVIOUS_COMMIT=f4541c221d0928d50d40ad311013852befb74345
ROOT_BUILD_CAUSE=SCMTRIGGER
WORKSPACE=<https://builds.apache.org/job/Bigtop-trunk-iTest/ws/>
JOB_URL=https://builds.apache.org/job/Bigtop-trunk-iTest/
USER=jenkins
POM_ARTIFACTID=itest-common
GIT_AUTHOR_NAME=jenkins
GIT_COMMITTER_NAME=jenkins
MAVEN_OPTS=-Xmx2g -Xms256m -XX:MaxPermSize=512m
GIT_COMMIT=fad92c953c2e0c66402442099d9c8bf5c39bb2bc
JENKINS_HOME=/x1/jenkins/jenkins-home
ROOT_BUILD_CAUSE_SCMTRIGGER=true
MAVEN_HOME=/home/jenkins/tools/maven/apache-maven-3.0.4
PATH=/home/hudson/tools/java/latest/bin:/home/jenkins/tools/maven/apache-maven-3.0.4/bin:/home/jenkins/tools/java/latest1.6/bin:/usr/local/sbin:/usr/local/bin:/usr/sbin:/usr/bin:/sbin:/bin:/usr/games:/usr/local/games
MAIL=/var/mail/jenkins
BUILD_CAUSE_SCMTRIGGER=true
GIT_COMMITTER_EMAIL=builds@apache.org
PWD=<https://builds.apache.org/job/Bigtop-trunk-iTest/ws/>
JAVA_HOME=/home/hudson/tools/java/latest
HUDSON_URL=https://builds.apache.org/
LANG=en_US.UTF-8
JOB_NAME=Bigtop-trunk-iTest
POM_VERSION=1.2.0-SNAPSHOT
BUILD_DISPLAY_NAME=#2654
BUILD_CAUSE=SCMTRIGGER
BUILD_ID=2654
JENKINS_URL=https://builds.apache.org/
JOB_BASE_NAME=Bigtop-trunk-iTest
GIT_PREVIOUS_SUCCESSFUL_COMMIT=f4541c221d0928d50d40ad311013852befb74345
POM_PACKAGING=jar
HOME=/home/jenkins
SHLVL=2
M2_HOME=/home/jenkins/tools/maven/apache-maven-3.0.4
GIT_BRANCH=origin/master
JENKINS_SERVER_COOKIE=f4ebd1e6b0d976e8
EXECUTOR_NUMBER=0
GIT_URL=https://git-wip-us.apache.org/repos/asf/bigtop.git
NODE_LABELS=Ubuntu cloud-slave jenkins-cloud-4GB jenkins-cloud-8GB jenkins-test-8d5 ubuntu
LOGNAME=jenkins
SSH_CONNECTION=140.211.11.14 51012 172.99.69.70 22
HUDSON_HOME=/x1/jenkins/jenkins-home
NODE_NAME=jenkins-test-8d5
BUILD_NUMBER=2654
XDG_RUNTIME_DIR=/run/user/1001
HUDSON_COOKIE=abcfee52-b0bb-445d-ad0f-00c2d6ff7ba1
GIT_AUTHOR_EMAIL=builds@apache.org
_=/usr/bin/env
Parsing POMs
Downloaded artifact http://repo.maven.apache.org/maven2/org/apache/apache/8/apache-8.pom
Established TCP socket on 51333
Copied maven3-agent.jar
Copied maven3-interceptor.jar
maven3-interceptor-commons.jar already up to date
[bigtop-test-framework] $ /home/jenkins/tools/java/latest1.6/bin/java -Xmx2g -Xms256m -XX:MaxPermSize=512m
-cp /home/jenkins/jenkins-slave/maven3-agent.jar:/home/jenkins/tools/maven/apache-maven-3.0.4/boot/plexus-classworlds-2.4.jar
org.jvnet.hudson.maven3.agent.Maven3Main /home/jenkins/tools/maven/apache-maven-3.0.4 /home/jenkins/jenkins-slave/slave.jar
/home/jenkins/jenkins-slave/maven3-interceptor.jar /home/jenkins/jenkins-slave/maven3-interceptor-commons.jar
51333
<===[JENKINS REMOTING CAPACITY]===>   channel started
ERROR: [JENKINS-18403] JDK 5 not supported to run Maven; retrying with slave Java and setting
compile/test properties to point to /home/jenkins/tools/java/latest1.6
Established TCP socket on 35144
maven3-agent.jar already up to date
maven3-interceptor.jar already up to date
maven3-interceptor-commons.jar already up to date
[bigtop-test-framework] $ /usr/lib/jvm/java-7-openjdk-amd64/jre/bin/java -Xmx2g -Xms256m -XX:MaxPermSize=512m
-cp /home/jenkins/jenkins-slave/maven3-agent.jar:/home/jenkins/tools/maven/apache-maven-3.0.4/boot/plexus-classworlds-2.4.jar
org.jvnet.hudson.maven3.agent.Maven3Main /home/jenkins/tools/maven/apache-maven-3.0.4 /home/jenkins/jenkins-slave/slave.jar
/home/jenkins/jenkins-slave/maven3-interceptor.jar /home/jenkins/jenkins-slave/maven3-interceptor-commons.jar
35144
<===[JENKINS REMOTING CAPACITY]===>   channel started
Executing Maven:  -B -f <https://builds.apache.org/job/Bigtop-trunk-iTest/ws/bigtop-test-framework/pom.xml>
-Dmaven.repo.local=/home/jenkins/jenkins-slave/maven-repositories/0 clean deploy -DskipITs
[INFO] Scanning for projects...
Downloading: http://repo.maven.apache.org/maven2/org/apache/maven/scm/maven-scm-provider-gitexe/1.3/maven-scm-provider-gitexe-1.3.pom
[ERROR] The build could not read 1 project -> [Help 1]
[ERROR]   
[ERROR]   The project org.apache.bigtop.itest:itest-common:1.2.0-SNAPSHOT (<https://builds.apache.org/job/Bigtop-trunk-iTest/ws/bigtop-test-framework/pom.xml)>
has 1 error
[ERROR]     Unresolveable build extension: Plugin org.apache.maven.scm:maven-scm-provider-gitexe:1.3
or one of its dependencies could not be resolved: Failed to collect dependencies for org.apache.maven.scm:maven-scm-provider-gitexe:jar:1.3
(): Failed to read artifact descriptor for org.apache.maven.scm:maven-scm-provider-gitexe:jar:1.3:
Could not transfer artifact org.apache.maven.scm:maven-scm-provider-gitexe:pom:1.3 from/to
central (http://repo.maven.apache.org/maven2): Connection to http://repo.maven.apache.org
refused: Connection timed out -> [Help 2]
[ERROR] 
[ERROR] To see the full stack trace of the errors, re-run Maven with the -e switch.
[ERROR] Re-run Maven using the -X switch to enable full debug logging.
[ERROR] 
[ERROR] For more information about the errors and possible solutions, please read the following
articles:
[ERROR] [Help 1] http://cwiki.apache.org/confluence/display/MAVEN/ProjectBuildingException
[ERROR] [Help 2] http://cwiki.apache.org/confluence/display/MAVEN/PluginResolutionException
channel stopped

Mime
View raw message