bigtop-ci mailing list archives

Site index · List index
Message view « Date » · « Thread »
Top « Date » · « Thread »
From Apache Jenkins Server <jenk...@builds.apache.org>
Subject Build failed in Jenkins: Bigtop-trunk-test-execution #1904
Date Fri, 17 Jun 2016 23:49:17 GMT
See <https://builds.apache.org/job/Bigtop-trunk-test-execution/1904/changes>

Changes:

[rvs] BIGTOP-2357: Add Apache Flink to Bigtop / Create puppet recipes

------------------------------------------
[...truncated 1986 lines...]
5943/6807 KB   
5947/6807 KB   
5951/6807 KB   
5955/6807 KB   
5959/6807 KB   
5963/6807 KB   
5967/6807 KB   
5971/6807 KB   
5975/6807 KB   
5979/6807 KB   
5983/6807 KB   
5987/6807 KB   
5991/6807 KB   
5995/6807 KB   
5999/6807 KB   
6003/6807 KB   
6007/6807 KB   
6011/6807 KB   
6015/6807 KB   
6019/6807 KB   
6023/6807 KB   
6027/6807 KB   
6031/6807 KB   
6035/6807 KB   
6039/6807 KB   
6043/6807 KB   
6047/6807 KB   
6051/6807 KB   
6055/6807 KB   
6059/6807 KB   
6063/6807 KB   
6067/6807 KB   
6071/6807 KB   
6075/6807 KB   
6079/6807 KB   
6083/6807 KB   
6087/6807 KB   
6091/6807 KB   
6095/6807 KB   
6099/6807 KB   
6103/6807 KB   
6107/6807 KB   
6111/6807 KB   
6115/6807 KB   
6119/6807 KB   
6123/6807 KB   
6127/6807 KB   
6131/6807 KB   
6135/6807 KB   
6139/6807 KB   
6143/6807 KB   
6147/6807 KB   
6151/6807 KB   
6155/6807 KB   
6159/6807 KB   
6163/6807 KB   
6167/6807 KB   
6171/6807 KB   
6175/6807 KB   
6179/6807 KB   
6183/6807 KB   
6187/6807 KB   
6191/6807 KB   
6195/6807 KB   
6199/6807 KB   
6203/6807 KB   
6207/6807 KB   
6211/6807 KB   
6215/6807 KB   
6219/6807 KB   
6223/6807 KB   
6227/6807 KB   
6231/6807 KB   
6235/6807 KB   
6239/6807 KB   
6243/6807 KB   
6247/6807 KB   
6251/6807 KB   
6255/6807 KB   
6259/6807 KB   
6263/6807 KB   
6267/6807 KB   
6271/6807 KB   
6275/6807 KB   
6279/6807 KB   
6283/6807 KB   
6287/6807 KB   
6291/6807 KB   
6295/6807 KB   
6299/6807 KB   
6303/6807 KB   
6307/6807 KB   
6311/6807 KB   
6315/6807 KB   
6319/6807 KB   
6323/6807 KB   
6327/6807 KB   
6331/6807 KB   
6335/6807 KB   
6339/6807 KB   
6343/6807 KB   
6347/6807 KB   
6351/6807 KB   
6355/6807 KB   
6359/6807 KB   
6363/6807 KB   
6367/6807 KB   
6371/6807 KB   
6375/6807 KB   
6379/6807 KB   
6383/6807 KB   
6387/6807 KB   
6391/6807 KB   
6395/6807 KB   
6399/6807 KB   
6403/6807 KB   
6407/6807 KB   
6411/6807 KB   
6415/6807 KB   
6419/6807 KB   
6423/6807 KB   
6427/6807 KB   
6431/6807 KB   
6435/6807 KB   
6439/6807 KB   
6443/6807 KB   
6447/6807 KB   
6451/6807 KB   
6455/6807 KB   
6459/6807 KB   
6463/6807 KB   
6467/6807 KB   
6471/6807 KB   
6475/6807 KB   
6479/6807 KB   
6483/6807 KB   
6487/6807 KB   
6491/6807 KB   
6495/6807 KB   
6499/6807 KB   
6503/6807 KB   
6507/6807 KB   
6511/6807 KB   
6515/6807 KB   
6519/6807 KB   
6523/6807 KB   
6527/6807 KB   
6531/6807 KB   
6535/6807 KB   
6539/6807 KB   
6543/6807 KB   
6547/6807 KB   
6551/6807 KB   
6555/6807 KB   
6559/6807 KB   
6563/6807 KB   
6567/6807 KB   
6571/6807 KB   
6575/6807 KB   
6579/6807 KB   
6583/6807 KB   
6587/6807 KB   
6591/6807 KB   
6595/6807 KB   
6599/6807 KB   
6603/6807 KB   
6607/6807 KB   
6611/6807 KB   
6615/6807 KB   
6619/6807 KB   
6623/6807 KB   
6627/6807 KB   
6631/6807 KB   
6635/6807 KB   
6639/6807 KB   
6643/6807 KB   
6647/6807 KB   
6651/6807 KB   
6655/6807 KB   
6659/6807 KB   
6663/6807 KB   
6667/6807 KB   
6671/6807 KB   
6675/6807 KB   
6679/6807 KB   
6683/6807 KB   
6687/6807 KB   
6691/6807 KB   
6695/6807 KB   
6699/6807 KB   
6703/6807 KB   
6707/6807 KB   
6711/6807 KB   
6715/6807 KB   
6719/6807 KB   
6723/6807 KB   
6727/6807 KB   
6731/6807 KB   
6735/6807 KB   
6739/6807 KB   
6743/6807 KB   
6747/6807 KB   
6751/6807 KB   
6755/6807 KB   
6759/6807 KB   
6763/6807 KB   
6767/6807 KB   
6771/6807 KB   
6775/6807 KB   
6779/6807 KB   
6783/6807 KB   
6787/6807 KB   
6791/6807 KB   
6795/6807 KB   
6799/6807 KB   
6803/6807 KB   
6807/6807 KB   
               
Downloaded: http://repo.maven.apache.org/maven2/org/codehaus/groovy/groovy-all/2.4.3/groovy-all-2.4.3.jar
(6807 KB at 16480.2 KB/sec)
[INFO] 
[INFO] --- maven-install-plugin:2.3:install (default-install) @ stacks-common ---
[INFO] Installing <https://builds.apache.org/job/Bigtop-trunk-test-execution/ws/bigtop-tests/test-execution/common/pom.xml>
to /home/jenkins/.m2/repository/org/apache/bigtop/itest/stacks-common/1.2.0-SNAPSHOT/stacks-common-1.2.0-SNAPSHOT.pom
[INFO] 
[INFO] --- maven-deploy-plugin:2.5:deploy (default-deploy) @ stacks-common ---
Downloading: https://repository.apache.org/content/repositories/snapshots/org/apache/bigtop/itest/stacks-common/1.2.0-SNAPSHOT/maven-metadata.xml
               
[WARNING] Could not transfer metadata org.apache.bigtop.itest:stacks-common:1.2.0-SNAPSHOT/maven-metadata.xml
from/to apache.snapshots.https (https://repository.apache.org/content/repositories/snapshots):
java.lang.RuntimeException: Could not generate DH keypair
[INFO] ------------------------------------------------------------------------
[INFO] Reactor Summary:
[INFO] 
[INFO] stacks-validation-common .......................... FAILURE [5.325s]
[INFO] smoke-tests-conf .................................. SKIPPED
[INFO] packagesmokes ..................................... SKIPPED
[INFO] bigtop-smokes ..................................... SKIPPED
[INFO] ------------------------------------------------------------------------
[INFO] BUILD FAILURE
[INFO] ------------------------------------------------------------------------
[INFO] Total time: 5.943s
[INFO] Finished at: Fri Jun 17 23:43:50 UTC 2016
[INFO] Final Memory: 10M/723M
[INFO] ------------------------------------------------------------------------
[ERROR] Failed to execute goal org.apache.maven.plugins:maven-deploy-plugin:2.5:deploy (default-deploy)
on project stacks-common: Failed to retrieve remote metadata org.apache.bigtop.itest:stacks-common:1.2.0-SNAPSHOT/maven-metadata.xml:
Could not transfer metadata org.apache.bigtop.itest:stacks-common:1.2.0-SNAPSHOT/maven-metadata.xml
from/to apache.snapshots.https (https://repository.apache.org/content/repositories/snapshots):
java.lang.RuntimeException: Could not generate DH keypair: Prime size must be multiple of
64, and can only range from 512 to 1024 (inclusive) -> [Help 1]
[ERROR] 
[ERROR] To see the full stack trace of the errors, re-run Maven with the -e switch.
[ERROR] Re-run Maven using the -X switch to enable full debug logging.
[ERROR] 
[ERROR] For more information about the errors and possible solutions, please read the following
articles:
[ERROR] [Help 1] http://cwiki.apache.org/confluence/display/MAVEN/MojoExecutionException
Build step 'Execute shell' marked build as failure

Mime
View raw message