bigtop-ci mailing list archives

Site index · List index
Message view « Date » · « Thread »
Top « Date » · « Thread »
From Apache Jenkins Server <jenk...@builds.apache.org>
Subject Build failed in Jenkins: Bigtop-trunk-test-execution #1903
Date Fri, 17 Jun 2016 21:57:49 GMT
See <https://builds.apache.org/job/Bigtop-trunk-test-execution/1903/changes>

Changes:

[of] BIGTOP-2465: init script for Alluxio master doesn't work

------------------------------------------
[...truncated 267 lines...]
Downloading: http://repo.maven.apache.org/maven2/org/apache/maven/maven-plugin-parameter-documenter/2.0.5/maven-plugin-parameter-documenter-2.0.5.pom
2/2 KB   
         
Downloaded: http://repo.maven.apache.org/maven2/org/apache/maven/maven-plugin-parameter-documenter/2.0.5/maven-plugin-parameter-documenter-2.0.5.pom
(2 KB at 33.0 KB/sec)
Downloading: http://repo.maven.apache.org/maven2/org/apache/maven/reporting/maven-reporting-api/2.0.5/maven-reporting-api-2.0.5.pom
902/902 B   
            
Downloaded: http://repo.maven.apache.org/maven2/org/apache/maven/reporting/maven-reporting-api/2.0.5/maven-reporting-api-2.0.5.pom
(902 B at 16.3 KB/sec)
Downloading: http://repo.maven.apache.org/maven2/org/apache/maven/reporting/maven-reporting/2.0.5/maven-reporting-2.0.5.pom
589/589 B   
            
Downloaded: http://repo.maven.apache.org/maven2/org/apache/maven/reporting/maven-reporting/2.0.5/maven-reporting-2.0.5.pom
(589 B at 10.7 KB/sec)
Downloading: http://repo.maven.apache.org/maven2/org/apache/maven/maven-error-diagnostics/2.0.5/maven-error-diagnostics-2.0.5.pom
854/854 B   
            
Downloaded: http://repo.maven.apache.org/maven2/org/apache/maven/maven-error-diagnostics/2.0.5/maven-error-diagnostics-2.0.5.pom
(854 B at 15.7 KB/sec)
Downloading: http://repo.maven.apache.org/maven2/org/apache/maven/maven-plugin-registry/2.0.5/maven-plugin-registry-2.0.5.pom
2/2 KB      
         
Downloaded: http://repo.maven.apache.org/maven2/org/apache/maven/maven-plugin-registry/2.0.5/maven-plugin-registry-2.0.5.pom
(2 KB at 28.3 KB/sec)
Downloading: http://repo.maven.apache.org/maven2/org/apache/maven/maven-plugin-api/2.0.5/maven-plugin-api-2.0.5.pom
605/605 B   
            
Downloaded: http://repo.maven.apache.org/maven2/org/apache/maven/maven-plugin-api/2.0.5/maven-plugin-api-2.0.5.pom
(605 B at 10.9 KB/sec)
Downloading: http://repo.maven.apache.org/maven2/org/apache/maven/maven-plugin-descriptor/2.0.5/maven-plugin-descriptor-2.0.5.pom
2/2 KB      
         
Downloaded: http://repo.maven.apache.org/maven2/org/apache/maven/maven-plugin-descriptor/2.0.5/maven-plugin-descriptor-2.0.5.pom
(2 KB at 30.6 KB/sec)
Downloading: http://repo.maven.apache.org/maven2/org/apache/maven/maven-monitor/2.0.5/maven-monitor-2.0.5.pom
404/404 B   
            
Downloaded: http://repo.maven.apache.org/maven2/org/apache/maven/maven-monitor/2.0.5/maven-monitor-2.0.5.pom
(404 B at 7.3 KB/sec)
Downloading: http://repo.maven.apache.org/maven2/org/apache/maven/shared/maven-filtering/1.0-beta-3/maven-filtering-1.0-beta-3.jar
Downloading: http://repo.maven.apache.org/maven2/org/apache/maven/reporting/maven-reporting-api/2.0.5/maven-reporting-api-2.0.5.jar
4/34 KB     
8/34 KB   
12/34 KB   
16/34 KB   
20/34 KB   
24/34 KB   
28/34 KB   
32/34 KB   
34/34 KB   
4/10 KB   34/34 KB   
8/10 KB   34/34 KB   
10/10 KB   34/34 KB   
                      
Downloaded: http://repo.maven.apache.org/maven2/org/apache/maven/shared/maven-filtering/1.0-beta-3/maven-filtering-1.0-beta-3.jar
(34 KB at 550.8 KB/sec)
                      
Downloaded: http://repo.maven.apache.org/maven2/org/apache/maven/reporting/maven-reporting-api/2.0.5/maven-reporting-api-2.0.5.jar
(10 KB at 118.4 KB/sec)
[INFO] Setting property: classpath.resource.loader.class => 'org.codehaus.plexus.velocity.ContextClassLoaderResourceLoader'.
[INFO] Setting property: velocimacro.messages.on => 'false'.
[INFO] Setting property: resource.loader => 'classpath'.
[INFO] Setting property: resource.manager.logwhenfound => 'false'.
Downloading: http://repo.maven.apache.org/maven2/org/codehaus/groovy/maven/runtime/gmaven-runtime-1.6/1.0/gmaven-runtime-1.6-1.0.pom
4/4 KB                
         
Downloaded: http://repo.maven.apache.org/maven2/org/codehaus/groovy/maven/runtime/gmaven-runtime-1.6/1.0/gmaven-runtime-1.6-1.0.pom
(4 KB at 58.0 KB/sec)
Downloading: http://repo.maven.apache.org/maven2/org/codehaus/groovy/maven/runtime/gmaven-runtime/1.0/gmaven-runtime-1.0.pom
3/3 KB   
         
Downloaded: http://repo.maven.apache.org/maven2/org/codehaus/groovy/maven/runtime/gmaven-runtime/1.0/gmaven-runtime-1.0.pom
(3 KB at 42.3 KB/sec)
Downloading: http://repo.maven.apache.org/maven2/org/codehaus/groovy/maven/gmaven/1.0/gmaven-1.0.pom
4/39 KB   
8/39 KB   
12/39 KB   
16/39 KB   
20/39 KB   
22/39 KB   
26/39 KB   
30/39 KB   
34/39 KB   
38/39 KB   
39/39 KB   
           
Downloaded: http://repo.maven.apache.org/maven2/org/codehaus/groovy/maven/gmaven/1.0/gmaven-1.0.pom
(39 KB at 472.0 KB/sec)
Downloading: http://repo.maven.apache.org/maven2/org/codehaus/groovy/maven/feature/gmaven-feature-support/1.0/gmaven-feature-support-1.0.pom
2/2 KB     
         
Downloaded: http://repo.maven.apache.org/maven2/org/codehaus/groovy/maven/feature/gmaven-feature-support/1.0/gmaven-feature-support-1.0.pom
(2 KB at 29.8 KB/sec)
Downloading: http://repo.maven.apache.org/maven2/org/codehaus/groovy/maven/feature/gmaven-feature/1.0/gmaven-feature-1.0.pom
2/2 KB   
         
Downloaded: http://repo.maven.apache.org/maven2/org/codehaus/groovy/maven/feature/gmaven-feature/1.0/gmaven-feature-1.0.pom
(2 KB at 27.0 KB/sec)
Downloading: http://repo.maven.apache.org/maven2/org/codehaus/groovy/maven/feature/gmaven-feature-api/1.0/gmaven-feature-api-1.0.pom
2/2 KB   
         
Downloaded: http://repo.maven.apache.org/maven2/org/codehaus/groovy/maven/feature/gmaven-feature-api/1.0/gmaven-feature-api-1.0.pom
(2 KB at 31.6 KB/sec)
Downloading: http://repo.maven.apache.org/maven2/org/codehaus/groovy/maven/runtime/gmaven-runtime-support/1.0/gmaven-runtime-support-1.0.pom
3/3 KB   
         
Downloaded: http://repo.maven.apache.org/maven2/org/codehaus/groovy/maven/runtime/gmaven-runtime-support/1.0/gmaven-runtime-support-1.0.pom
(3 KB at 43.7 KB/sec)
Downloading: http://repo.maven.apache.org/maven2/org/codehaus/groovy/maven/runtime/gmaven-runtime-api/1.0/gmaven-runtime-api-1.0.pom
2/2 KB   
         
Downloaded: http://repo.maven.apache.org/maven2/org/codehaus/groovy/maven/runtime/gmaven-runtime-api/1.0/gmaven-runtime-api-1.0.pom
(2 KB at 26.5 KB/sec)
Downloading: http://repo.maven.apache.org/maven2/org/codehaus/groovy/maven/gmaven-common/1.0/gmaven-common-1.0.pom
2/2 KB   
         
Downloaded: http://repo.maven.apache.org/maven2/org/codehaus/groovy/maven/gmaven-common/1.0/gmaven-common-1.0.pom
(2 KB at 26.5 KB/sec)
Downloading: http://repo.maven.apache.org/maven2/com/thoughtworks/qdox/qdox/1.8/qdox-1.8.pom
4/12 KB   
8/12 KB   
12/12 KB   
           
Downloaded: http://repo.maven.apache.org/maven2/com/thoughtworks/qdox/qdox/1.8/qdox-1.8.pom
(12 KB at 202.9 KB/sec)
Downloading: http://repo.maven.apache.org/maven2/org/codehaus/groovy/maven/runtime/gmaven-runtime-1.6/1.0/gmaven-runtime-1.6-1.0.jar
Downloading: http://repo.maven.apache.org/maven2/org/codehaus/groovy/maven/runtime/gmaven-runtime-api/1.0/gmaven-runtime-api-1.0.jar
Downloading: http://repo.maven.apache.org/maven2/org/codehaus/groovy/maven/feature/gmaven-feature-support/1.0/gmaven-feature-support-1.0.jar
Downloading: http://repo.maven.apache.org/maven2/org/codehaus/groovy/maven/runtime/gmaven-runtime-support/1.0/gmaven-runtime-support-1.0.jar
Downloading: http://repo.maven.apache.org/maven2/org/codehaus/groovy/maven/feature/gmaven-feature-api/1.0/gmaven-feature-api-1.0.jar
4/43 KB    
8/43 KB   
12/43 KB   
16/43 KB   
20/43 KB   
20/43 KB   4/79 KB   
24/43 KB   4/79 KB   
28/43 KB   8/79 KB   
28/43 KB   8/79 KB   
28/43 KB   12/79 KB   
32/43 KB   12/79 KB   
36/43 KB   16/79 KB   
36/43 KB   16/79 KB   
40/43 KB   16/79 KB   
40/43 KB   20/79 KB   
43/43 KB   24/79 KB   
43/43 KB   24/79 KB   
43/43 KB   28/79 KB   
43/43 KB   32/79 KB   
43/43 KB   36/79 KB   
43/43 KB   40/79 KB   
43/43 KB   44/79 KB   
43/43 KB   48/79 KB   
43/43 KB   52/79 KB   
43/43 KB   56/79 KB   
43/43 KB   60/79 KB   
43/43 KB   64/79 KB   
43/43 KB   68/79 KB   
43/43 KB   72/79 KB   
43/43 KB   76/79 KB   
43/43 KB   79/79 KB   
4/14 KB   43/43 KB   79/79 KB   
4/14 KB   43/43 KB   4/23 KB   79/79 KB   
4/14 KB   43/43 KB   4/23 KB   79/79 KB   4/18 KB   
8/14 KB   43/43 KB   4/23 KB   79/79 KB   4/18 KB   
8/14 KB   43/43 KB   8/23 KB   79/79 KB   4/18 KB   
8/14 KB   43/43 KB   8/23 KB   79/79 KB   8/18 KB   
12/14 KB   43/43 KB   8/23 KB   79/79 KB   8/18 KB   
12/14 KB   43/43 KB   12/23 KB   79/79 KB   8/18 KB   
12/14 KB   43/43 KB   12/23 KB   79/79 KB   12/18 KB   
14/14 KB   43/43 KB   12/23 KB   79/79 KB   12/18 KB   
14/14 KB   43/43 KB   14/23 KB   79/79 KB   12/18 KB   
14/14 KB   43/43 KB   14/23 KB   79/79 KB   14/18 KB   
                                                       
Downloaded: http://repo.maven.apache.org/maven2/org/codehaus/groovy/maven/runtime/gmaven-runtime-1.6/1.0/gmaven-runtime-1.6-1.0.jar
(43 KB at 651.6 KB/sec)
Downloading: http://repo.maven.apache.org/maven2/org/codehaus/groovy/maven/gmaven-common/1.0/gmaven-common-1.0.jar
                                                       
Downloaded: http://repo.maven.apache.org/maven2/org/codehaus/groovy/maven/runtime/gmaven-runtime-support/1.0/gmaven-runtime-support-1.0.jar
(79 KB at 1114.7 KB/sec)
14/14 KB   18/23 KB   14/18 KB                         
14/14 KB   18/23 KB   14/18 KB   
14/14 KB   18/23 KB   18/18 KB   
14/14 KB   22/23 KB   18/18 KB   
14/14 KB   23/23 KB   18/18 KB   
Downloading: http://repo.maven.apache.org/maven2/com/thoughtworks/qdox/qdox/1.8/qdox-1.8.jar
14/14 KB   23/23 KB   18/18 KB   4/15 KB   
14/14 KB   23/23 KB   18/18 KB   8/15 KB   
14/14 KB   23/23 KB   18/18 KB   12/15 KB   
14/14 KB   23/23 KB   18/18 KB   15/15 KB   
                                            
Downloaded: http://repo.maven.apache.org/maven2/org/codehaus/groovy/maven/feature/gmaven-feature-support/1.0/gmaven-feature-support-1.0.jar
(14 KB at 133.6 KB/sec)
                                            
Downloaded: http://repo.maven.apache.org/maven2/org/codehaus/groovy/maven/feature/gmaven-feature-api/1.0/gmaven-feature-api-1.0.jar
(18 KB at 167.1 KB/sec)
                                            
Downloaded: http://repo.maven.apache.org/maven2/org/codehaus/groovy/maven/runtime/gmaven-runtime-api/1.0/gmaven-runtime-api-1.0.jar
(23 KB at 213.1 KB/sec)
4/156 KB   15/15 KB                         
8/156 KB   15/15 KB   
12/156 KB   15/15 KB   
16/156 KB   15/15 KB   
20/156 KB   15/15 KB   
24/156 KB   15/15 KB   
28/156 KB   15/15 KB   
32/156 KB   15/15 KB   
36/156 KB   15/15 KB   
40/156 KB   15/15 KB   
44/156 KB   15/15 KB   
48/156 KB   15/15 KB   
52/156 KB   15/15 KB   
56/156 KB   15/15 KB   
60/156 KB   15/15 KB   
64/156 KB   15/15 KB   
68/156 KB   15/15 KB   
72/156 KB   15/15 KB   
76/156 KB   15/15 KB   
80/156 KB   15/15 KB   
84/156 KB   15/15 KB   
88/156 KB   15/15 KB   
92/156 KB   15/15 KB   
96/156 KB   15/15 KB   
                       
Downloaded: http://repo.maven.apache.org/maven2/org/codehaus/groovy/maven/gmaven-common/1.0/gmaven-common-1.0.jar
(15 KB at 251.0 KB/sec)
100/156 KB             
104/156 KB   
108/156 KB   
112/156 KB   
116/156 KB   
120/156 KB   
124/156 KB   
128/156 KB   
132/156 KB   
136/156 KB   
140/156 KB   
144/156 KB   
148/156 KB   
152/156 KB   
156/156 KB   
156/156 KB   
             
Downloaded: http://repo.maven.apache.org/maven2/com/thoughtworks/qdox/qdox/1.8/qdox-1.8.jar
(156 KB at 1829.5 KB/sec)
[INFO] 
[INFO] --- maven-install-plugin:2.3:install (default-install) @ stacks-common ---
[INFO] Installing <https://builds.apache.org/job/Bigtop-trunk-test-execution/ws/bigtop-tests/test-execution/common/pom.xml>
to /home/jenkins/.m2/repository/org/apache/bigtop/itest/stacks-common/1.2.0-SNAPSHOT/stacks-common-1.2.0-SNAPSHOT.pom
[INFO] 
[INFO] --- maven-deploy-plugin:2.5:deploy (default-deploy) @ stacks-common ---
Downloading: https://repository.apache.org/content/repositories/snapshots/org/apache/bigtop/itest/stacks-common/1.2.0-SNAPSHOT/maven-metadata.xml
             
[WARNING] Could not transfer metadata org.apache.bigtop.itest:stacks-common:1.2.0-SNAPSHOT/maven-metadata.xml
from/to apache.snapshots.https (https://repository.apache.org/content/repositories/snapshots):
java.lang.RuntimeException: Could not generate DH keypair
[INFO] ------------------------------------------------------------------------
[INFO] Reactor Summary:
[INFO] 
[INFO] stacks-validation-common .......................... FAILURE [3.768s]
[INFO] smoke-tests-conf .................................. SKIPPED
[INFO] packagesmokes ..................................... SKIPPED
[INFO] bigtop-smokes ..................................... SKIPPED
[INFO] ------------------------------------------------------------------------
[INFO] BUILD FAILURE
[INFO] ------------------------------------------------------------------------
[INFO] Total time: 4.260s
[INFO] Finished at: Fri Jun 17 21:58:01 UTC 2016
[INFO] Final Memory: 10M/723M
[INFO] ------------------------------------------------------------------------
[ERROR] Failed to execute goal org.apache.maven.plugins:maven-deploy-plugin:2.5:deploy (default-deploy)
on project stacks-common: Failed to retrieve remote metadata org.apache.bigtop.itest:stacks-common:1.2.0-SNAPSHOT/maven-metadata.xml:
Could not transfer metadata org.apache.bigtop.itest:stacks-common:1.2.0-SNAPSHOT/maven-metadata.xml
from/to apache.snapshots.https (https://repository.apache.org/content/repositories/snapshots):
java.lang.RuntimeException: Could not generate DH keypair: Prime size must be multiple of
64, and can only range from 512 to 1024 (inclusive) -> [Help 1]
[ERROR] 
[ERROR] To see the full stack trace of the errors, re-run Maven with the -e switch.
[ERROR] Re-run Maven using the -X switch to enable full debug logging.
[ERROR] 
[ERROR] For more information about the errors and possible solutions, please read the following
articles:
[ERROR] [Help 1] http://cwiki.apache.org/confluence/display/MAVEN/MojoExecutionException
Build step 'Execute shell' marked build as failure

Mime
View raw message