bigtop-ci mailing list archives

Site index · List index
Message view « Date » · « Thread »
Top « Date » · « Thread »
From Apache Jenkins Server <jenk...@builds.apache.org>
Subject Build failed in Jenkins: Bigtop-trunk-test-execution #1901
Date Tue, 14 Jun 2016 11:03:20 GMT
See <https://builds.apache.org/job/Bigtop-trunk-test-execution/1901/changes>

Changes:

[ywkim] BIGTOP-2456 Update Apache Apex version to 3.4.0

------------------------------------------
[...truncated 3540 lines...]
6314/6807 KB   
6318/6807 KB   
6322/6807 KB   
6326/6807 KB   
6330/6807 KB   
6334/6807 KB   
6338/6807 KB   
6342/6807 KB   
6346/6807 KB   
6350/6807 KB   
6354/6807 KB   
6358/6807 KB   
6362/6807 KB   
6366/6807 KB   
6370/6807 KB   
6374/6807 KB   
6378/6807 KB   
6382/6807 KB   
6386/6807 KB   
6390/6807 KB   
6394/6807 KB   
6398/6807 KB   
6402/6807 KB   
6406/6807 KB   
6410/6807 KB   
6414/6807 KB   
6418/6807 KB   
6422/6807 KB   
6426/6807 KB   
6430/6807 KB   
6434/6807 KB   
6438/6807 KB   
6442/6807 KB   
6446/6807 KB   
6450/6807 KB   
6454/6807 KB   
6458/6807 KB   
6462/6807 KB   
6466/6807 KB   
6470/6807 KB   
6474/6807 KB   
6478/6807 KB   
6482/6807 KB   
6486/6807 KB   
6490/6807 KB   
6494/6807 KB   
6498/6807 KB   
6502/6807 KB   
6506/6807 KB   
6510/6807 KB   
6514/6807 KB   
6518/6807 KB   
6522/6807 KB   
6526/6807 KB   
6530/6807 KB   
6534/6807 KB   
6538/6807 KB   
6542/6807 KB   
6546/6807 KB   
6550/6807 KB   
6554/6807 KB   
6558/6807 KB   
6562/6807 KB   
6566/6807 KB   
6570/6807 KB   
6574/6807 KB   
6578/6807 KB   
6582/6807 KB   
6586/6807 KB   
6590/6807 KB   
6594/6807 KB   
6598/6807 KB   
6602/6807 KB   
6606/6807 KB   
6610/6807 KB   
6614/6807 KB   
6618/6807 KB   
6622/6807 KB   
6626/6807 KB   
6630/6807 KB   
6634/6807 KB   
6638/6807 KB   
6642/6807 KB   
6646/6807 KB   
6650/6807 KB   
6654/6807 KB   
6658/6807 KB   
6662/6807 KB   
6666/6807 KB   
6670/6807 KB   
6674/6807 KB   
6678/6807 KB   
6682/6807 KB   
6686/6807 KB   
6690/6807 KB   
6694/6807 KB   
6698/6807 KB   
6702/6807 KB   
6706/6807 KB   
6710/6807 KB   
6714/6807 KB   
6718/6807 KB   
6722/6807 KB   
6726/6807 KB   
6730/6807 KB   
6734/6807 KB   
6738/6807 KB   
6742/6807 KB   
6746/6807 KB   
6750/6807 KB   
6754/6807 KB   
6758/6807 KB   
6762/6807 KB   
6766/6807 KB   
6770/6807 KB   
6774/6807 KB   
6778/6807 KB   
6782/6807 KB   
6786/6807 KB   
6790/6807 KB   
6794/6807 KB   
6798/6807 KB   
6802/6807 KB   
6806/6807 KB   
6807/6807 KB   
               
Downloaded: http://repo.maven.apache.org/maven2/org/codehaus/groovy/groovy-all/2.4.3/groovy-all-2.4.3.jar
(6807 KB at 26279.2 KB/sec)
[INFO] 
[INFO] --- maven-install-plugin:2.3:install (default-install) @ stacks-common ---
Downloading: http://repo.maven.apache.org/maven2/org/codehaus/plexus/plexus-utils/1.5.6/plexus-utils-1.5.6.pom
4/6 KB         
6/6 KB   
         
Downloaded: http://repo.maven.apache.org/maven2/org/codehaus/plexus/plexus-utils/1.5.6/plexus-utils-1.5.6.pom
(6 KB at 152.3 KB/sec)
Downloading: http://repo.maven.apache.org/maven2/org/codehaus/plexus/plexus/1.0.12/plexus-1.0.12.pom
4/10 KB   
8/10 KB   
10/10 KB   
           
Downloaded: http://repo.maven.apache.org/maven2/org/codehaus/plexus/plexus/1.0.12/plexus-1.0.12.pom
(10 KB at 281.5 KB/sec)
Downloading: http://repo.maven.apache.org/maven2/org/codehaus/plexus/plexus-digest/1.0/plexus-digest-1.0.pom
2/2 KB     
         
Downloaded: http://repo.maven.apache.org/maven2/org/codehaus/plexus/plexus-digest/1.0/plexus-digest-1.0.pom
(2 KB at 31.3 KB/sec)
Downloading: http://repo.maven.apache.org/maven2/org/codehaus/plexus/plexus-components/1.1.7/plexus-components-1.1.7.pom
4/5 KB   
5/5 KB   
         
Downloaded: http://repo.maven.apache.org/maven2/org/codehaus/plexus/plexus-components/1.1.7/plexus-components-1.1.7.pom
(5 KB at 142.9 KB/sec)
Downloading: http://repo.maven.apache.org/maven2/org/codehaus/plexus/plexus-utils/1.5.6/plexus-utils-1.5.6.jar
Downloading: http://repo.maven.apache.org/maven2/org/codehaus/plexus/plexus-digest/1.0/plexus-digest-1.0.jar
4/12 KB   
8/12 KB   
12/12 KB   
12/12 KB   
4/245 KB   12/12 KB   
8/245 KB   12/12 KB   
12/245 KB   12/12 KB   
16/245 KB   12/12 KB   
20/245 KB   12/12 KB   
24/245 KB   12/12 KB   
28/245 KB   12/12 KB   
32/245 KB   12/12 KB   
36/245 KB   12/12 KB   
40/245 KB   12/12 KB   
44/245 KB   12/12 KB   
48/245 KB   12/12 KB   
52/245 KB   12/12 KB   
56/245 KB   12/12 KB   
60/245 KB   12/12 KB   
64/245 KB   12/12 KB   
68/245 KB   12/12 KB   
72/245 KB   12/12 KB   
76/245 KB   12/12 KB   
80/245 KB   12/12 KB   
84/245 KB   12/12 KB   
88/245 KB   12/12 KB   
92/245 KB   12/12 KB   
96/245 KB   12/12 KB   
100/245 KB   12/12 KB   
104/245 KB   12/12 KB   
108/245 KB   12/12 KB   
112/245 KB   12/12 KB   
116/245 KB   12/12 KB   
120/245 KB   12/12 KB   
124/245 KB   12/12 KB   
128/245 KB   12/12 KB   
132/245 KB   12/12 KB   
136/245 KB   12/12 KB   
140/245 KB   12/12 KB   
144/245 KB   12/12 KB   
148/245 KB   12/12 KB   
152/245 KB   12/12 KB   
156/245 KB   12/12 KB   
160/245 KB   12/12 KB   
164/245 KB   12/12 KB   
168/245 KB   12/12 KB   
172/245 KB   12/12 KB   
176/245 KB   12/12 KB   
180/245 KB   12/12 KB   
184/245 KB   12/12 KB   
188/245 KB   12/12 KB   
192/245 KB   12/12 KB   
196/245 KB   12/12 KB   
200/245 KB   12/12 KB   
204/245 KB   12/12 KB   
208/245 KB   12/12 KB   
212/245 KB   12/12 KB   
216/245 KB   12/12 KB   
220/245 KB   12/12 KB   
224/245 KB   12/12 KB   
228/245 KB   12/12 KB   
232/245 KB   12/12 KB   
236/245 KB   12/12 KB   
240/245 KB   12/12 KB   
244/245 KB   12/12 KB   
245/245 KB   12/12 KB   
                        
Downloaded: http://repo.maven.apache.org/maven2/org/codehaus/plexus/plexus-digest/1.0/plexus-digest-1.0.jar
(12 KB at 340.6 KB/sec)
                        
Downloaded: http://repo.maven.apache.org/maven2/org/codehaus/plexus/plexus-utils/1.5.6/plexus-utils-1.5.6.jar
(245 KB at 5205.8 KB/sec)
[INFO] Installing <https://builds.apache.org/job/Bigtop-trunk-test-execution/ws/bigtop-tests/test-execution/common/pom.xml>
to /home/jenkins/.m2/repository/org/apache/bigtop/itest/stacks-common/1.2.0-SNAPSHOT/stacks-common-1.2.0-SNAPSHOT.pom
[INFO] 
[INFO] --- maven-deploy-plugin:2.5:deploy (default-deploy) @ stacks-common ---
Downloading: https://repository.apache.org/content/repositories/snapshots/org/apache/bigtop/itest/stacks-common/1.2.0-SNAPSHOT/maven-metadata.xml
                        
[WARNING] Could not transfer metadata org.apache.bigtop.itest:stacks-common:1.2.0-SNAPSHOT/maven-metadata.xml
from/to apache.snapshots.https (https://repository.apache.org/content/repositories/snapshots):
java.lang.RuntimeException: Could not generate DH keypair
[INFO] ------------------------------------------------------------------------
[INFO] Reactor Summary:
[INFO] 
[INFO] stacks-validation-common .......................... FAILURE [8.321s]
[INFO] smoke-tests-conf .................................. SKIPPED
[INFO] packagesmokes ..................................... SKIPPED
[INFO] bigtop-smokes ..................................... SKIPPED
[INFO] ------------------------------------------------------------------------
[INFO] BUILD FAILURE
[INFO] ------------------------------------------------------------------------
[INFO] Total time: 8.770s
[INFO] Finished at: Tue Jun 14 11:03:19 UTC 2016
[INFO] Final Memory: 9M/54M
[INFO] ------------------------------------------------------------------------
[ERROR] Failed to execute goal org.apache.maven.plugins:maven-deploy-plugin:2.5:deploy (default-deploy)
on project stacks-common: Failed to retrieve remote metadata org.apache.bigtop.itest:stacks-common:1.2.0-SNAPSHOT/maven-metadata.xml:
Could not transfer metadata org.apache.bigtop.itest:stacks-common:1.2.0-SNAPSHOT/maven-metadata.xml
from/to apache.snapshots.https (https://repository.apache.org/content/repositories/snapshots):
java.lang.RuntimeException: Could not generate DH keypair: Prime size must be multiple of
64, and can only range from 512 to 1024 (inclusive) -> [Help 1]
[ERROR] 
[ERROR] To see the full stack trace of the errors, re-run Maven with the -e switch.
[ERROR] Re-run Maven using the -X switch to enable full debug logging.
[ERROR] 
[ERROR] For more information about the errors and possible solutions, please read the following
articles:
[ERROR] [Help 1] http://cwiki.apache.org/confluence/display/MAVEN/MojoExecutionException
Build step 'Execute shell' marked build as failure

Mime
View raw message